[JENKINS] Lucene-Solr-trunk-Linux (32bit/jdk1.7.0_60-ea-b15) - Build # 10267 - Failure!

classic Classic list List threaded Threaded
1 message Options
Reply | Threaded
Open this post in threaded view
|

[JENKINS] Lucene-Solr-trunk-Linux (32bit/jdk1.7.0_60-ea-b15) - Build # 10267 - Failure!

Policeman Jenkins Server-2
Build: http://jenkins.thetaphi.de/job/Lucene-Solr-trunk-Linux/10267/
Java: 32bit/jdk1.7.0_60-ea-b15 -client -XX:+UseParallelGC

1 tests failed.
REGRESSION:  org.apache.lucene.index.TestIndexWriterDelete.testDeleteAllNoDeadLock

Error Message:
Captured an uncaught exception in thread: Thread[id=1630, name=Thread-1393, state=RUNNABLE, group=TGRP-TestIndexWriterDelete]

Stack Trace:
com.carrotsearch.randomizedtesting.UncaughtExceptionError: Captured an uncaught exception in thread: Thread[id=1630, name=Thread-1393, state=RUNNABLE, group=TGRP-TestIndexWriterDelete]
Caused by: java.lang.RuntimeException: java.lang.IllegalArgumentException: at least one of ramBufferSize and maxBufferedDocs must be enabled
        at __randomizedtesting.SeedInfo.seed([4B0F534D71E63B81]:0)
        at org.apache.lucene.index.TestIndexWriterDelete$1.run(TestIndexWriterDelete.java:339)
Caused by: java.lang.IllegalArgumentException: at least one of ramBufferSize and maxBufferedDocs must be enabled
        at org.apache.lucene.index.LiveIndexWriterConfig.setRAMBufferSizeMB(LiveIndexWriterConfig.java:257)
        at org.apache.lucene.util.LuceneTestCase.maybeChangeLiveIndexWriterConfig(LuceneTestCase.java:1055)
        at org.apache.lucene.index.RandomIndexWriter.addDocument(RandomIndexWriter.java:113)
        at org.apache.lucene.index.RandomIndexWriter.addDocument(RandomIndexWriter.java:109)
        at org.apache.lucene.index.TestIndexWriterDelete$1.run(TestIndexWriterDelete.java:333)




Build Log:
[...truncated 1169 lines...]
   [junit4] Suite: org.apache.lucene.index.TestIndexWriterDelete
   [junit4]   2> NOTE: reproduce with: ant test  -Dtestcase=TestIndexWriterDelete -Dtests.method=testDeleteAllNoDeadLock -Dtests.seed=4B0F534D71E63B81 -Dtests.multiplier=3 -Dtests.slow=true -Dtests.locale=ja_JP -Dtests.timezone=Canada/Mountain -Dtests.file.encoding=US-ASCII
   [junit4] ERROR   0.23s J1 | TestIndexWriterDelete.testDeleteAllNoDeadLock <<<
   [junit4]    > Throwable #1: com.carrotsearch.randomizedtesting.UncaughtExceptionError: Captured an uncaught exception in thread: Thread[id=1630, name=Thread-1393, state=RUNNABLE, group=TGRP-TestIndexWriterDelete]
   [junit4]    > Caused by: java.lang.RuntimeException: java.lang.IllegalArgumentException: at least one of ramBufferSize and maxBufferedDocs must be enabled
   [junit4]    > at __randomizedtesting.SeedInfo.seed([4B0F534D71E63B81]:0)
   [junit4]    > at org.apache.lucene.index.TestIndexWriterDelete$1.run(TestIndexWriterDelete.java:339)
   [junit4]    > Caused by: java.lang.IllegalArgumentException: at least one of ramBufferSize and maxBufferedDocs must be enabled
   [junit4]    > at org.apache.lucene.index.LiveIndexWriterConfig.setRAMBufferSizeMB(LiveIndexWriterConfig.java:257)
   [junit4]    > at org.apache.lucene.util.LuceneTestCase.maybeChangeLiveIndexWriterConfig(LuceneTestCase.java:1055)
   [junit4]    > at org.apache.lucene.index.RandomIndexWriter.addDocument(RandomIndexWriter.java:113)
   [junit4]    > at org.apache.lucene.index.RandomIndexWriter.addDocument(RandomIndexWriter.java:109)
   [junit4]    > at org.apache.lucene.index.TestIndexWriterDelete$1.run(TestIndexWriterDelete.java:333)Throwable #2: com.carrotsearch.randomizedtesting.UncaughtExceptionError: Captured an uncaught exception in thread: Thread[id=1628, name=Thread-1391, state=RUNNABLE, group=TGRP-TestIndexWriterDelete]
   [junit4]    > Caused by: java.lang.RuntimeException: java.lang.IllegalArgumentException: at least one of ramBufferSize and maxBufferedDocs must be enabled
   [junit4]    > at __randomizedtesting.SeedInfo.seed([4B0F534D71E63B81]:0)
   [junit4]    > at org.apache.lucene.index.TestIndexWriterDelete$1.run(TestIndexWriterDelete.java:339)
   [junit4]    > Caused by: java.lang.IllegalArgumentException: at least one of ramBufferSize and maxBufferedDocs must be enabled
   [junit4]    > at org.apache.lucene.index.LiveIndexWriterConfig.setRAMBufferSizeMB(LiveIndexWriterConfig.java:257)
   [junit4]    > at org.apache.lucene.util.LuceneTestCase.maybeChangeLiveIndexWriterConfig(LuceneTestCase.java:1055)
   [junit4]    > at org.apache.lucene.index.RandomIndexWriter.addDocument(RandomIndexWriter.java:108)
   [junit4]    > at org.apache.lucene.index.TestIndexWriterDelete$1.run(TestIndexWriterDelete.java:333)
   [junit4] IGNOR/A 0.00s J1 | TestIndexWriterDelete.testApplyDeletesOnFlush
   [junit4]    > Assumption #1: 'nightly' test group is disabled (@Nightly())
   [junit4]   2> NOTE: test params are: codec=Lucene46: {id=PostingsFormat(name=FSTPulsing41), city=PostingsFormat(name=FSTPulsing41), field=Pulsing41(freqCutoff=8 minBlockSize=38 maxBlockSize=149), value=PostingsFormat(name=Asserting), contents=Pulsing41(freqCutoff=8 minBlockSize=38 maxBlockSize=149), content=PostingsFormat(name=Asserting)}, docValues:{dv=DocValuesFormat(name=Asserting)}, sim=DefaultSimilarity, locale=ja_JP, timezone=Canada/Mountain
   [junit4]   2> NOTE: Linux 3.8.0-39-generic i386/Oracle Corporation 1.7.0_60-ea (32-bit)/cpus=8,threads=1,free=119465824,total=270008320
   [junit4]   2> NOTE: All tests run in this JVM: [Nested, TestBitVector, Nested1, TestSearch, TestCodecs, TestIndexWriterMergePolicy, TestCharFilter, TestIntsRef, TestNoDeletionPolicy, TestOpenBitSet, TestSpans, TestHugeRamFile, TestInPlaceMergeSorter, TestWildcardRandom, TestMixedCodecs, TestAtomicUpdate, TestTermScorer, TestMultiThreadTermVectors, TestNIOFSDirectory, TestConsistentFieldNumbers, TestMultiFields, TestMultiDocValues, TestNewestSegment, TestIdentityHashSet, TestSortDocValues, TestPackedTokenAttributeImpl, TestMockDirectoryWrapper, TestOmitNorms, TestSimpleSearchEquivalence, TestBlockPostingsFormat2, TestLiveFieldValues, TestNRTCachingDirectory, ThrowInUncaught, TestIndexWriterNRTIsCurrent, TestBufferedIndexInput, TestThreadedForceMerge, TestFSTs, TestIndexWriterWithThreads, TestIndexFileDeleter, TestSimilarityBase, TestHighCompressionMode, TestMultiMMap, TestFieldMaskingSpanQuery, Test2BDocs, TestWindowsMMap, TestSpanSearchEquivalence, TestDocCount, NestedSetupChain, NestedTeardownChain, TestDocTermOrdsRangeFilter, TestAutomatonQuery, TestRecyclingByteBlockAllocator, Nested1, Nested2, Nested3, TestTerm, TestFieldInfos, TestSnapshotDeletionPolicy, TestCachingCollector, TestLogMergePolicy, TestLazyProxSkipping, TestSpanExplanations, TestIndexWriterConfig, TestForTooMuchCloning, TestSubScorerFreqs, TestForUtil, TestUnicodeUtil, TestNumericUtils, TestDateTools, Nested, TestRegexpRandom2, TestCompressingStoredFieldsFormat, TestDocumentWriter, TestSpanExplanationsOfNonMatches, TestFieldCache, TestIndexInput, TestVersionComparator, TestPerFieldPostingsFormat, TestRegexpRandom, TestPayloadExplanations, TestIndexSearcher, TestSimilarity2, TestByteBlockPool, InBeforeClass, InAfterClass, InTestMethod, NonStringProperties, TestDocValuesFormat, TestLucene40StoredFieldsFormat, TestPositionIncrement, TestPayloadSpans, TestTopDocsCollector, TestTermVectorsFormat, TestNorms, TestPayloadsOnVectors, TestDocumentsWriterDeleteQueue, TestIndexWriterExceptions, TestMinimize, TestPrefixCodedTerms, TestNearSpansOrdered, TestTermVectorsReader, TestDocument, TestSegmentMerger, TestPForDeltaDocIdSet, TestIndexWriter, TestPerFieldDocValuesFormat, TestLucene40TermVectorsFormat, TestIndexWriterMerging, TestBytesStore, TestLucene42DocValuesFormat, TestDeletionPolicy, TestIndexWriterDelete]
   [junit4] Completed on J1 in 6.39s, 22 tests, 1 error, 1 skipped <<< FAILURES!

[...truncated 589 lines...]
BUILD FAILED
/mnt/ssd/jenkins/workspace/Lucene-Solr-trunk-Linux/build.xml:467: The following error occurred while executing this line:
/mnt/ssd/jenkins/workspace/Lucene-Solr-trunk-Linux/build.xml:447: The following error occurred while executing this line:
/mnt/ssd/jenkins/workspace/Lucene-Solr-trunk-Linux/build.xml:45: The following error occurred while executing this line:
/mnt/ssd/jenkins/workspace/Lucene-Solr-trunk-Linux/extra-targets.xml:37: The following error occurred while executing this line:
/mnt/ssd/jenkins/workspace/Lucene-Solr-trunk-Linux/lucene/build.xml:49: The following error occurred while executing this line:
/mnt/ssd/jenkins/workspace/Lucene-Solr-trunk-Linux/lucene/common-build.xml:1296: The following error occurred while executing this line:
/mnt/ssd/jenkins/workspace/Lucene-Solr-trunk-Linux/lucene/common-build.xml:920: There were test failures: 396 suites, 3082 tests, 1 error, 97 ignored (87 assumptions)

Total time: 19 minutes 52 seconds
Build step 'Invoke Ant' marked build as failure
Description set: Java: 32bit/jdk1.7.0_60-ea-b15 -client -XX:+UseParallelGC
Archiving artifacts
Recording test results
Email was triggered for: Failure
Sending email for trigger: Failure




---------------------------------------------------------------------
To unsubscribe, e-mail: [hidden email]
For additional commands, e-mail: [hidden email]