[JENKINS] Lucene-Solr-trunk-Linux (64bit/jdk1.7.0_25) - Build # 6844 - Failure!

classic Classic list List threaded Threaded
2 messages Options
Reply | Threaded
Open this post in threaded view
|

[JENKINS] Lucene-Solr-trunk-Linux (64bit/jdk1.7.0_25) - Build # 6844 - Failure!

Policeman Jenkins Server-2
Build: http://jenkins.thetaphi.de/job/Lucene-Solr-trunk-Linux/6844/
Java: 64bit/jdk1.7.0_25 -XX:+UseCompressedOops -XX:+UseSerialGC

1 tests failed.
FAILED:  org.apache.solr.cloud.CollectionsAPIDistributedZkTest.testDistribSearch

Error Message:
Server refused connection at: http://127.0.0.1:39094

Stack Trace:
org.apache.solr.client.solrj.SolrServerException: Server refused connection at: http://127.0.0.1:39094
        at __randomizedtesting.SeedInfo.seed([7FB59B654EE1C35F:FE53157D39BEA363]:0)
        at org.apache.solr.client.solrj.impl.HttpSolrServer.request(HttpSolrServer.java:428)
        at org.apache.solr.client.solrj.impl.HttpSolrServer.request(HttpSolrServer.java:180)
        at org.apache.solr.cloud.AbstractFullDistribZkTestBase.createCollection(AbstractFullDistribZkTestBase.java:1535)
        at org.apache.solr.cloud.CollectionsAPIDistributedZkTest.testCustomCollectionsAPI(CollectionsAPIDistributedZkTest.java:677)
        at org.apache.solr.cloud.CollectionsAPIDistributedZkTest.doTest(CollectionsAPIDistributedZkTest.java:159)
        at org.apache.solr.BaseDistributedSearchTestCase.testDistribSearch(BaseDistributedSearchTestCase.java:835)
        at sun.reflect.NativeMethodAccessorImpl.invoke0(Native Method)
        at sun.reflect.NativeMethodAccessorImpl.invoke(NativeMethodAccessorImpl.java:57)
        at sun.reflect.DelegatingMethodAccessorImpl.invoke(DelegatingMethodAccessorImpl.java:43)
        at java.lang.reflect.Method.invoke(Method.java:606)
        at com.carrotsearch.randomizedtesting.RandomizedRunner.invoke(RandomizedRunner.java:1559)
        at com.carrotsearch.randomizedtesting.RandomizedRunner.access$600(RandomizedRunner.java:79)
        at com.carrotsearch.randomizedtesting.RandomizedRunner$6.evaluate(RandomizedRunner.java:737)
        at com.carrotsearch.randomizedtesting.RandomizedRunner$7.evaluate(RandomizedRunner.java:773)
        at com.carrotsearch.randomizedtesting.RandomizedRunner$8.evaluate(RandomizedRunner.java:787)
        at com.carrotsearch.randomizedtesting.rules.SystemPropertiesRestoreRule$1.evaluate(SystemPropertiesRestoreRule.java:53)
        at org.apache.lucene.util.TestRuleSetupTeardownChained$1.evaluate(TestRuleSetupTeardownChained.java:50)
        at org.apache.lucene.util.TestRuleFieldCacheSanity$1.evaluate(TestRuleFieldCacheSanity.java:51)
        at org.apache.lucene.util.AbstractBeforeAfterRule$1.evaluate(AbstractBeforeAfterRule.java:46)
        at com.carrotsearch.randomizedtesting.rules.SystemPropertiesInvariantRule$1.evaluate(SystemPropertiesInvariantRule.java:55)
        at org.apache.lucene.util.TestRuleThreadAndTestName$1.evaluate(TestRuleThreadAndTestName.java:49)
        at org.apache.lucene.util.TestRuleIgnoreAfterMaxFailures$1.evaluate(TestRuleIgnoreAfterMaxFailures.java:70)
        at org.apache.lucene.util.TestRuleMarkFailure$1.evaluate(TestRuleMarkFailure.java:48)
        at com.carrotsearch.randomizedtesting.rules.StatementAdapter.evaluate(StatementAdapter.java:36)
        at com.carrotsearch.randomizedtesting.ThreadLeakControl$StatementRunner.run(ThreadLeakControl.java:358)
        at com.carrotsearch.randomizedtesting.ThreadLeakControl.forkTimeoutingTask(ThreadLeakControl.java:782)
        at com.carrotsearch.randomizedtesting.ThreadLeakControl$3.evaluate(ThreadLeakControl.java:442)
        at com.carrotsearch.randomizedtesting.RandomizedRunner.runSingleTest(RandomizedRunner.java:746)
        at com.carrotsearch.randomizedtesting.RandomizedRunner$3.evaluate(RandomizedRunner.java:648)
        at com.carrotsearch.randomizedtesting.RandomizedRunner$4.evaluate(RandomizedRunner.java:682)
        at com.carrotsearch.randomizedtesting.RandomizedRunner$5.evaluate(RandomizedRunner.java:693)
        at com.carrotsearch.randomizedtesting.rules.StatementAdapter.evaluate(StatementAdapter.java:36)
        at com.carrotsearch.randomizedtesting.rules.SystemPropertiesRestoreRule$1.evaluate(SystemPropertiesRestoreRule.java:53)
        at org.apache.lucene.util.AbstractBeforeAfterRule$1.evaluate(AbstractBeforeAfterRule.java:46)
        at org.apache.lucene.util.TestRuleStoreClassName$1.evaluate(TestRuleStoreClassName.java:42)
        at com.carrotsearch.randomizedtesting.rules.SystemPropertiesInvariantRule$1.evaluate(SystemPropertiesInvariantRule.java:55)
        at com.carrotsearch.randomizedtesting.rules.NoShadowingOrOverridesOnMethodsRule$1.evaluate(NoShadowingOrOverridesOnMethodsRule.java:39)
        at com.carrotsearch.randomizedtesting.rules.NoShadowingOrOverridesOnMethodsRule$1.evaluate(NoShadowingOrOverridesOnMethodsRule.java:39)
        at com.carrotsearch.randomizedtesting.rules.StatementAdapter.evaluate(StatementAdapter.java:36)
        at org.apache.lucene.util.TestRuleAssertionsRequired$1.evaluate(TestRuleAssertionsRequired.java:43)
        at org.apache.lucene.util.TestRuleMarkFailure$1.evaluate(TestRuleMarkFailure.java:48)
        at org.apache.lucene.util.TestRuleIgnoreAfterMaxFailures$1.evaluate(TestRuleIgnoreAfterMaxFailures.java:70)
        at org.apache.lucene.util.TestRuleIgnoreTestSuites$1.evaluate(TestRuleIgnoreTestSuites.java:55)
        at com.carrotsearch.randomizedtesting.rules.StatementAdapter.evaluate(StatementAdapter.java:36)
        at com.carrotsearch.randomizedtesting.ThreadLeakControl$StatementRunner.run(ThreadLeakControl.java:358)
        at java.lang.Thread.run(Thread.java:724)
Caused by: org.apache.http.conn.HttpHostConnectException: Connection to http://127.0.0.1:39094 refused
        at org.apache.http.impl.conn.DefaultClientConnectionOperator.openConnection(DefaultClientConnectionOperator.java:190)
        at org.apache.http.impl.conn.ManagedClientConnectionImpl.open(ManagedClientConnectionImpl.java:294)
        at org.apache.http.impl.client.DefaultRequestDirector.tryConnect(DefaultRequestDirector.java:645)
        at org.apache.http.impl.client.DefaultRequestDirector.execute(DefaultRequestDirector.java:480)
        at org.apache.http.impl.client.AbstractHttpClient.execute(AbstractHttpClient.java:906)
        at org.apache.http.impl.client.AbstractHttpClient.execute(AbstractHttpClient.java:805)
        at org.apache.http.impl.client.AbstractHttpClient.execute(AbstractHttpClient.java:784)
        at org.apache.solr.client.solrj.impl.HttpSolrServer.request(HttpSolrServer.java:365)
        ... 45 more
Caused by: java.net.ConnectException: Connection refused
        at java.net.PlainSocketImpl.socketConnect(Native Method)
        at java.net.AbstractPlainSocketImpl.doConnect(AbstractPlainSocketImpl.java:339)
        at java.net.AbstractPlainSocketImpl.connectToAddress(AbstractPlainSocketImpl.java:200)
        at java.net.AbstractPlainSocketImpl.connect(AbstractPlainSocketImpl.java:182)
        at java.net.SocksSocketImpl.connect(SocksSocketImpl.java:392)
        at java.net.Socket.connect(Socket.java:579)
        at org.apache.http.conn.scheme.PlainSocketFactory.connectSocket(PlainSocketFactory.java:127)
        at org.apache.http.impl.conn.DefaultClientConnectionOperator.openConnection(DefaultClientConnectionOperator.java:180)
        ... 52 more




Build Log:
[...truncated 9655 lines...]
   [junit4] Suite: org.apache.solr.cloud.CollectionsAPIDistributedZkTest
   [junit4]   2> 252938 T804 oas.BaseDistributedSearchTestCase.initHostContext Setting hostContext system property: /
   [junit4]   2> 252943 T804 oas.SolrTestCaseJ4.setUp ###Starting testDistribSearch
   [junit4]   2> Creating dataDir: /mnt/ssd/jenkins/workspace/Lucene-Solr-trunk-Linux/solr/build/solr-core/test/J1/./solrtest-CollectionsAPIDistributedZkTest-1375445000128
   [junit4]   2> 252944 T804 oasc.ZkTestServer.run STARTING ZK TEST SERVER
   [junit4]   2> 252944 T805 oasc.ZkTestServer$ZKServerMain.runFromConfig Starting server
   [junit4]   2> 253044 T804 oasc.ZkTestServer.run start zk server on port:52907
   [junit4]   2> 253046 T804 oascc.ConnectionManager.waitForConnected Waiting for client to connect to ZooKeeper
   [junit4]   2> 253210 T811 oascc.ConnectionManager.process Watcher org.apache.solr.common.cloud.ConnectionManager@7a1c94ba name:ZooKeeperConnection Watcher:127.0.0.1:52907 got event WatchedEvent state:SyncConnected type:None path:null path:null type:None
   [junit4]   2> 253210 T804 oascc.ConnectionManager.waitForConnected Client is connected to ZooKeeper
   [junit4]   2> 253211 T804 oascc.SolrZkClient.makePath makePath: /solr
   [junit4]   2> 253215 T804 oascc.ConnectionManager.waitForConnected Waiting for client to connect to ZooKeeper
   [junit4]   2> 253216 T813 oascc.ConnectionManager.process Watcher org.apache.solr.common.cloud.ConnectionManager@57e343f2 name:ZooKeeperConnection Watcher:127.0.0.1:52907/solr got event WatchedEvent state:SyncConnected type:None path:null path:null type:None
   [junit4]   2> 253216 T804 oascc.ConnectionManager.waitForConnected Client is connected to ZooKeeper
   [junit4]   2> 253216 T804 oascc.SolrZkClient.makePath makePath: /collections/collection1
   [junit4]   2> 253219 T804 oascc.SolrZkClient.makePath makePath: /collections/collection1/shards
   [junit4]   2> 253222 T804 oascc.SolrZkClient.makePath makePath: /collections/control_collection
   [junit4]   2> 253224 T804 oascc.SolrZkClient.makePath makePath: /collections/control_collection/shards
   [junit4]   2> 253226 T804 oasc.AbstractZkTestCase.putConfig put /mnt/ssd/jenkins/workspace/Lucene-Solr-trunk-Linux/solr/build/solr-core/test-files/solr/collection1/conf/solrconfig-tlog.xml to /configs/conf1/solrconfig.xml
   [junit4]   2> 253227 T804 oascc.SolrZkClient.makePath makePath: /configs/conf1/solrconfig.xml
   [junit4]   2> 253231 T804 oasc.AbstractZkTestCase.putConfig put /mnt/ssd/jenkins/workspace/Lucene-Solr-trunk-Linux/solr/build/solr-core/test-files/solr/collection1/conf/schema.xml to /configs/conf1/schema.xml
   [junit4]   2> 253232 T804 oascc.SolrZkClient.makePath makePath: /configs/conf1/schema.xml
   [junit4]   2> 253235 T804 oasc.AbstractZkTestCase.putConfig put /mnt/ssd/jenkins/workspace/Lucene-Solr-trunk-Linux/solr/build/solr-core/test-files/solr/collection1/conf/stopwords.txt to /configs/conf1/stopwords.txt
   [junit4]   2> 253235 T804 oascc.SolrZkClient.makePath makePath: /configs/conf1/stopwords.txt
   [junit4]   2> 253238 T804 oasc.AbstractZkTestCase.putConfig put /mnt/ssd/jenkins/workspace/Lucene-Solr-trunk-Linux/solr/build/solr-core/test-files/solr/collection1/conf/protwords.txt to /configs/conf1/protwords.txt
   [junit4]   2> 253238 T804 oascc.SolrZkClient.makePath makePath: /configs/conf1/protwords.txt
   [junit4]   2> 253241 T804 oasc.AbstractZkTestCase.putConfig put /mnt/ssd/jenkins/workspace/Lucene-Solr-trunk-Linux/solr/build/solr-core/test-files/solr/collection1/conf/currency.xml to /configs/conf1/currency.xml
   [junit4]   2> 253241 T804 oascc.SolrZkClient.makePath makePath: /configs/conf1/currency.xml
   [junit4]   2> 253243 T804 oasc.AbstractZkTestCase.putConfig put /mnt/ssd/jenkins/workspace/Lucene-Solr-trunk-Linux/solr/build/solr-core/test-files/solr/collection1/conf/open-exchange-rates.json to /configs/conf1/open-exchange-rates.json
   [junit4]   2> 253243 T804 oascc.SolrZkClient.makePath makePath: /configs/conf1/open-exchange-rates.json
   [junit4]   2> 253246 T804 oasc.AbstractZkTestCase.putConfig put /mnt/ssd/jenkins/workspace/Lucene-Solr-trunk-Linux/solr/build/solr-core/test-files/solr/collection1/conf/mapping-ISOLatin1Accent.txt to /configs/conf1/mapping-ISOLatin1Accent.txt
   [junit4]   2> 253246 T804 oascc.SolrZkClient.makePath makePath: /configs/conf1/mapping-ISOLatin1Accent.txt
   [junit4]   2> 253248 T804 oasc.AbstractZkTestCase.putConfig put /mnt/ssd/jenkins/workspace/Lucene-Solr-trunk-Linux/solr/build/solr-core/test-files/solr/collection1/conf/old_synonyms.txt to /configs/conf1/old_synonyms.txt
   [junit4]   2> 253248 T804 oascc.SolrZkClient.makePath makePath: /configs/conf1/old_synonyms.txt
   [junit4]   2> 253250 T804 oasc.AbstractZkTestCase.putConfig put /mnt/ssd/jenkins/workspace/Lucene-Solr-trunk-Linux/solr/build/solr-core/test-files/solr/collection1/conf/synonyms.txt to /configs/conf1/synonyms.txt
   [junit4]   2> 253251 T804 oascc.SolrZkClient.makePath makePath: /configs/conf1/synonyms.txt
   [junit4]   2> 253323 T804 oejs.Server.doStart jetty-8.1.10.v20130312
   [junit4]   2> 253339 T804 oejs.AbstractConnector.doStart Started SelectChannelConnector@127.0.0.1:59243
   [junit4]   2> 253340 T804 oass.SolrDispatchFilter.init SolrDispatchFilter.init()
   [junit4]   2> 253340 T804 oasc.SolrResourceLoader.locateSolrHome JNDI not configured for solr (NoInitialContextEx)
   [junit4]   2> 253341 T804 oasc.SolrResourceLoader.locateSolrHome using system property solr.solr.home: /mnt/ssd/jenkins/workspace/Lucene-Solr-trunk-Linux/solr/build/solr-core/test/J1/./org.apache.solr.cloud.CollectionsAPIDistributedZkTest-controljetty-1375445000437
   [junit4]   2> 253341 T804 oasc.SolrResourceLoader.<init> new SolrResourceLoader for directory: '/mnt/ssd/jenkins/workspace/Lucene-Solr-trunk-Linux/solr/build/solr-core/test/J1/./org.apache.solr.cloud.CollectionsAPIDistributedZkTest-controljetty-1375445000437/'
   [junit4]   2> 253350 T804 oasc.ConfigSolr.fromFile Loading container configuration from /mnt/ssd/jenkins/workspace/Lucene-Solr-trunk-Linux/solr/build/solr-core/test/J1/./org.apache.solr.cloud.CollectionsAPIDistributedZkTest-controljetty-1375445000437/solr.xml
   [junit4]   2> 253389 T804 oasc.ConfigSolrXml.<init> Config-defined core root directory:
   [junit4]   2> 253389 T804 oasc.CoreContainer.<init> New CoreContainer 485516078
   [junit4]   2> 253390 T804 oasc.CoreContainer.load Loading cores into CoreContainer [instanceDir=/mnt/ssd/jenkins/workspace/Lucene-Solr-trunk-Linux/solr/build/solr-core/test/J1/./org.apache.solr.cloud.CollectionsAPIDistributedZkTest-controljetty-1375445000437/]
   [junit4]   2> 253391 T804 oashc.HttpShardHandlerFactory.getParameter Setting socketTimeout to: 120000
   [junit4]   2> 253391 T804 oashc.HttpShardHandlerFactory.getParameter Setting urlScheme to: http://
   [junit4]   2> 253391 T804 oashc.HttpShardHandlerFactory.getParameter Setting connTimeout to: 15000
   [junit4]   2> 253391 T804 oashc.HttpShardHandlerFactory.getParameter Setting maxConnectionsPerHost to: 20
   [junit4]   2> 253392 T804 oashc.HttpShardHandlerFactory.getParameter Setting corePoolSize to: 0
   [junit4]   2> 253392 T804 oashc.HttpShardHandlerFactory.getParameter Setting maximumPoolSize to: 2147483647
   [junit4]   2> 253392 T804 oashc.HttpShardHandlerFactory.getParameter Setting maxThreadIdleTime to: 5
   [junit4]   2> 253393 T804 oashc.HttpShardHandlerFactory.getParameter Setting sizeOfQueue to: -1
   [junit4]   2> 253393 T804 oashc.HttpShardHandlerFactory.getParameter Setting fairnessPolicy to: false
   [junit4]   2> 253393 T804 oascsi.HttpClientUtil.createClient Creating new http client, config:maxConnectionsPerHost=20&maxConnections=10000&socketTimeout=120000&connTimeout=15000&retry=false
   [junit4]   2> 253396 T804 oasc.ZkContainer.initZooKeeper Zookeeper client=127.0.0.1:52907/solr
   [junit4]   2> 253396 T804 oasc.ZkController.checkChrootPath zkHost includes chroot
   [junit4]   2> 253397 T804 oascc.ConnectionManager.waitForConnected Waiting for client to connect to ZooKeeper
   [junit4]   2> 253399 T824 oascc.ConnectionManager.process Watcher org.apache.solr.common.cloud.ConnectionManager@4626cb22 name:ZooKeeperConnection Watcher:127.0.0.1:52907 got event WatchedEvent state:SyncConnected type:None path:null path:null type:None
   [junit4]   2> 253399 T804 oascc.ConnectionManager.waitForConnected Client is connected to ZooKeeper
   [junit4]   2> 253400 T804 oascsi.HttpClientUtil.createClient Creating new http client, config:maxConnections=500&maxConnectionsPerHost=16&socketTimeout=120000&connTimeout=15000
   [junit4]   2> 253403 T804 oascc.ConnectionManager.waitForConnected Waiting for client to connect to ZooKeeper
   [junit4]   2> 253404 T826 oascc.ConnectionManager.process Watcher org.apache.solr.common.cloud.ConnectionManager@5aca499a name:ZooKeeperConnection Watcher:127.0.0.1:52907/solr got event WatchedEvent state:SyncConnected type:None path:null path:null type:None
   [junit4]   2> 253405 T804 oascc.ConnectionManager.waitForConnected Client is connected to ZooKeeper
   [junit4]   2> 253406 T804 oascc.SolrZkClient.makePath makePath: /overseer/queue
   [junit4]   2> 253409 T804 oascc.SolrZkClient.makePath makePath: /overseer/collection-queue-work
   [junit4]   2> 253411 T804 oascc.SolrZkClient.makePath makePath: /live_nodes
   [junit4]   2> 253412 T804 oasc.ZkController.createEphemeralLiveNode Register node as live in ZooKeeper:/live_nodes/127.0.0.1:59243_
   [junit4]   2> 253413 T804 oascc.SolrZkClient.makePath makePath: /live_nodes/127.0.0.1:59243_
   [junit4]   2> 253415 T804 oascc.SolrZkClient.makePath makePath: /overseer_elect/election
   [junit4]   2> 253419 T804 oascc.SolrZkClient.makePath makePath: /overseer_elect/leader
   [junit4]   2> 253421 T804 oasc.Overseer.start Overseer (id=90141163528519683-127.0.0.1:59243_-n_0000000000) starting
   [junit4]   2> 253423 T804 oascc.SolrZkClient.makePath makePath: /overseer/queue-work
   [junit4]   2> 253428 T828 oasc.OverseerCollectionProcessor.run Process current queue of collection creations
   [junit4]   2> 253429 T804 oascc.SolrZkClient.makePath makePath: /clusterstate.json
   [junit4]   2> 253432 T804 oascc.SolrZkClient.makePath makePath: /aliases.json
   [junit4]   2> 253433 T804 oascc.ZkStateReader.createClusterStateWatchersAndUpdate Updating cluster state from ZooKeeper...
   [junit4]   2> 253435 T827 oasc.Overseer$ClusterStateUpdater.run Starting to work on the main queue
   [junit4]   2> 253438 T804 oasc.CorePropertiesLocator.discover Looking for core definitions underneath /mnt/ssd/jenkins/workspace/Lucene-Solr-trunk-Linux/solr/build/solr-core/test/J1/./org.apache.solr.cloud.CollectionsAPIDistributedZkTest-controljetty-1375445000437
   [junit4]   2> 253466 T804 oasc.CorePropertiesLocator.discoverUnder Found core conf in /mnt/ssd/jenkins/workspace/Lucene-Solr-trunk-Linux/solr/build/solr-core/test/J1/./org.apache.solr.cloud.CollectionsAPIDistributedZkTest-controljetty-1375445000437/conf/
   [junit4]   2> 253467 T804 oasc.CorePropertiesLocator.discover Found 1 core definitions
   [junit4]   2> 253467 T804 oass.SolrDispatchFilter.init user.dir=/mnt/ssd/jenkins/workspace/Lucene-Solr-trunk-Linux/solr/build/solr-core/test/J1
   [junit4]   2> 253468 T804 oass.SolrDispatchFilter.init SolrDispatchFilter.init() done
   [junit4]   2> 253468 T804 oascsi.HttpClientUtil.createClient Creating new http client, config:maxConnections=128&maxConnectionsPerHost=32&followRedirects=false
   [junit4]   2> 253471 T804 oascsi.HttpClientUtil.createClient Creating new http client, config:
   [junit4]   2> 253472 T804 oascc.ConnectionManager.waitForConnected Waiting for client to connect to ZooKeeper
   [junit4]   2> 253473 T831 oascc.ConnectionManager.process Watcher org.apache.solr.common.cloud.ConnectionManager@46b6562c name:ZooKeeperConnection Watcher:127.0.0.1:52907/solr got event WatchedEvent state:SyncConnected type:None path:null path:null type:None
   [junit4]   2> 253473 T804 oascc.ConnectionManager.waitForConnected Client is connected to ZooKeeper
   [junit4]   2> 253474 T804 oascc.ZkStateReader.createClusterStateWatchersAndUpdate Updating cluster state from ZooKeeper...
   [junit4]   2> 253476 T804 oasc.ChaosMonkey.monkeyLog monkey: init - expire sessions:true cause connection loss:true
   [junit4]   2> 253545 T804 oejs.Server.doStart jetty-8.1.10.v20130312
   [junit4]   2> 253546 T804 oejs.AbstractConnector.doStart Started SelectChannelConnector@127.0.0.1:49865
   [junit4]   2> 253547 T804 oass.SolrDispatchFilter.init SolrDispatchFilter.init()
   [junit4]   2> 253547 T804 oasc.SolrResourceLoader.locateSolrHome JNDI not configured for solr (NoInitialContextEx)
   [junit4]   2> 253547 T804 oasc.SolrResourceLoader.locateSolrHome using system property solr.solr.home: /mnt/ssd/jenkins/workspace/Lucene-Solr-trunk-Linux/solr/build/solr-core/test/J1/./org.apache.solr.cloud.CollectionsAPIDistributedZkTest-jetty1-1375445000660
   [junit4]   2> 253548 T804 oasc.SolrResourceLoader.<init> new SolrResourceLoader for directory: '/mnt/ssd/jenkins/workspace/Lucene-Solr-trunk-Linux/solr/build/solr-core/test/J1/./org.apache.solr.cloud.CollectionsAPIDistributedZkTest-jetty1-1375445000660/'
   [junit4]   2> 253558 T804 oasc.ConfigSolr.fromFile Loading container configuration from /mnt/ssd/jenkins/workspace/Lucene-Solr-trunk-Linux/solr/build/solr-core/test/J1/./org.apache.solr.cloud.CollectionsAPIDistributedZkTest-jetty1-1375445000660/solr.xml
   [junit4]   2> 253601 T804 oasc.ConfigSolrXml.<init> Config-defined core root directory:
   [junit4]   2> 253602 T804 oasc.CoreContainer.<init> New CoreContainer 1689421950
   [junit4]   2> 253602 T804 oasc.CoreContainer.load Loading cores into CoreContainer [instanceDir=/mnt/ssd/jenkins/workspace/Lucene-Solr-trunk-Linux/solr/build/solr-core/test/J1/./org.apache.solr.cloud.CollectionsAPIDistributedZkTest-jetty1-1375445000660/]
   [junit4]   2> 253603 T804 oashc.HttpShardHandlerFactory.getParameter Setting socketTimeout to: 120000
   [junit4]   2> 253603 T804 oashc.HttpShardHandlerFactory.getParameter Setting urlScheme to: http://
   [junit4]   2> 253603 T804 oashc.HttpShardHandlerFactory.getParameter Setting connTimeout to: 15000
   [junit4]   2> 253604 T804 oashc.HttpShardHandlerFactory.getParameter Setting maxConnectionsPerHost to: 20
   [junit4]   2> 253604 T804 oashc.HttpShardHandlerFactory.getParameter Setting corePoolSize to: 0
   [junit4]   2> 253604 T804 oashc.HttpShardHandlerFactory.getParameter Setting maximumPoolSize to: 2147483647
   [junit4]   2> 253605 T804 oashc.HttpShardHandlerFactory.getParameter Setting maxThreadIdleTime to: 5
   [junit4]   2> 253605 T804 oashc.HttpShardHandlerFactory.getParameter Setting sizeOfQueue to: -1
   [junit4]   2> 253605 T804 oashc.HttpShardHandlerFactory.getParameter Setting fairnessPolicy to: false
   [junit4]   2> 253605 T804 oascsi.HttpClientUtil.createClient Creating new http client, config:maxConnectionsPerHost=20&maxConnections=10000&socketTimeout=120000&connTimeout=15000&retry=false
   [junit4]   2> 253608 T804 oasc.ZkContainer.initZooKeeper Zookeeper client=127.0.0.1:52907/solr
   [junit4]   2> 253609 T804 oasc.ZkController.checkChrootPath zkHost includes chroot
   [junit4]   2> 253609 T804 oascc.ConnectionManager.waitForConnected Waiting for client to connect to ZooKeeper
   [junit4]   2> 253611 T842 oascc.ConnectionManager.process Watcher org.apache.solr.common.cloud.ConnectionManager@6d32c066 name:ZooKeeperConnection Watcher:127.0.0.1:52907 got event WatchedEvent state:SyncConnected type:None path:null path:null type:None
   [junit4]   2> 253611 T804 oascc.ConnectionManager.waitForConnected Client is connected to ZooKeeper
   [junit4]   2> 253613 T804 oascsi.HttpClientUtil.createClient Creating new http client, config:maxConnections=500&maxConnectionsPerHost=16&socketTimeout=120000&connTimeout=15000
   [junit4]   2> 253616 T804 oascc.ConnectionManager.waitForConnected Waiting for client to connect to ZooKeeper
   [junit4]   2> 253617 T844 oascc.ConnectionManager.process Watcher org.apache.solr.common.cloud.ConnectionManager@18339077 name:ZooKeeperConnection Watcher:127.0.0.1:52907/solr got event WatchedEvent state:SyncConnected type:None path:null path:null type:None
   [junit4]   2> 253617 T804 oascc.ConnectionManager.waitForConnected Client is connected to ZooKeeper
   [junit4]   2> 253623 T804 oascc.ZkStateReader.createClusterStateWatchersAndUpdate Updating cluster state from ZooKeeper...
   [junit4]   2> 254626 T804 oasc.ZkController.createEphemeralLiveNode Register node as live in ZooKeeper:/live_nodes/127.0.0.1:49865_
   [junit4]   2> 254628 T804 oascc.SolrZkClient.makePath makePath: /live_nodes/127.0.0.1:49865_
   [junit4]   2> 254633 T826 oascc.ZkStateReader$3.process Updating live nodes... (2)
   [junit4]   2> 254633 T844 oascc.ZkStateReader$3.process Updating live nodes... (2)
   [junit4]   2> 254633 T831 oascc.ZkStateReader$3.process Updating live nodes... (2)
   [junit4]   2> 254639 T804 oasc.CorePropertiesLocator.discover Looking for core definitions underneath /mnt/ssd/jenkins/workspace/Lucene-Solr-trunk-Linux/solr/build/solr-core/test/J1/./org.apache.solr.cloud.CollectionsAPIDistributedZkTest-jetty1-1375445000660
   [junit4]   2> 254665 T804 oasc.CorePropertiesLocator.discoverUnder Found core conf in /mnt/ssd/jenkins/workspace/Lucene-Solr-trunk-Linux/solr/build/solr-core/test/J1/./org.apache.solr.cloud.CollectionsAPIDistributedZkTest-jetty1-1375445000660/conf/
   [junit4]   2> 254666 T804 oasc.CorePropertiesLocator.discover Found 1 core definitions
   [junit4]   2> 254666 T804 oass.SolrDispatchFilter.init user.dir=/mnt/ssd/jenkins/workspace/Lucene-Solr-trunk-Linux/solr/build/solr-core/test/J1
   [junit4]   2> 254667 T804 oass.SolrDispatchFilter.init SolrDispatchFilter.init() done
   [junit4]   2> 254667 T804 oascsi.HttpClientUtil.createClient Creating new http client, config:maxConnections=128&maxConnectionsPerHost=32&followRedirects=false
   [junit4]   2> 254747 T804 oejs.Server.doStart jetty-8.1.10.v20130312
   [junit4]   2> 254750 T804 oejs.AbstractConnector.doStart Started SelectChannelConnector@127.0.0.1:39094
   [junit4]   2> 254751 T804 oass.SolrDispatchFilter.init SolrDispatchFilter.init()
   [junit4]   2> 254751 T804 oasc.SolrResourceLoader.locateSolrHome JNDI not configured for solr (NoInitialContextEx)
   [junit4]   2> 254752 T804 oasc.SolrResourceLoader.locateSolrHome using system property solr.solr.home: /mnt/ssd/jenkins/workspace/Lucene-Solr-trunk-Linux/solr/build/solr-core/test/J1/./org.apache.solr.cloud.CollectionsAPIDistributedZkTest-jetty2-1375445001853
   [junit4]   2> 254752 T804 oasc.SolrResourceLoader.<init> new SolrResourceLoader for directory: '/mnt/ssd/jenkins/workspace/Lucene-Solr-trunk-Linux/solr/build/solr-core/test/J1/./org.apache.solr.cloud.CollectionsAPIDistributedZkTest-jetty2-1375445001853/'
   [junit4]   2> 254764 T804 oasc.ConfigSolr.fromFile Loading container configuration from /mnt/ssd/jenkins/workspace/Lucene-Solr-trunk-Linux/solr/build/solr-core/test/J1/./org.apache.solr.cloud.CollectionsAPIDistributedZkTest-jetty2-1375445001853/solr.xml
   [junit4]   2> 254802 T804 oasc.ConfigSolrXml.<init> Config-defined core root directory:
   [junit4]   2> 254802 T804 oasc.CoreContainer.<init> New CoreContainer 1669594482
   [junit4]   2> 254802 T804 oasc.CoreContainer.load Loading cores into CoreContainer [instanceDir=/mnt/ssd/jenkins/workspace/Lucene-Solr-trunk-Linux/solr/build/solr-core/test/J1/./org.apache.solr.cloud.CollectionsAPIDistributedZkTest-jetty2-1375445001853/]
   [junit4]   2> 254803 T804 oashc.HttpShardHandlerFactory.getParameter Setting socketTimeout to: 120000
   [junit4]   2> 254804 T804 oashc.HttpShardHandlerFactory.getParameter Setting urlScheme to: http://
   [junit4]   2> 254804 T804 oashc.HttpShardHandlerFactory.getParameter Setting connTimeout to: 15000
   [junit4]   2> 254804 T804 oashc.HttpShardHandlerFactory.getParameter Setting maxConnectionsPerHost to: 20
   [junit4]   2> 254804 T804 oashc.HttpShardHandlerFactory.getParameter Setting corePoolSize to: 0
   [junit4]   2> 254805 T804 oashc.HttpShardHandlerFactory.getParameter Setting maximumPoolSize to: 2147483647
   [junit4]   2> 254805 T804 oashc.HttpShardHandlerFactory.getParameter Setting maxThreadIdleTime to: 5
   [junit4]   2> 254805 T804 oashc.HttpShardHandlerFactory.getParameter Setting sizeOfQueue to: -1
   [junit4]   2> 254806 T804 oashc.HttpShardHandlerFactory.getParameter Setting fairnessPolicy to: false
   [junit4]   2> 254806 T804 oascsi.HttpClientUtil.createClient Creating new http client, config:maxConnectionsPerHost=20&maxConnections=10000&socketTimeout=120000&connTimeout=15000&retry=false
   [junit4]   2> 254809 T804 oasc.ZkContainer.initZooKeeper Zookeeper client=127.0.0.1:52907/solr
   [junit4]   2> 254809 T804 oasc.ZkController.checkChrootPath zkHost includes chroot
   [junit4]   2> 254810 T804 oascc.ConnectionManager.waitForConnected Waiting for client to connect to ZooKeeper
   [junit4]   2> 254811 T856 oascc.ConnectionManager.process Watcher org.apache.solr.common.cloud.ConnectionManager@40da38ce name:ZooKeeperConnection Watcher:127.0.0.1:52907 got event WatchedEvent state:SyncConnected type:None path:null path:null type:None
   [junit4]   2> 254812 T804 oascc.ConnectionManager.waitForConnected Client is connected to ZooKeeper
   [junit4]   2> 254813 T804 oascsi.HttpClientUtil.createClient Creating new http client, config:maxConnections=500&maxConnectionsPerHost=16&socketTimeout=120000&connTimeout=15000
   [junit4]   2> 254816 T804 oascc.ConnectionManager.waitForConnected Waiting for client to connect to ZooKeeper
   [junit4]   2> 254817 T858 oascc.ConnectionManager.process Watcher org.apache.solr.common.cloud.ConnectionManager@76778aae name:ZooKeeperConnection Watcher:127.0.0.1:52907/solr got event WatchedEvent state:SyncConnected type:None path:null path:null type:None
   [junit4]   2> 254817 T804 oascc.ConnectionManager.waitForConnected Client is connected to ZooKeeper
   [junit4]   2> 254821 T804 oascc.ZkStateReader.createClusterStateWatchersAndUpdate Updating cluster state from ZooKeeper...
   [junit4]   2> 255824 T804 oasc.ZkController.createEphemeralLiveNode Register node as live in ZooKeeper:/live_nodes/127.0.0.1:39094_
   [junit4]   2> 255826 T804 oascc.SolrZkClient.makePath makePath: /live_nodes/127.0.0.1:39094_
   [junit4]   2> 255831 T844 oascc.ZkStateReader$3.process Updating live nodes... (3)
   [junit4]   2> 255831 T831 oascc.ZkStateReader$3.process Updating live nodes... (3)
   [junit4]   2> 255831 T826 oascc.ZkStateReader$3.process Updating live nodes... (3)
   [junit4]   2> 255831 T858 oascc.ZkStateReader$3.process Updating live nodes... (3)
   [junit4]   2> 255838 T804 oasc.CorePropertiesLocator.discover Looking for core definitions underneath /mnt/ssd/jenkins/workspace/Lucene-Solr-trunk-Linux/solr/build/solr-core/test/J1/./org.apache.solr.cloud.CollectionsAPIDistributedZkTest-jetty2-1375445001853
   [junit4]   2> 255862 T804 oasc.CorePropertiesLocator.discoverUnder Found core conf in /mnt/ssd/jenkins/workspace/Lucene-Solr-trunk-Linux/solr/build/solr-core/test/J1/./org.apache.solr.cloud.CollectionsAPIDistributedZkTest-jetty2-1375445001853/conf/
   [junit4]   2> 255863 T804 oasc.CorePropertiesLocator.discover Found 1 core definitions
   [junit4]   2> 255863 T804 oass.SolrDispatchFilter.init user.dir=/mnt/ssd/jenkins/workspace/Lucene-Solr-trunk-Linux/solr/build/solr-core/test/J1
   [junit4]   2> 255864 T804 oass.SolrDispatchFilter.init SolrDispatchFilter.init() done
   [junit4]   2> 255864 T804 oascsi.HttpClientUtil.createClient Creating new http client, config:maxConnections=128&maxConnectionsPerHost=32&followRedirects=false
   [junit4]   2> 255937 T804 oejs.Server.doStart jetty-8.1.10.v20130312
   [junit4]   2> 255940 T804 oejs.AbstractConnector.doStart Started SelectChannelConnector@127.0.0.1:60458
   [junit4]   2> 255940 T804 oass.SolrDispatchFilter.init SolrDispatchFilter.init()
   [junit4]   2> 255940 T804 oasc.SolrResourceLoader.locateSolrHome JNDI not configured for solr (NoInitialContextEx)
   [junit4]   2> 255941 T804 oasc.SolrResourceLoader.locateSolrHome using system property solr.solr.home: /mnt/ssd/jenkins/workspace/Lucene-Solr-trunk-Linux/solr/build/solr-core/test/J1/./org.apache.solr.cloud.CollectionsAPIDistributedZkTest-jetty3-1375445003051
   [junit4]   2> 255941 T804 oasc.SolrResourceLoader.<init> new SolrResourceLoader for directory: '/mnt/ssd/jenkins/workspace/Lucene-Solr-trunk-Linux/solr/build/solr-core/test/J1/./org.apache.solr.cloud.CollectionsAPIDistributedZkTest-jetty3-1375445003051/'
   [junit4]   2> 255951 T804 oasc.ConfigSolr.fromFile Loading container configuration from /mnt/ssd/jenkins/workspace/Lucene-Solr-trunk-Linux/solr/build/solr-core/test/J1/./org.apache.solr.cloud.CollectionsAPIDistributedZkTest-jetty3-1375445003051/solr.xml
   [junit4]   2> 255981 T804 oasc.ConfigSolrXml.<init> Config-defined core root directory:
   [junit4]   2> 255982 T804 oasc.CoreContainer.<init> New CoreContainer 1130356006
   [junit4]   2> 255982 T804 oasc.CoreContainer.load Loading cores into CoreContainer [instanceDir=/mnt/ssd/jenkins/workspace/Lucene-Solr-trunk-Linux/solr/build/solr-core/test/J1/./org.apache.solr.cloud.CollectionsAPIDistributedZkTest-jetty3-1375445003051/]
   [junit4]   2> 255983 T804 oashc.HttpShardHandlerFactory.getParameter Setting socketTimeout to: 120000
   [junit4]   2> 255983 T804 oashc.HttpShardHandlerFactory.getParameter Setting urlScheme to: http://
   [junit4]   2> 255983 T804 oashc.HttpShardHandlerFactory.getParameter Setting connTimeout to: 15000
   [junit4]   2> 255984 T804 oashc.HttpShardHandlerFactory.getParameter Setting maxConnectionsPerHost to: 20
   [junit4]   2> 255984 T804 oashc.HttpShardHandlerFactory.getParameter Setting corePoolSize to: 0
   [junit4]   2> 255984 T804 oashc.HttpShardHandlerFactory.getParameter Setting maximumPoolSize to: 2147483647
   [junit4]   2> 255984 T804 oashc.HttpShardHandlerFactory.getParameter Setting maxThreadIdleTime to: 5
   [junit4]   2> 255985 T804 oashc.HttpShardHandlerFactory.getParameter Setting sizeOfQueue to: -1
   [junit4]   2> 255985 T804 oashc.HttpShardHandlerFactory.getParameter Setting fairnessPolicy to: false
   [junit4]   2> 255985 T804 oascsi.HttpClientUtil.createClient Creating new http client, config:maxConnectionsPerHost=20&maxConnections=10000&socketTimeout=120000&connTimeout=15000&retry=false
   [junit4]   2> 255996 T804 oasc.ZkContainer.initZooKeeper Zookeeper client=127.0.0.1:52907/solr
   [junit4]   2> 255997 T804 oasc.ZkController.checkChrootPath zkHost includes chroot
   [junit4]   2> 255998 T804 oascc.ConnectionManager.waitForConnected Waiting for client to connect to ZooKeeper
   [junit4]   2> 255999 T870 oascc.ConnectionManager.process Watcher org.apache.solr.common.cloud.ConnectionManager@22dccc67 name:ZooKeeperConnection Watcher:127.0.0.1:52907 got event WatchedEvent state:SyncConnected type:None path:null path:null type:None
   [junit4]   2> 255999 T804 oascc.ConnectionManager.waitForConnected Client is connected to ZooKeeper
   [junit4]   2> 256001 T804 oascsi.HttpClientUtil.createClient Creating new http client, config:maxConnections=500&maxConnectionsPerHost=16&socketTimeout=120000&connTimeout=15000
   [junit4]   2> 256004 T804 oascc.ConnectionManager.waitForConnected Waiting for client to connect to ZooKeeper
   [junit4]   2> 256005 T872 oascc.ConnectionManager.process Watcher org.apache.solr.common.cloud.ConnectionManager@5119493c name:ZooKeeperConnection Watcher:127.0.0.1:52907/solr got event WatchedEvent state:SyncConnected type:None path:null path:null type:None
   [junit4]   2> 256006 T804 oascc.ConnectionManager.waitForConnected Client is connected to ZooKeeper
   [junit4]   2> 256010 T804 oascc.ZkStateReader.createClusterStateWatchersAndUpdate Updating cluster state from ZooKeeper...
   [junit4]   2> 257013 T804 oasc.ZkController.createEphemeralLiveNode Register node as live in ZooKeeper:/live_nodes/127.0.0.1:60458_
   [junit4]   2> 257015 T804 oascc.SolrZkClient.makePath makePath: /live_nodes/127.0.0.1:60458_
   [junit4]   2> 257018 T831 oascc.ZkStateReader$3.process Updating live nodes... (4)
   [junit4]   2> 257018 T844 oascc.ZkStateReader$3.process Updating live nodes... (4)
   [junit4]   2> 257018 T872 oascc.ZkStateReader$3.process Updating live nodes... (4)
   [junit4]   2> 257018 T826 oascc.ZkStateReader$3.process Updating live nodes... (4)
   [junit4]   2> 257018 T858 oascc.ZkStateReader$3.process Updating live nodes... (4)
   [junit4]   2> 257027 T804 oasc.CorePropertiesLocator.discover Looking for core definitions underneath /mnt/ssd/jenkins/workspace/Lucene-Solr-trunk-Linux/solr/build/solr-core/test/J1/./org.apache.solr.cloud.CollectionsAPIDistributedZkTest-jetty3-1375445003051
   [junit4]   2> 257051 T804 oasc.CorePropertiesLocator.discoverUnder Found core conf in /mnt/ssd/jenkins/workspace/Lucene-Solr-trunk-Linux/solr/build/solr-core/test/J1/./org.apache.solr.cloud.CollectionsAPIDistributedZkTest-jetty3-1375445003051/conf/
   [junit4]   2> 257051 T804 oasc.CorePropertiesLocator.discover Found 1 core definitions
   [junit4]   2> 257052 T804 oass.SolrDispatchFilter.init user.dir=/mnt/ssd/jenkins/workspace/Lucene-Solr-trunk-Linux/solr/build/solr-core/test/J1
   [junit4]   2> 257052 T804 oass.SolrDispatchFilter.init SolrDispatchFilter.init() done
   [junit4]   2> 257052 T804 oascsi.HttpClientUtil.createClient Creating new http client, config:maxConnections=128&maxConnectionsPerHost=32&followRedirects=false
   [junit4]   2> 257121 T804 oejs.Server.doStart jetty-8.1.10.v20130312
   [junit4]   2> 257123 T804 oejs.AbstractConnector.doStart Started SelectChannelConnector@127.0.0.1:56721
   [junit4]   2> 257123 T804 oass.SolrDispatchFilter.init SolrDispatchFilter.init()
   [junit4]   2> 257124 T804 oasc.SolrResourceLoader.locateSolrHome JNDI not configured for solr (NoInitialContextEx)
   [junit4]   2> 257124 T804 oasc.SolrResourceLoader.locateSolrHome using system property solr.solr.home: /mnt/ssd/jenkins/workspace/Lucene-Solr-trunk-Linux/solr/build/solr-core/test/J1/./org.apache.solr.cloud.CollectionsAPIDistributedZkTest-jetty4-1375445004239
   [junit4]   2> 257124 T804 oasc.SolrResourceLoader.<init> new SolrResourceLoader for directory: '/mnt/ssd/jenkins/workspace/Lucene-Solr-trunk-Linux/solr/build/solr-core/test/J1/./org.apache.solr.cloud.CollectionsAPIDistributedZkTest-jetty4-1375445004239/'
   [junit4]   2> 257134 T804 oasc.ConfigSolr.fromFile Loading container configuration from /mnt/ssd/jenkins/workspace/Lucene-Solr-trunk-Linux/solr/build/solr-core/test/J1/./org.apache.solr.cloud.CollectionsAPIDistributedZkTest-jetty4-1375445004239/solr.xml
   [junit4]   2> 257162 T804 oasc.ConfigSolrXml.<init> Config-defined core root directory:
   [junit4]   2> 257162 T804 oasc.CoreContainer.<init> New CoreContainer 1966463857
   [junit4]   2> 257163 T804 oasc.CoreContainer.load Loading cores into CoreContainer [instanceDir=/mnt/ssd/jenkins/workspace/Lucene-Solr-trunk-Linux/solr/build/solr-core/test/J1/./org.apache.solr.cloud.CollectionsAPIDistributedZkTest-jetty4-1375445004239/]
   [junit4]   2> 257163 T804 oashc.HttpShardHandlerFactory.getParameter Setting socketTimeout to: 120000
   [junit4]   2> 257164 T804 oashc.HttpShardHandlerFactory.getParameter Setting urlScheme to: http://
   [junit4]   2> 257164 T804 oashc.HttpShardHandlerFactory.getParameter Setting connTimeout to: 15000
   [junit4]   2> 257164 T804 oashc.HttpShardHandlerFactory.getParameter Setting maxConnectionsPerHost to: 20
   [junit4]   2> 257164 T804 oashc.HttpShardHandlerFactory.getParameter Setting corePoolSize to: 0
   [junit4]   2> 257165 T804 oashc.HttpShardHandlerFactory.getParameter Setting maximumPoolSize to: 2147483647
   [junit4]   2> 257165 T804 oashc.HttpShardHandlerFactory.getParameter Setting maxThreadIdleTime to: 5
   [junit4]   2> 257165 T804 oashc.HttpShardHandlerFactory.getParameter Setting sizeOfQueue to: -1
   [junit4]   2> 257165 T804 oashc.HttpShardHandlerFactory.getParameter Setting fairnessPolicy to: false
   [junit4]   2> 257166 T804 oascsi.HttpClientUtil.createClient Creating new http client, config:maxConnectionsPerHost=20&maxConnections=10000&socketTimeout=120000&connTimeout=15000&retry=false
   [junit4]   2> 257168 T804 oasc.ZkContainer.initZooKeeper Zookeeper client=127.0.0.1:52907/solr
   [junit4]   2> 257169 T804 oasc.ZkController.checkChrootPath zkHost includes chroot
   [junit4]   2> 257170 T804 oascc.ConnectionManager.waitForConnected Waiting for client to connect to ZooKeeper
   [junit4]   2> 257171 T884 oascc.ConnectionManager.process Watcher org.apache.solr.common.cloud.ConnectionManager@206e84a5 name:ZooKeeperConnection Watcher:127.0.0.1:52907 got event WatchedEvent state:SyncConnected type:None path:null path:null type:None
   [junit4]   2> 257171 T804 oascc.ConnectionManager.waitForConnected Client is connected to ZooKeeper
   [junit4]   2> 257173 T804 oascsi.HttpClientUtil.createClient Creating new http client, config:maxConnections=500&maxConnectionsPerHost=16&socketTimeout=120000&connTimeout=15000
   [junit4]   2> 257176 T804 oascc.ConnectionManager.waitForConnected Waiting for client to connect to ZooKeeper
   [junit4]   2> 257177 T886 oascc.ConnectionManager.process Watcher org.apache.solr.common.cloud.ConnectionManager@37c549c5 name:ZooKeeperConnection Watcher:127.0.0.1:52907/solr got event WatchedEvent state:SyncConnected type:None path:null path:null type:None
   [junit4]   2> 257177 T804 oascc.ConnectionManager.waitForConnected Client is connected to ZooKeeper
   [junit4]   2> 257180 T804 oascc.ZkStateReader.createClusterStateWatchersAndUpdate Updating cluster state from ZooKeeper...
   [junit4]   2> 258183 T804 oasc.ZkController.createEphemeralLiveNode Register node as live in ZooKeeper:/live_nodes/127.0.0.1:56721_
   [junit4]   2> 258184 T804 oascc.SolrZkClient.makePath makePath: /live_nodes/127.0.0.1:56721_
   [junit4]   2> 258187 T826 oascc.ZkStateReader$3.process Updating live nodes... (5)
   [junit4]   2> 258187 T872 oascc.ZkStateReader$3.process Updating live nodes... (5)
   [junit4]   2> 258187 T858 oascc.ZkStateReader$3.process Updating live nodes... (5)
   [junit4]   2> 258187 T831 oascc.ZkStateReader$3.process Updating live nodes... (5)
   [junit4]   2> 258187 T844 oascc.ZkStateReader$3.process Updating live nodes... (5)
   [junit4]   2> 258187 T886 oascc.ZkStateReader$3.process Updating live nodes... (5)
   [junit4]   2> 258193 T804 oasc.CorePropertiesLocator.discover Looking for core definitions underneath /mnt/ssd/jenkins/workspace/Lucene-Solr-trunk-Linux/solr/build/solr-core/test/J1/./org.apache.solr.cloud.CollectionsAPIDistributedZkTest-jetty4-1375445004239
   [junit4]   2> 258215 T804 oasc.CorePropertiesLocator.discoverUnder Found core conf in /mnt/ssd/jenkins/workspace/Lucene-Solr-trunk-Linux/solr/build/solr-core/test/J1/./org.apache.solr.cloud.CollectionsAPIDistributedZkTest-jetty4-1375445004239/conf/
   [junit4]   2> 258216 T804 oasc.CorePropertiesLocator.discover Found 1 core definitions
   [junit4]   2> 258217 T804 oass.SolrDispatchFilter.init user.dir=/mnt/ssd/jenkins/workspace/Lucene-Solr-trunk-Linux/solr/build/solr-core/test/J1
   [junit4]   2> 258217 T804 oass.SolrDispatchFilter.init SolrDispatchFilter.init() done
   [junit4]   2> 258217 T804 oascsi.HttpClientUtil.createClient Creating new http client, config:maxConnections=128&maxConnectionsPerHost=32&followRedirects=false
   [junit4]   2> 258221 T804 oascsi.HttpClientUtil.createClient Creating new http client, config:maxConnections=128&maxConnectionsPerHost=32&followRedirects=false
   [junit4]   2> 258233 T839 oasha.CollectionsHandler.handleCreateAction Creating Collection : numShards=2&name=nodes_used_collection&replicationFactor=2&action=CREATE&wt=javabin&version=2
   [junit4]   2> 258234 T826 oasc.DistributedQueue$LatchChildWatcher.process Watcher fired on path: /overseer/collection-queue-work state: SyncConnected type NodeChildrenChanged
   [junit4]   2> 258235 T828 oasc.OverseerCollectionProcessor.run Overseer Collection Processor: Get the message id:/overseer/collection-queue-work/qn-0000000000 message:{
   [junit4]   2>  "operation":"createcollection",
   [junit4]   2>  "numShards":"2",
   [junit4]   2>  "name":"nodes_used_collection",
   [junit4]   2>  "replicationFactor":"2"}
   [junit4]   2> 258236 T828 oasc.OverseerCollectionProcessor.processMessage WARN OverseerCollectionProcessor.processMessage : createcollection , {
   [junit4]   2>  "operation":"createcollection",
   [junit4]   2>  "numShards":"2",
   [junit4]   2>  "name":"nodes_used_collection",
   [junit4]   2>  "replicationFactor":"2"}
   [junit4]   2> 259444 T827 oascc.ZkStateReader.updateClusterState Updating cloud state from ZooKeeper...
   [junit4]   2> 259444 T827 oasc.Overseer$ClusterStateUpdater.buildCollection building a new collection: nodes_used_collection
   [junit4]   2> 259445 T827 oasc.Overseer$ClusterStateUpdater.createCollection Create collection nodes_used_collection with shards [shard1, shard2]
   [junit4]   2> 259449 T858 oascc.ZkStateReader$2.process A cluster state change: WatchedEvent state:SyncConnected type:NodeDataChanged path:/clusterstate.json, has occurred - updating... (live nodes size: 5)
   [junit4]   2> 259449 T872 oascc.ZkStateReader$2.process A cluster state change: WatchedEvent state:SyncConnected type:NodeDataChanged path:/clusterstate.json, has occurred - updating... (live nodes size: 5)
   [junit4]   2> 259450 T831 oascc.ZkStateReader$2.process A cluster state change: WatchedEvent state:SyncConnected type:NodeDataChanged path:/clusterstate.json, has occurred - updating... (live nodes size: 5)
   [junit4]   2> 259450 T886 oascc.ZkStateReader$2.process A cluster state change: WatchedEvent state:SyncConnected type:NodeDataChanged path:/clusterstate.json, has occurred - updating... (live nodes size: 5)
   [junit4]   2> 259449 T826 oascc.ZkStateReader$2.process A cluster state change: WatchedEvent state:SyncConnected type:NodeDataChanged path:/clusterstate.json, has occurred - updating... (live nodes size: 5)
   [junit4]   2> 259449 T844 oascc.ZkStateReader$2.process A cluster state change: WatchedEvent state:SyncConnected type:NodeDataChanged path:/clusterstate.json, has occurred - updating... (live nodes size: 5)
   [junit4]   2> 259539 T828 oasc.OverseerCollectionProcessor.createCollection going to create cores replicas shardNames [shard1, shard2] , repFactor : 2
   [junit4]   2> 259540 T828 oasc.OverseerCollectionProcessor.createCollection Creating shard nodes_used_collection_shard1_replica1 as part of slice shard1 of collection nodes_used_collection on 127.0.0.1:60458_
   [junit4]   2> 259540 T828 oasc.OverseerCollectionProcessor.createCollection Creating shard nodes_used_collection_shard1_replica2 as part of slice shard1 of collection nodes_used_collection on 127.0.0.1:39094_
   [junit4]   2> 259540 T828 oasc.OverseerCollectionProcessor.createCollection Creating shard nodes_used_collection_shard2_replica1 as part of slice shard2 of collection nodes_used_collection on 127.0.0.1:56721_
   [junit4]   2> 259542 T828 oasc.OverseerCollectionProcessor.createCollection Creating shard nodes_used_collection_shard2_replica2 as part of slice shard2 of collection nodes_used_collection on 127.0.0.1:49865_
   [junit4]   2> 259543 T865 oasc.ZkController.publish publishing core=nodes_used_collection_shard1_replica1 state=down
   [junit4]   2> 259544 T881 oasc.ZkController.publish publishing core=nodes_used_collection_shard2_replica1 state=down
   [junit4]   2> 259544 T838 oasc.ZkController.publish publishing core=nodes_used_collection_shard2_replica2 state=down
   [junit4]   2> 259543 T852 oasc.ZkController.publish publishing core=nodes_used_collection_shard1_replica2 state=down
   [junit4]   2> 259545 T865 oasc.ZkController.waitForCoreNodeName look for our core node name
   [junit4]   2> 259545 T881 oasc.ZkController.waitForCoreNodeName look for our core node name
   [junit4]   2> 259545 T838 oasc.ZkController.waitForCoreNodeName look for our core node name
   [junit4]   2> 259546 T852 oasc.ZkController.waitForCoreNodeName look for our core node name
   [junit4]   2> 260955 T827 oascc.ZkStateReader.updateClusterState Updating cloud state from ZooKeeper...
   [junit4]   2> 260956 T827 oasc.Overseer$ClusterStateUpdater.updateState WARN Could not find collection node for nodes_used_collection, skipping publish state
   [junit4]   2> 260956 T827 oasc.Overseer$ClusterStateUpdater.updateState Update state numShards=2 message={
   [junit4]   2>  "operation":"state",
   [junit4]   2>  "core_node_name":"core_node1",
   [junit4]   2>  "numShards":"2",
   [junit4]   2>  "shard":"shard1",
   [junit4]   2>  "roles":null,
   [junit4]   2>  "state":"down",
   [junit4]   2>  "shard_state":"active",
   [junit4]   2>  "core":"nodes_used_collection_shard1_replica1",
   [junit4]   2>  "collection":"nodes_used_collection",
   [junit4]   2>  "shard_range":null,
   [junit4]   2>  "node_name":"127.0.0.1:60458_",
   [junit4]   2>  "base_url":"http://127.0.0.1:60458"}
   [junit4]   2> 260960 T827 oasc.Overseer$ClusterStateUpdater.updateState WARN Could not find collection node for nodes_used_collection, skipping publish state
   [junit4]   2> 260960 T827 oasc.Overseer$ClusterStateUpdater.updateState Update state numShards=2 message={
   [junit4]   2>  "operation":"state",
   [junit4]   2>  "core_node_name":"core_node2",
   [junit4]   2>  "numShards":"2",
   [junit4]   2>  "shard":"shard2",
   [junit4]   2>  "roles":null,
   [junit4]   2>  "state":"down",
   [junit4]   2>  "shard_state":"active",
   [junit4]   2>  "core":"nodes_used_collection_shard2_replica1",
   [junit4]   2>  "collection":"nodes_used_collection",
   [junit4]   2>  "shard_range":null,
   [junit4]   2>  "node_name":"127.0.0.1:56721_",
   [junit4]   2>  "base_url":"http://127.0.0.1:56721"}
   [junit4]   2> 260965 T827 oasc.Overseer$ClusterStateUpdater.updateState WARN Could not find collection node for nodes_used_collection, skipping publish state
   [junit4]   2> 260966 T827 oasc.Overseer$ClusterStateUpdater.updateState Update state numShards=2 message={
   [junit4]   2>  "operation":"state",
   [junit4]   2>  "core_node_name":"core_node3",
   [junit4]   2>  "numShards":"2",
   [junit4]   2>  "shard":"shard2",
   [junit4]   2>  "roles":null,
   [junit4]   2>  "state":"down",
   [junit4]   2>  "shard_state":"active",
   [junit4]   2>  "core":"nodes_used_collection_shard2_replica2",
   [junit4]   2>  "collection":"nodes_used_collection",
   [junit4]   2>  "shard_range":null,
   [junit4]   2>  "node_name":"127.0.0.1:49865_",
   [junit4]   2>  "base_url":"http://127.0.0.1:49865"}
   [junit4]   2> 260971 T827 oasc.Overseer$ClusterStateUpdater.updateState WARN Could not find collection node for nodes_used_collection, skipping publish state
   [junit4]   2> 260972 T827 oasc.Overseer$ClusterStateUpdater.updateState Update state numShards=2 message={
   [junit4]   2>  "operation":"state",
   [junit4]   2>  "core_node_name":"core_node4",
   [junit4]   2>  "numShards":"2",
   [junit4]   2>  "shard":"shard1",
   [junit4]   2>  "roles":null,
   [junit4]   2>  "state":"down",
   [junit4]   2>  "shard_state":"active",
   [junit4]   2>  "core":"nodes_used_collection_shard1_replica2",
   [junit4]   2>  "collection":"nodes_used_collection",
   [junit4]   2>  "shard_range":null,
   [junit4]   2>  "node_name":"127.0.0.1:39094_",
   [junit4]   2>  "base_url":"http://127.0.0.1:39094"}
   [junit4]   2> 261036 T844 oascc.ZkStateReader$2.process A cluster state change: WatchedEvent state:SyncConnected type:NodeDataChanged path:/clusterstate.json, has occurred - updating... (live nodes size: 5)
   [junit4]   2> 261036 T826 oascc.ZkStateReader$2.process A cluster state change: WatchedEvent state:SyncConnected type:NodeDataChanged path:/clusterstate.json, has occurred - updating... (live nodes size: 5)
   [junit4]   2> 261036 T886 oascc.ZkStateReader$2.process A cluster state change: WatchedEvent state:SyncConnected type:NodeDataChanged path:/clusterstate.json, has occurred - updating... (live nodes size: 5)
   [junit4]   2> 261036 T831 oascc.ZkStateReader$2.process A cluster state change: WatchedEvent state:SyncConnected type:NodeDataChanged path:/clusterstate.json, has occurred - updating... (live nodes size: 5)
   [junit4]   2> 261036 T872 oascc.ZkStateReader$2.process A cluster state change: WatchedEvent state:SyncConnected type:NodeDataChanged path:/clusterstate.json, has occurred - updating... (live nodes size: 5)
   [junit4]   2> 261036 T858 oascc.ZkStateReader$2.process A cluster state change: WatchedEvent state:SyncConnected type:NodeDataChanged path:/clusterstate.json, has occurred - updating... (live nodes size: 5)
   [junit4]   2> 261545 T865 oasc.ZkController.waitForShardId waiting to find shard id in clusterstate for nodes_used_collection_shard1_replica1
   [junit4]   2> 261546 T838 oasc.ZkController.waitForShardId waiting to find shard id in clusterstate for nodes_used_collection_shard2_replica2
   [junit4]   2> 261546 T881 oasc.ZkController.waitForShardId waiting to find shard id in clusterstate for nodes_used_collection_shard2_replica1
   [junit4]   2> 261546 T852 oasc.ZkController.waitForShardId waiting to find shard id in clusterstate for nodes_used_collection_shard1_replica2
   [junit4]   2> 261547 T881 oasc.CorePropertiesLocator.writePropertiesFile ERROR Couldn't persist core properties to /mnt/ssd/jenkins/workspace/Lucene-Solr-trunk-Linux/solr/build/solr-core/test/J1/./org.apache.solr.cloud.CollectionsAPIDistributedZkTest-jetty4-1375445004239/nodes_used_collection_shard2_replica1/core.properties: java.io.FileNotFoundException: /mnt/ssd/jenkins/workspace/Lucene-Solr-trunk-Linux/solr/build/solr-core/test/J1/./org.apache.solr.cloud.CollectionsAPIDistributedZkTest-jetty4-1375445004239/nodes_used_collection_shard2_replica1/core.properties (No such file or directory)
   [junit4]   2> 261547 T838 oasc.CorePropertiesLocator.writePropertiesFile ERROR Couldn't persist core properties to /mnt/ssd/jenkins/workspace/Lucene-Solr-trunk-Linux/solr/build/solr-core/test/J1/./org.apache.solr.cloud.CollectionsAPIDistributedZkTest-jetty1-1375445000660/nodes_used_collection_shard2_replica2/core.properties: java.io.FileNotFoundException: /mnt/ssd/jenkins/workspace/Lucene-Solr-trunk-Linux/solr/build/solr-core/test/J1/./org.apache.solr.cloud.CollectionsAPIDistributedZkTest-jetty1-1375445000660/nodes_used_collection_shard2_replica2/core.properties (No such file or directory)
   [junit4]   2> 261548 T881 oasc.CoreContainer.create Creating SolrCore 'nodes_used_collection_shard2_replica1' using instanceDir: /mnt/ssd/jenkins/workspace/Lucene-Solr-trunk-Linux/solr/build/solr-core/test/J1/./org.apache.solr.cloud.CollectionsAPIDistributedZkTest-jetty4-1375445004239/nodes_used_collection_shard2_replica1
   [junit4]   2> 261546 T865 oasc.CorePropertiesLocator.writePropertiesFile ERROR Couldn't persist core properties to /mnt/ssd/jenkins/workspace/Lucene-Solr-trunk-Linux/solr/build/solr-core/test/J1/./org.apache.solr.cloud.CollectionsAPIDistributedZkTest-jetty3-1375445003051/nodes_used_collection_shard1_replica1/core.properties: java.io.FileNotFoundException: /mnt/ssd/jenkins/workspace/Lucene-Solr-trunk-Linux/solr/build/solr-core/test/J1/./org.apache.solr.cloud.CollectionsAPIDistributedZkTest-jetty3-1375445003051/nodes_used_collection_shard1_replica1/core.properties (No such file or directory)
   [junit4]   2> 261548 T852 oasc.CorePropertiesLocator.writePropertiesFile ERROR Couldn't persist core properties to /mnt/ssd/jenkins/workspace/Lucene-Solr-trunk-Linux/solr/build/solr-core/test/J1/./org.apache.solr.cloud.CollectionsAPIDistributedZkTest-jetty2-1375445001853/nodes_used_collection_shard1_replica2/core.properties: java.io.FileNotFoundException: /mnt/ssd/jenkins/workspace/Lucene-Solr-trunk-Linux/solr/build/solr-core/test/J1/./org.apache.solr.cloud.CollectionsAPIDistributedZkTest-jetty2-1375445001853/nodes_used_collection_shard1_replica2/core.properties (No such file or directory)
   [junit4]   2> 261549 T865 oasc.CoreContainer.create Creating SolrCore 'nodes_used_collection_shard1_replica1' using instanceDir: /mnt/ssd/jenkins/workspace/Lucene-Solr-trunk-Linux/solr/build/solr-core/test/J1/./org.apache.solr.cloud.CollectionsAPIDistributedZkTest-jetty3-1375445003051/nodes_used_collection_shard1_replica1
   [junit4]   2> 261549 T865 oasc.ZkController.createCollectionZkNode Check for collection zkNode:nodes_used_collection
   [junit4]   2> 261548 T881 oasc.ZkController.createCollectionZkNode Check for collection zkNode:nodes_used_collection
   [junit4]   2> 261548 T838 oasc.CoreContainer.create Creating SolrCore 'nodes_used_collection_shard2_replica2' using instanceDir: /mnt/ssd/jenkins/workspace/Lucene-Solr-trunk-Linux/solr/build/solr-core/test/J1/./org.apache.solr.cloud.CollectionsAPIDistributedZkTest-jetty1-1375445000660/nodes_used_collection_shard2_replica2
   [junit4]   2> 261550 T838 oasc.ZkController.createCollectionZkNode Check for collection zkNode:nodes_used_collection
   [junit4]   2> 261550 T881 oasc.ZkController.createCollectionZkNode Creating collection in ZooKeeper:nodes_used_collection
   [junit4]   2> 261551 T881 oasc.ZkController.getConfName Looking for collection configName
   [junit4]   2> 261549 T852 oasc.CoreContainer.create Creating SolrCore 'nodes_used_collection_shard1_replica2' using instanceDir: /mnt/ssd/jenkins/workspace/Lucene-Solr-trunk-Linux/solr/build/solr-core/test/J1/./org.apache.solr.cloud.CollectionsAPIDistributedZkTest-jetty2-1375445001853/nodes_used_collection_shard1_replica2
   [junit4]   2> 261551 T838 oasc.ZkController.createCollectionZkNode Creating collection in ZooKeeper:nodes_used_collection
   [junit4]   2> 261550 T865 oasc.ZkController.createCollectionZkNode Creating collection in ZooKeeper:nodes_used_collection
   [junit4]   2> 261552 T881 oasc.ZkController.getConfName Only one config set found in zk - using it:conf1
   [junit4]   2> 261552 T838 oasc.ZkController.getConfName Looking for collection configName
   [junit4]   2> 261551 T852 oasc.ZkController.createCollectionZkNode Check for collection zkNode:nodes_used_collection
   [junit4]   2> 261553 T881 oascc.SolrZkClient.makePath makePath: /collections/nodes_used_collection
   [junit4]   2> 261552 T865 oasc.ZkController.getConfName Looking for collection configName
   [junit4]   2> 261554 T852 oasc.ZkController.createCollectionZkNode Creating collection in ZooKeeper:nodes_used_collection
   [junit4]   2> 261554 T852 oasc.ZkController.getConfName Looking for collection configName
   [junit4]   2> 261554 T838 oasc.ZkController.getConfName Only one config set found in zk - using it:conf1
   [junit4]   2> 261554 T838 oascc.SolrZkClient.makePath makePath: /collections/nodes_used_collection
   [junit4]   2> 261555 T865 oasc.ZkController.getConfName Only one config set found in zk - using it:conf1
   [junit4]   2> 261555 T865 oascc.SolrZkClient.makePath makePath: /collections/nodes_used_collection
   [junit4]   2> 261556 T852 oasc.ZkController.getConfName Only one config set found in zk - using it:conf1
   [junit4]   2> 261556 T852 oascc.SolrZkClient.makePath makePath: /collections/nodes_used_collection
   [junit4]   2> 261557 T838 oasc.ZkController.readConfigName Load collection config from:/collections/nodes_used_collection
   [junit4]   2> 261556 T881 oasc.ZkController.readConfigName Load collection config from:/collections/nodes_used_collection
   [junit4]   2> 261558 T881 oasc.SolrResourceLoader.<init> new SolrResourceLoader for directory: '/mnt/ssd/jenkins/workspace/Lucene-Solr-trunk-Linux/solr/build/solr-core/test/J1/./org.apache.solr.cloud.CollectionsAPIDistributedZkTest-jetty4-1375445004239/nodes_used_collection_shard2_replica1/'
   [junit4]   2> 261559 T865 oasc.ZkController.readConfigName Load collection config from:/collections/nodes_used_collection
   [junit4]   2> 261560 T865 oasc.SolrResourceLoader.<init> new SolrResourceLoader for directory: '/mnt/ssd/jenkins/workspace/Lucene-Solr-trunk-Linux/solr/build/solr-core/test/J1/./org.apache.solr.cloud.CollectionsAPIDistributedZkTest-jetty3-1375445003051/nodes_used_collection_shard1_replica1/'
   [junit4]   2> 261561 T838 oasc.SolrResourceLoader.<init> new SolrResourceLoader for directory: '/mnt/ssd/jenkins/workspace/Lucene-Solr-trunk-Linux/solr/build/solr-core/test/J1/./org.apache.solr.cloud.CollectionsAPIDistributedZkTest-jetty1-1375445000660/nodes_used_collection_shard2_replica2/'
   [junit4]   2> 261566 T852 oasc.ZkController.readConfigName Load collection config from:/collections/nodes_used_collection
   [junit4]   2> 261567 T852 oasc.SolrResourceLoader.<init> new SolrResourceLoader for directory: '/mnt/ssd/jenkins/workspace/Lucene-Solr-trunk-Linux/solr/build/solr-core/test/J1/./org.apache.solr.cloud.CollectionsAPIDistributedZkTest-jetty2-1375445001853/nodes_used_collection_shard1_replica2/'
   [junit4]   2> 261618 T881 oasc.SolrConfig.<init> Using Lucene MatchVersion: LUCENE_50
   [junit4]   2> 261622 T838 oasc.SolrConfig.<init> Using Lucene MatchVersion: LUCENE_50
   [junit4]   2> 261633 T852 oasc.SolrConfig.<init> Using Lucene MatchVersion: LUCENE_50
   [junit4]   2> 261634 T865 oasc.SolrConfig.<init> Using Lucene MatchVersion: LUCENE_50
   [junit4]   2> 261699 T838 oasc.SolrConfig.<init> Loaded SolrConfig: solrconfig.xml
   [junit4]   2> 261700 T838 oass.IndexSchema.readSchema Reading Solr Schema from schema.xml
   [junit4]   2> 261705 T881 oasc.SolrConfig.<init> Loaded SolrConfig: solrconfig.xml
   [junit4]   2> 261707 T881 oass.IndexSchema.readSchema Reading Solr Schema from schema.xml
   [junit4]   2> 261721 T838 oass.IndexSchema.readSchema [nodes_used_collection_shard2_replica2] Schema name=test
   [junit4]   2> 261724 T865 oasc.SolrConfig.<init> Loaded SolrConfig: solrconfig.xml
   [junit4]   2> 261721 T881 oass.IndexSchema.readSchema [nodes_used_collection_shard2_replica1] Schema name=test
   [junit4]   2> 261729 T865 oass.IndexSchema.readSchema Reading Solr Schema from schema.xml
   [junit4]   2> 261746 T852 oasc.SolrConfig.<init> Loaded SolrConfig: solrconfig.xml
   [junit4]   2> 261753 T852 oass.IndexSchema.readSchema Reading Solr Schema from schema.xml
   [junit4]   2> 261758 T865 oass.IndexSchema.readSchema [nodes_used_collection_shard1_replica1] Schema name=test
   [junit4]   2> 261764 T852 oass.IndexSchema.readSchema [nodes_used_collection_shard1_replica2] Schema name=test
   [junit4]   2> 262480 T881 oass.OpenExchangeRatesOrgProvider.init Initialized with rates=open-exchange-rates.json, refreshInterval=1440.
   [junit4]   2> 262482 T838 oass.OpenExchangeRatesOrgProvider.init Initialized with rates=open-exchange-rates.json, refreshInterval=1440.
   [junit4]   2> 262488 T881 oass.IndexSchema.readSchema default search field in schema is text
   [junit4]   2> 262489 T838 oass.IndexSchema.readSchema default search field in schema is text
   [junit4]   2> 262492 T865 oass.OpenExchangeRatesOrgProvider.init Initialized with rates=open-exchange-rates.json, refreshInterval=1440.
   [junit4]   2> 262492 T881 oass.IndexSchema.readSchema unique key field: id
   [junit4]   2> 262494 T838 oass.IndexSchema.readSchema unique key field: id
   [junit4]   2> 262498 T865 oass.IndexSchema.readSchema default search field in schema is text
   [junit4]   2> 262501 T865 oass.IndexSchema.readSchema unique key field: id
   [junit4]   2> 262522 T881 oass.FileExchangeRateProvider.reload Reloading exchange rates from file currency.xml
   [junit4]   2> 262536 T881 oass.FileExchangeRateProvider.reload Reloading exchange rates from file currency.xml
   [junit4]   2> 262542 T838 oass.FileExchangeRateProvider.reload Reloading exchange rates from file currency.xml
   [junit4]   2> 262543 T852 oass.OpenExchangeRatesOrgProvider.init Initialized with rates=open-exchange-rates.json, refreshInterval=1440.
   [junit4]   2> 262543 T881 oass.OpenExchangeRatesOrgProvider.reload Reloading exchange rates from open-exchange-rates.json
   [junit4]   2> 262544 T865 oass.FileExchangeRateProvider.reload Reloading exchange rates from file currency.xml
   [junit4]   2> 262545 T881 oass.OpenExchangeRatesOrgProvider$OpenExchangeRates.<init> WARN Unknown key IMPORTANT NOTE
   [junit4]   2> 262545 T881 oass.OpenExchangeRatesOrgProvider$OpenExchangeRates.<init> WARN Expected key, got STRING
   [junit4]   2> 262545 T881 oass.OpenExchangeRatesOrgProvider.reload Reloading exchange rates from open-exchange-rates.json
   [junit4]   2> 262546 T838 oass.FileExchangeRateProvider.reload Reloading exchange rates from file currency.xml
   [junit4]   2> 262547 T881 oass.OpenExchangeRatesOrgProvider$OpenExchangeRates.<init> WARN Unknown key IMPORTANT NOTE
   [junit4]   2> 262547 T881 oass.OpenExchangeRatesOrgProvider$OpenExchangeRates.<init> WARN Expected key, got STRING
   [junit4]   2> 262548 T881 oasc.SolrCore.initDirectoryFactory org.apache.solr.core.MockDirectoryFactory
   [junit4]   2> 262550 T881 oasc.SolrCore.<init> [nodes_used_collection_shard2_replica1] Opening new SolrCore at /mnt/ssd/jenkins/workspace/Lucene-Solr-trunk-Linux/solr/build/solr-core/test/J1/./org.apache.solr.cloud.CollectionsAPIDistributedZkTest-jetty4-1375445004239/nodes_used_collection_shard2_replica1/, dataDir=/mnt/ssd/jenkins/workspace/Lucene-Solr-trunk-Linux/solr/build/solr-core/test/J1/./org.apache.solr.cloud.CollectionsAPIDistributedZkTest-jetty4-1375445004239//nodes_used_collection_shard2_replica1/data/
   [junit4]   2> 262550 T881 oasc.JmxMonitoredMap.<init> JMX monitoring is enabled. Adding Solr mbeans to JMX Server: com.sun.jmx.mbeanserver.JmxMBeanServer@3cd16578
   [junit4]   2> 262550 T865 oass.FileExchangeRateProvider.reload Reloading exchange rates from file currency.xml
   [junit4]   2> 262551 T881 oasc.CachingDirectoryFactory.get return new directory for /mnt/ssd/jenkins/workspace/Lucene-Solr-trunk-Linux/solr/build/solr-core/test/J1/./org.apache.solr.cloud.CollectionsAPIDistributedZkTest-jetty4-1375445004239//nodes_used_collection_shard2_replica1/data
   [junit4]   2> 262552 T881 oasc.SolrCore.getNewIndexDir New index directory detected: old=null new=/mnt/ssd/jenkins/workspace/Lucene-Solr-trunk-Linux/solr/build/solr-core/test/J1/./org.apache.solr.cloud.CollectionsAPIDistributedZkTest-jetty4-1375445004239//nodes_used_collection_shard2_replica1/data/index/
   [junit4]   2> 262552 T881 oasc.SolrCore.initIndex WARN [nodes_used_collection_shard2_replica1] Solr index directory '/mnt/ssd/jenkins/workspace/Lucene-Solr-trunk-Linux/solr/build/solr-core/test/J1/./org.apache.solr.cloud.CollectionsAPIDistributedZkTest-jetty4-1375445004239/nodes_used_collection_shard2_replica1/data/index' doesn't exist. Creating new index...
   [junit4]   2> 262553 T881 oasc.CachingDirectoryFactory.get return new directory for /mnt/ssd/jenkins/workspace/Lucene-Solr-trunk-Linux/solr/build/solr-core/test/J1/./org.apache.solr.cloud.CollectionsAPIDistributedZkTest-jetty4-1375445004239//nodes_used_collection_shard2_replica1/data/index
   [junit4]   2> 262552 T852 oass.IndexSchema.readSchema default search field in schema is text
   [junit4]   2> 262555 T881 oasc.SolrDeletionPolicy.onCommit SolrDeletionPolicy.onCommit: commits: num=1
   [junit4]   2> commit{dir=MockDirWrapper(org.apache.lucene.store.RAMDirectory@9abcc5a lockFactory=org.apache.lucene.store.NativeFSLockFactory@7b916a3a),segFN=segments_1,generation=1}
   [junit4]   2> 262559 T881 oasc.SolrDeletionPolicy.updateCommits newest commit generation = 1
   [junit4]   2> 262555 T838 oass.OpenExchangeRatesOrgProvider.reload Reloading exchange rates from open-exchange-rates.json
   [junit4]   2> 262563 T881 oasup.UpdateRequestProcessorChain.init inserting DistributedUpdateProcessorFactory into updateRequestProcessorChain "dedupe"
   [junit4]   2> 262555 T865 oass.OpenExchangeRatesOrgProvider.reload Reloading exchange rates from open-exchange-rates.json
   [junit4]   2> 262562 T852 oass.IndexSchema.readSchema unique key field: id
   [junit4]   2> 262564 T881 oasup.UpdateRequestProcessorChain.init inserting DistributedUpdateProcessorFactory into updateRequestProcessorChain "stored_sig"
   [junit4]   2> 262565 T881 oasup.UpdateRequestProcessorChain.init inserting DistributedUpdateProcessorFactory into updateRequestProcessorChain "distrib-dup-test-chain-implicit"
   [junit4]   2> 262565 T838 oass.OpenExchangeRatesOrgProvider$OpenExchangeRates.<init> WARN Unknown key IMPORTANT NOTE
   [junit4]   2> 262566 T881 oasc.RequestHandlers.initHandlersFromConfig created standard: solr.StandardRequestHandler
   [junit4]   2> 262566 T838 oass.OpenExchangeRatesOrgProvider$OpenExchangeRates.<init> WARN Expected key, got STRING
   [junit4]   2> 262567 T838 oass.OpenExchangeRatesOrgProvider.reload Reloading exchange rates from open-exchange-rates.json
   [junit4]   2> 262567 T865 oass.OpenExchangeRatesOrgProvider$OpenExchangeRates.<init> WARN Unknown key IMPORTANT NOTE
   [junit4]   2> 262567 T865 oass.OpenExchangeRatesOrgProvider$OpenExchangeRates.<init> WARN Expected key, got STRING
   [junit4]   2> 262567 T881 oasc.RequestHandlers.initHandlersFromConfig created /get: solr.RealTimeGetHandler
   [junit4]   2> 262568 T838 oass.OpenExchangeRatesOrgProvider$OpenExchangeRates.<init> WARN Unknown key IMPORTANT NOTE
   [junit4]   2> 262568 T838 oass.OpenExchangeRatesOrgProvider$OpenExchangeRates.<init> WARN Expected key, got STRING
   [junit4]   2> 262568 T865 oass.OpenExchangeRatesOrgProvider.reload Reloading exchange rates from open-exchange-rates.json
   [junit4]   2> 262569 T838 oasc.SolrCore.initDirectoryFactory org.apache.solr.core.MockDirectoryFactory
   [junit4]   2> 262568 T881 oasc.RequestHandlers.initHandlersFromConfig adding lazy requestHandler: solr.ReplicationHandler
   [junit4]   2> 262570 T838 oasc.SolrCore.<init> [nodes_used_collection_shard2_replica2] Opening new SolrCore at /mnt/ssd/jenkins/workspace/Lucene-Solr-trunk-Linux/solr/build/solr-core/test/J1/./org.apache.solr.cloud.CollectionsAPIDistributedZkTest-jetty1-1375445000660/nodes_used_collection_shard2_replica2/, dataDir=/mnt/ssd/jenkins/workspace/Lucene-Solr-trunk-Linux/solr/build/solr-core/test/J1/./org.apache.solr.cloud.CollectionsAPIDistributedZkTest-jetty1-1375445000660//nodes_used_collection_shard2_replica2/data/
   [junit4]   2> 262574 T838 oasc.JmxMonitoredMap.<init> JMX monitoring is enabled. Adding Solr mbeans to JMX Server: com.sun.jmx.mbeanserver.JmxMBeanServer@3cd16578
   [junit4]   2> 262571 T865 oass.OpenExchangeRatesOrgProvider$OpenExchangeRates.<init> WARN Unknown key IMPORTANT NOTE
   [junit4]   2> 262570 T881 oasc.RequestHandlers.initHandlersFromConfig created /replication: solr.ReplicationHandler
   [junit4]   2> 262576 T865 oass.OpenExchangeRatesOrgProvider$OpenExchangeRates.<init> WARN Expected key, got STRING
   [junit4]   2> 262575 T838 oasc.CachingDirectoryFactory.get return new directory for /mnt/ssd/jenkins/workspace/Lucene-Solr-trunk-Linux/solr/build/solr-core/test/J1/./org.apache.solr.cloud.CollectionsAPIDistributedZkTest-jetty1-1375445000660//nodes_used_collection_shard2_replica2/data
   [junit4]   2> 262576 T865 oasc.SolrCore.initDirectoryFactory org.apache.solr.core.MockDirectoryFactory
   [junit4]   2> 262577 T838 oasc.SolrCore.getNewIndexDir New index directory detected: old=null new=/mnt/ssd/jenkins/workspace/Lucene-Solr-trunk-Linux/solr/build/solr-core/test/J1/./org.apache.solr.cloud.CollectionsAPIDistributedZkTest-jetty1-1375445000660//nodes_used_collection_shard2_replica2/data/index/
   [junit4]   2> 262578 T838 oasc.SolrCore.initIndex WARN [nodes_used_collection_shard2_replica2] Solr index directory '/mnt/ssd/jenkins/workspace/Lucene-Solr-trunk-Linux/solr/build/solr-core/test/J1/./org.apache.solr.cloud.CollectionsAPIDistributedZkTest-jetty1-1375445000660/nodes_used_collection_shard2_replica2/data/index' doesn't exist. Creating new index...
   [junit4]   2> 262577 T865 oasc.SolrCore.<init> [nodes_used_collection_shard1_replica1] Opening new SolrCore at /mnt/ssd/jenkins/workspace/Lucene-Solr-trunk-Linux/solr/build/solr-core/test/J1/./org.apache.solr.cloud.CollectionsAPIDistributedZkTest-jetty3-1375445003051/nodes_used_collection_shard1_replica1/, dataDir=/mnt/ssd/jenkins/workspace/Lucene-Solr-trunk-Linux/solr/build/solr-core/test/J1/./org.apache.solr.cloud.CollectionsAPIDistributedZkTest-jetty3-1375445003051//nodes_used_collection_shard1_replica1/data/
   [junit4]   2> 262579 T865 oasc.JmxMonitoredMap.<init> JMX monitoring is enabled. Adding Solr mbeans to JMX Server: com.sun.jmx.mbeanserver.JmxMBeanServer@3cd16578
   [junit4]   2> 262578 T838 oasc.CachingDirectoryFactory.get return new directory for /mnt/ssd/jenkins/workspace/Lucene-Solr-trunk-Linux/solr/build/solr-core/test/J1/./org.apache.solr.cloud.CollectionsAPIDistributedZkTest-jetty1-1375445000660//nodes_used_collection_shard2_replica2/data/index
   [junit4]   2> 262578 T881 oasc.RequestHandlers.initHandlersFromConfig created /update: solr.UpdateRequestHandler
   [junit4]   2> 262580 T881 oasc.RequestHandlers.initHandlersFromConfig created /admin/: org.apache.solr.handler.admin.AdminHandlers
   [junit4]   2> 262581 T865 oasc.CachingDirectoryFactory.get return new directory for /mnt/ssd/jenkins/workspace/Lucene-Solr-trunk-Linux/solr/build/solr-core/test/J1/./org.apache.solr.cloud.CollectionsAPIDistributedZkTest-jetty3-1375445003051//nodes_used_collection_shard1_replica1/data
   [junit4]   2> 262581 T865 oasc.SolrCore.getNewIndexDir New index directory detected: old=null new=/mnt/ssd/jenkins/workspace/Lucene-Solr-trunk-Linux/solr/build/solr-core/test/J1/./org.apache.solr.cloud.CollectionsAPIDistributedZkTest-jetty3-1375445003051//nodes_used_collection_shard1_replica1/data/index/
   [junit4]   2> 262581 T865 oasc.SolrCore.initIndex WARN [nodes_used_collection_shard1_replica1] Solr index directory '/mnt/ssd/jenkins/workspace/Lucene-Solr-trunk-Linux/solr/build/solr-core/test/J1/./org.apache.solr.cloud.CollectionsAPIDistributedZkTest-jetty3-1375445003051/nodes_used_collection_shard1_replica1/data/index' doesn't exist. Creating new index...
   [junit4]   2> 262582 T865 oasc.CachingDirectoryFactory.get return new directory for /mnt/ssd/jenkins/workspace/Lucene-Solr-trunk-Linux/solr/build/solr-core/test/J1/./org.apache.solr.cloud.CollectionsAPIDistributedZkTest-jetty3-1375445003051//nodes_used_collection_shard1_replica1/data/index
   [junit4]   2> 262585 T852 oass.FileExchangeRateProvider.reload Reloading exchange rates from file currency.xml
   [junit4]   2> 262584 T881 oashl.XMLLoader.init xsltCacheLifetimeSeconds=60
   [junit4]   2> 262582 T838 oasc.SolrDeletionPolicy.onCommit SolrDeletionPolicy.onCommit: commits: num=1
   [junit4]   2> commit{dir=MockDirWrapper(org.apache.lucene.store.RAMDirectory@6bf67b1e lockFactory=org.apache.lucene.store.NativeFSLockFactory@32ac4cf3),segFN=segments_1,generation=1}
   [junit4]   2> 262589 T865 oasc.SolrDeletionPolicy.onCommit SolrDeletionPolicy.onCommit: commits: num=1
   [junit4]   2> commit{dir=MockDirWrapper(org.apache.lucene.store.RAMDirectory@3b448729 lockFactory=org.apache.lucene.store.NativeFSLockFactory@72fd8f21),segFN=segments_1,generation=1}
   [junit4]   2> 262590 T865 oasc.SolrDeletionPolicy.updateCommits newest commit generation = 1
   [junit4]   2> 262589 T838 oasc.SolrDeletionPolicy.updateCommits newest commit generation = 1
   [junit4]   2> 262592 T881 oass.SolrIndexSearcher.<init> Opening Searcher@1d77f10d main
   [junit4]   2> 262593 T881 oasu.CommitTracker.<init> Hard AutoCommit: disabled
   [junit4]   2> 262593 T881 oasu.CommitTracker.<init> Soft AutoCommit: disabled
   [junit4]   2> 262595 T838 oasup.UpdateRequestProcessorChain.init inserting DistributedUpdateProcessorFactory into updateRequestProcessorChain "dedupe"
   [junit4]   2> 262595 T865 oasup.UpdateRequestProcessorChain.init inserting DistributedUpdateProcessorFactory into updateRequestProcessorChain "dedupe"
   [junit4]   2> 262595 T838 oasup.UpdateRequestProcessorChain.init inserting DistributedUpdateProcessorFactory into updateRequestProcessorChain "stored_sig"
   [junit4]   2> 262596 T865 oasup.UpdateRequestProcessorChain.init inserting DistributedUpdateProcessorFactory into updateRequestProcessorChain "stored_sig"
   [junit4]   2> 262596 T852 oass.FileExchangeRateProvider.reload Reloading exchange rates from file currency.xml
   [junit4]   2> 262597 T865 oasup.UpdateRequestProcessorChain.init inserting DistributedUpdateProcessorFactory into updateRequestProcessorChain "distrib-dup-test-chain-implicit"
   [junit4]   2> 262598 T865 oasc.RequestHandlers.initHandlersFromConfig created standard: solr.StandardRequestHandler
   [junit4]   2> 262598 T892 oasc.SolrCore.registerSearcher [nodes_used_collection_shard2_replica1] Registered new searcher Searcher@1d77f10d main{StandardDirectoryReader(segments_1:1)}
   [junit4]   2> 262599 T865 oasc.RequestHandlers.initHandlersFromConfig created /get: solr.RealTimeGetHandler
   [junit4]   2> 262600 T865 oasc.RequestHandlers.initHandlersFromConfig adding lazy requestHandler: solr.ReplicationHandler
   [junit4]   2> 262600 T865 oasc.RequestHandlers.initHandlersFromConfig created /replication: solr.ReplicationHandler
   [junit4]   2> 262602 T881 oasc.CoreContainer.registerCore registering core: nodes_used_collection_shard2_replica1
   [junit4]   2> 262602 T881 oasc.ZkController.register Register replica - core:nodes_used_collection_shard2_replica1 address:http://127.0.0.1:56721 collection:nodes_used_collection shard:shard2
   [junit4]   2> 262601 T838 oasup.UpdateRequestProcessorChain.init inserting DistributedUpdateProcessorFactory into updateRequestProcessorChain "distrib-dup-test-chain-implicit"
   [junit4]   2> 262606 T838 oasc.RequestHandlers.initHandlersFromConfig created standard: solr.StandardRequestHandler
   [junit4]   2> 262607 T838 oasc.RequestHandlers.initHandlersFromConfig created /get: solr.RealTimeGetHandler
   [junit4]   2> 262607 T838 oasc.RequestHandlers.initHandlersFromConfig adding lazy requestHandler: solr.ReplicationHandler
   [junit4]   2> 262601 T852 oass.OpenExchangeRatesOrgProvider.reload Reloading exchange rates from open-exchange-rates.json
   [junit4]   2> 262608 T838 oasc.RequestHandlers.initHandlersFromConfig created /replication: solr.ReplicationHandler
   [junit4]   2> 262610 T838 oasc.RequestHandlers.initHandlersFromConfig created /update: solr.UpdateRequestHandler
   [junit4]   2> 262611 T838 oasc.RequestHandlers.initHandlersFromConfig created /admin/: org.apache.solr.handler.admin.AdminHandlers
   [junit4]   2> 262604 T881 oascsi.HttpClientUtil.createClient Creating new http client, config:maxConnections=10000&maxConnectionsPerHost=20&connTimeout=15000&socketTimeout=30000&retry=false
   [junit4]   2> 262602 T865 oasc.RequestHandlers.initHandlersFromConfig created /update: solr.UpdateRequestHandler
   [junit4]   2> 262619 T838 oashl.XMLLoader.init xsltCacheLifetimeSeconds=60
   [junit4]   2> 262614 T852 oass.OpenExchangeRatesOrgProvider$OpenExchangeRates.<init> WARN Unknown key IMPORTANT NOTE
   [junit4]   2> 262621 T852 oass.OpenExchangeRatesOrgProvider$OpenExchangeRates.<init> WARN Expected key, got STRING
   [junit4]   2> 262619 T865 oasc.RequestHandlers.initHandlersFromConfig created /admin/: org.apache.solr.handler.admin.AdminHandlers
   [junit4]   2> 262621 T852 oass.OpenExchangeRatesOrgProvider.reload Reloading exchange rates from open-exchange-rates.json
   [junit4]   2> 262621 T881 oascc.SolrZkClient.makePath makePath: /collections/nodes_used_collection/leader_elect/shard2/election
   [junit4]   2> 262622 T838 oass.SolrIndexSearcher.<init> Opening Searcher@7749a3e main
   [junit4]   2> 262623 T838 oasu.CommitTracker.<init> Hard AutoCommit: disabled
   [junit4]   2> 262623 T838 oasu.CommitTracker.<init> Soft AutoCommit: disabled
   [junit4]   2> 262623 T852 oass.OpenExchangeRatesOrgProvider$OpenExchangeRates.<init> WARN Unknown key IMPORTANT NOTE
   [junit4]   2> 262624 T852 oass.OpenExchangeRatesOrgProvider$OpenExchangeRates.<init> WARN Expected key, got STRING
   [junit4]   2> 262623 T865 oashl.XMLLoader.init xsltCacheLifetimeSeconds=60
   [junit4]   2> 262624 T852 oasc.SolrCore.initDirectoryFactory org.apache.solr.core.MockDirectoryFactory
   [junit4]   2> 262624 T852 oasc.SolrCore.<init> [nodes_used_collection_shard1_replica2] Opening new SolrCore at /mnt/ssd/jenkins/workspace/Lucene-Solr-trunk-Linux/solr/build/solr-core/test/J1/./org.apache.solr.cloud.CollectionsAPIDistributedZkTest-jetty2-1375445001853/nodes_used_collection_shard1_replica2/, dataDir=/mnt/ssd/jenkins/workspace/Lucene-Solr-trunk-Linux/solr/build/solr-core/test/J1/./org.apache.solr.cloud.CollectionsAPIDistributedZkTest-jetty2-1375445001853//nodes_used_collection_shard1_replica2/data/
   [junit4]   2> 262625 T852 oasc.JmxMonitoredMap.<init> JMX monitoring is enabled. Adding Solr mbeans to JMX Server: com.sun.jmx.mbeanserver.JmxMBeanServer@3cd16578
   [junit4]   2> 262626 T852 oasc.CachingDirectoryFactory.get return new directory for /mnt/ssd/jenkins/workspace/Lucene-Solr-trunk-Linux/solr/build/solr-core/test/J1/./org.apache.solr.cloud.CollectionsAPIDistributedZkTest-jetty2-1375445001853//nodes_used_collection_shard1_replica2/data
   [junit4]   2> 262626 T852 oasc.SolrCore.getNewIndexDir New index directory detected: old=null new=/mnt/ssd/jenkins/workspace/Lucene-Solr-trunk-Linux/solr/build/solr-core/test/J1/./org.apache.solr.cloud.CollectionsAPIDistributedZkTest-jetty2-1375445001853//nodes_used_collection_shard1_replica2/data/index/
   [junit4]   2> 262627 T865 oass.SolrIndexSearcher.<init> Opening Searcher@73f56ecd main
   [junit4]   2> 262627 T852 oasc.SolrCore.initIndex WARN [nodes_used_collection_shard1_replica2] Solr index directory '/mnt/ssd/jenkins/workspace/Lucene-Solr-trunk-Linux/solr/build/solr-core/test/J1/./org.apache.solr.cloud.CollectionsAPIDistributedZkTest-jetty2-1375445001853/nodes_used_collection_shard1_replica2/data/index' doesn't exist. Creating new index...
   [junit4]   2> 262627 T893 oasc.SolrCore.registerSearcher [nodes_used_collection_shard2_replica2] Registered new searcher Searcher@7749a3e main{StandardDirectoryReader(segments_1:1)}
   [junit4]   2> 262628 T865 oasu.CommitTracker.<init> Hard AutoCommit: disabled
   [junit4]   2> 262628 T865 oasu.CommitTracker.<init> Soft AutoCommit: disabled
   [junit4]   2> 262628 T852 oasc.CachingDirectoryFactory.get return new directory for /mnt/ssd/jenkins/workspace/Lucene-Solr-trunk-Linux/solr/build/solr-core/test/J1/./org.apache.solr.cloud.CollectionsAPIDistributedZkTest-jetty2-1375445001853//nodes_used_collection_shard1_replica2/data/index
   [junit4]   2> 262635 T894 oasc.SolrCore.registerSearcher [nodes_used_collection_shard1_replica1] Registered new searcher Searcher@73f56ecd main{StandardDirectoryReader(segments_1:1)}
   [junit4]   2> 262635 T852 oasc.SolrDeletionPolicy.onCommit SolrDeletionPolicy.onCommit: commits: num=1
   [junit4]   2> commit{dir=MockDirWrapper(org.apache.lucene.store.RAMDirectory@763d9034 lockFactory=org.apache.lucene.store.NativeFSLockFactory@59603eb),segFN=segments_1,generation=1}
   [junit4]   2> 262636 T852 oasc.SolrDeletionPolicy.updateCommits newest commit generation = 1
   [junit4]   2> 262638 T865 oasc.CoreContainer.registerCore registering core: nodes_used_collection_shard1_replica1
   [junit4]   2> 262638 T865 oasc.ZkController.register Register replica - core:nodes_used_collection_shard1_replica1 address:http://127.0.0.1:60458 collection:nodes_used_collection shard:shard1
   [junit4]   2> 262638 T865 oascsi.HttpClientUtil.createClient Creating new http client, config:maxConnections=10000&maxConnectionsPerHost=20&connTimeout=15000&socketTimeout=30000&retry=false
   [junit4]   2> 262639 T881 oasc.ShardLeaderElectionContext.runLeaderProcess Running the leader process for shard shard2
   [junit4]   2> 262638 T838 oasc.CoreContainer.registerCore registering core: nodes_used_collection_shard2_replica2
   [junit4]   2> 262640 T838 oasc.ZkController.register Register replica - core:nodes_used_collection_shard2_replica2 address:http://127.0.0.1:49865 collection:nodes_used_collection shard:shard2
   [junit4]   2> 262641 T838 oascsi.HttpClientUtil.createClient Creating new http client, config:maxConnections=10000&maxConnectionsPerHost=20&connTimeout=15000&socketTimeout=30000&retry=false
   [junit4]   2> 262641 T852 oasup.UpdateRequestProcessorChain.init inserting DistributedUpdateProcessorFactory into updateRequestProcessorChain "dedupe"
   [junit4]   2> 262641 T852 oasup.UpdateRequestProcessorChain.init inserting DistributedUpdateProcessorFactory into updateRequestProcessorChain "stored_sig"
   [junit4]   2> 262642 T881 oasc.ShardLeaderElectionContext.waitForReplicasToComeUp Waiting until we see more replicas up for shard shard2: total=2 found=1 timeoutin=179999
   [junit4]   2> 262642 T852 oasup.UpdateRequestProcessorChain.init inserting DistributedUpdateProcessorFactory into updateRequestProcessorChain "distrib-dup-test-chain-implicit"
   [junit4]   2> 262642 T852 oasc.RequestHandlers.initHandlersFromConfig created standard: solr.StandardRequestHandler
   [junit4]   2> 262643 T852 oasc.RequestHandlers.initHandlersFromConfig created /get: solr.RealTimeGetHandler
   [junit4]   2> 262643 T852 oasc.RequestHandlers.initHandlersFromConfig adding lazy requestHandler: solr.ReplicationHandler
   [junit4]   2> 262644 T852 oasc.RequestHandlers.initHandlersFromConfig created /replication: solr.ReplicationHandler
   [junit4]   2> 262645 T852 oasc.RequestHandlers.initHandlersFromConfig created /update: solr.UpdateRequestHandler
   [junit4]   2> 262645 T852 oasc.RequestHandlers.initHandlersFromConfig created /admin/: org.apache.solr.handler.admin.AdminHandlers
   [junit4]   2> 262646 T865 oascc.SolrZkClient.makePath makePath: /collections/nodes_used_collection/leader_elect/shard1/election
   [junit4]   2> 262650 T852 oashl.XMLLoader.init xsltCacheLifetimeSeconds=60
   [junit4]   2> 262656 T852 oass.SolrIndexSearcher.<init> Opening Searcher@53ac3484 main
   [junit4]   2> 262657 T865 oasc.ShardLeaderElectionContext.runLeaderProcess Running the leader process for shard shard1
   [junit4]   2> 262658 T852 oasu.CommitTracker.<init> Hard AutoCommit: disabled
   [junit4]   2> 262658 T852 oasu.CommitTracker.<init> Soft AutoCommit: disabled
   [junit4]   2> 262660 T865 oasc.ShardLeaderElectionContext.waitForReplicasToComeUp Waiting until we see more replicas up for shard shard1: total=2 found=1 timeoutin=180000
   [junit4]   2> 262662 T895 oasc.SolrCore.registerSearcher [nodes_used_collection_shard1_replica2] Registered new searcher Searcher@53ac3484 main{StandardDirectoryReader(segments_1:1)}
   [junit4]   2> 262663 T852 oasc.CoreContainer.registerCore registering core: nodes_used_collection_shard1_replica2
   [junit4]   2> 262663 T852 oasc.ZkController.register Register replica - core:nodes_used_collection_shard1_replica2 address:http://127.0.0.1:39094 collection:nodes_used_collection shard:shard1
   [junit4]   2> 262664 T852 oascsi.HttpClientUtil.createClient Creating new http client, config:maxConnections=10000&maxConnectionsPerHost=20&connTimeout=15000&socketTimeout=30000&retry=false
   [junit4]   2> 263143 T881 oasc.ShardLeaderElectionContext.waitForReplicasToComeUp Enough replicas found to continue.
   [junit4]   2> 263144 T881 oasc.ShardLeaderElectionContext.runLeaderProcess I may be the new leader - try and sync
   [junit4]   2> 263144 T881 oasc.SyncStrategy.sync Sync replicas to http://127.0.0.1:56721/nodes_used_collection_shard2_replica1/
   [junit4]   2> 263145 T881 oasu.PeerSync.sync PeerSync: core=nodes_used_collection_shard2_replica1 url=http://127.0.0.1:56721 START replicas=[http://127.0.0.1:49865/nodes_used_collection_shard2_replica2/] nUpdates=100
   [junit4]   2> 263145 T881 oasu.PeerSync.sync PeerSync: core=nodes_used_collection_shard2_replica1 url=http://127.0.0.1:56721 DONE.  We have no versions.  sync failed.
   [junit4]   2> 263146 T881 oasc.SyncStrategy.syncReplicas Leader's attempt to sync with shard failed, moving to the next candidate
   [junit4]   2> 263146 T881 oasc.ShardLeaderElectionContext.runLeaderProcess We failed sync, but we have no versions - we can't sync in that case - we were active before, so become leader anyway
   [junit4]   2> 263146 T881 oasc.ShardLeaderElectionContext.runLeaderProcess I am the new leader: http://127.0.0.1:56721/nodes_used_collection_shard2_replica1/ shard2
   [junit4]   2> 263147 T881 oascc.SolrZkClient.makePath makePath: /collections/nodes_used_collection/leaders/shard2
   [junit4]   2> ASYNC  NEW_CORE C288 name=nodes_used_collection_shard2_replica2 org.apache.solr.core.SolrCore@cc83eb9 url=http://127.0.0.1:49865/nodes_used_collection_shard2_replica2 node=127.0.0.1:49865_ C288_STATE=coll:nodes_used_collection core:nodes_used_collection_shard2_replica2 props:{state=down, core=nodes_used_collection_shard2_replica2, node_name=127.0.0.1:49865_, base_url=http://127.0.0.1:49865}
   [junit4]   2> 263155 T837 C288 P49865 oasc.SolrCore.execute [nodes_used_collection_shard2_replica2] webapp= path=/get params={getVersions=100&distrib=false&wt=javabin&qt=/get&version=2} status=0 QTime=0
   [junit4]   2> 263161 T865 oasc.ShardLeaderElectionContext.waitForReplicasToComeUp Enough replicas found to continue.
   [junit4]   2> 263162 T865 oasc.ShardLeaderElectionContext.runLeaderProcess I may be the new leader - try and sync
   [junit4]   2> 263162 T865 oasc.SyncStrategy.sync Sync replicas to http://127.0.0.1:60458/nodes_used_collection_shard1_replica1/
   [junit4]   2> 263162 T865 oasu.PeerSync.sync PeerSync: core=nodes_used_collection_shard1_replica1 url=http://127.0.0.1:60458 START replicas=[http://127.0.0.1:39094/nodes_used_collection_shard1_replica2/] nUpdates=100
   [junit4]   2> 263163 T865 oasu.PeerSync.sync PeerSync: core=nodes_used_collection_shard1_replica1 url=http://127.0.0.1:60458 DONE.  We have no versions.  sync failed.
   [junit4]   2> 263163 T865 oasc.SyncStrategy.syncReplicas Leader's attempt to sync with shard failed, moving to the next candidate
   [junit4]   2> 263164 T865 oasc.ShardLeaderElectionContext.runLeaderProcess We failed sync, but we have no versions - we can't sync in that case - we were active before, so become leader anyway
   [junit4]   2> 263164 T865 oasc.ShardLeaderElectionContext.runLeaderProcess I am the new leader: http://127.0.0.1:60458/nodes_used_collection_shard1_replica1/ shard1
   [junit4]   2> 263164 T865 oascc.SolrZkClient.makePath makePath: /collections/nodes_used_collection/leaders/shard1
   [junit4]   2> ASYNC  NEW_CORE C289 name=nodes_used_collection_shard1_replica2 org.apache.solr.core.SolrCore@4b0058c9 url=http://127.0.0.1:39094/nodes_used_collection_shard1_replica2 node=127.0.0.1:39094_ C289_STATE=coll:nodes_used_collection core:nodes_used_collection_shard1_replica2 props:{state=down, core=nodes_used_collection_shard1_replica2, node_name=127.0.0.1:39094_, base_url=http://127.0.0.1:39094}
   [junit4]   2> 263179 T854 C289 P39094 oasc.SolrCore.execute [nodes_used_collection_shard1_replica2] webapp= path=/get params={getVersions=100&distrib=false&wt=javabin&qt=/get&version=2} status=0 QTime=0
   [junit4]   2> 264051 T827 oascc.ZkStateReader.updateClusterState Updating cloud state from ZooKeeper...
   [junit4]   2> 264066 T858 oascc.ZkStateReader$2.process A cluster state change: WatchedE

[...truncated too long message...]

ion.create(KeeperException.java:51)
   [junit4]   2> at org.apache.zookeeper.ZooKeeper.getChildren(ZooKeeper.java:1468)
   [junit4]   2> at org.apache.solr.common.cloud.SolrZkClient$6.execute(SolrZkClient.java:235)
   [junit4]   2> at org.apache.solr.common.cloud.SolrZkClient$6.execute(SolrZkClient.java:232)
   [junit4]   2> at org.apache.solr.common.cloud.ZkCmdExecutor.retryOperation(ZkCmdExecutor.java:65)
   [junit4]   2> at org.apache.solr.common.cloud.SolrZkClient.getChildren(SolrZkClient.java:232)
   [junit4]   2> at org.apache.solr.cloud.LeaderElector.checkIfIamLeader(LeaderElector.java:84)
   [junit4]   2> at org.apache.solr.cloud.LeaderElector.access$000(LeaderElector.java:55)
   [junit4]   2> at org.apache.solr.cloud.LeaderElector$1.process(LeaderElector.java:129)
   [junit4]   2> at org.apache.zookeeper.ClientCnxn$EventThread.processEvent(ClientCnxn.java:519)
   [junit4]   2> at org.apache.zookeeper.ClientCnxn$EventThread.run(ClientCnxn.java:495)
   [junit4]   2>
   [junit4]   2> 393050 T886 oasc.LeaderElector$1.process WARN  org.apache.zookeeper.KeeperException$SessionExpiredException: KeeperErrorCode = Session expired for /collections/new_implicit_coll_0/leader_elect/d/election
   [junit4]   2> at org.apache.zookeeper.KeeperException.create(KeeperException.java:127)
   [junit4]   2> at org.apache.zookeeper.KeeperException.create(KeeperException.java:51)
   [junit4]   2> at org.apache.zookeeper.ZooKeeper.getChildren(ZooKeeper.java:1468)
   [junit4]   2> at org.apache.solr.common.cloud.SolrZkClient$6.execute(SolrZkClient.java:235)
   [junit4]   2> at org.apache.solr.common.cloud.SolrZkClient$6.execute(SolrZkClient.java:232)
   [junit4]   2> at org.apache.solr.common.cloud.ZkCmdExecutor.retryOperation(ZkCmdExecutor.java:65)
   [junit4]   2> at org.apache.solr.common.cloud.SolrZkClient.getChildren(SolrZkClient.java:232)
   [junit4]   2> at org.apache.solr.cloud.LeaderElector.checkIfIamLeader(LeaderElector.java:84)
   [junit4]   2> at org.apache.solr.cloud.LeaderElector.access$000(LeaderElector.java:55)
   [junit4]   2> at org.apache.solr.cloud.LeaderElector$1.process(LeaderElector.java:129)
   [junit4]   2> at org.apache.zookeeper.ClientCnxn$EventThread.processEvent(ClientCnxn.java:519)
   [junit4]   2> at org.apache.zookeeper.ClientCnxn$EventThread.run(ClientCnxn.java:495)
   [junit4]   2>
   [junit4]   2> 393050 T886 oasc.LeaderElector$1.process WARN  org.apache.zookeeper.KeeperException$SessionExpiredException: KeeperErrorCode = Session expired for /collections/new_implicit_coll_1/leader_elect/a/election
   [junit4]   2> at org.apache.zookeeper.KeeperException.create(KeeperException.java:127)
   [junit4]   2> at org.apache.zookeeper.KeeperException.create(KeeperException.java:51)
   [junit4]   2> at org.apache.zookeeper.ZooKeeper.getChildren(ZooKeeper.java:1468)
   [junit4]   2> at org.apache.solr.common.cloud.SolrZkClient$6.execute(SolrZkClient.java:235)
   [junit4]   2> at org.apache.solr.common.cloud.SolrZkClient$6.execute(SolrZkClient.java:232)
   [junit4]   2> at org.apache.solr.common.cloud.ZkCmdExecutor.retryOperation(ZkCmdExecutor.java:65)
   [junit4]   2> at org.apache.solr.common.cloud.SolrZkClient.getChildren(SolrZkClient.java:232)
   [junit4]   2> at org.apache.solr.cloud.LeaderElector.checkIfIamLeader(LeaderElector.java:84)
   [junit4]   2> at org.apache.solr.cloud.LeaderElector.access$000(LeaderElector.java:55)
   [junit4]   2> at org.apache.solr.cloud.LeaderElector$1.process(LeaderElector.java:129)
   [junit4]   2> at org.apache.zookeeper.ClientCnxn$EventThread.processEvent(ClientCnxn.java:519)
   [junit4]   2> at org.apache.zookeeper.ClientCnxn$EventThread.run(ClientCnxn.java:495)
   [junit4]   2>
   [junit4]   2> 393051 T886 oasc.LeaderElector$1.process WARN  org.apache.zookeeper.KeeperException$SessionExpiredException: KeeperErrorCode = Session expired for /collections/new_implicit_coll_1/leader_elect/d/election
   [junit4]   2> at org.apache.zookeeper.KeeperException.create(KeeperException.java:127)
   [junit4]   2> at org.apache.zookeeper.KeeperException.create(KeeperException.java:51)
   [junit4]   2> at org.apache.zookeeper.ZooKeeper.getChildren(ZooKeeper.java:1468)
   [junit4]   2> at org.apache.solr.common.cloud.SolrZkClient$6.execute(SolrZkClient.java:235)
   [junit4]   2> at org.apache.solr.common.cloud.SolrZkClient$6.execute(SolrZkClient.java:232)
   [junit4]   2> at org.apache.solr.common.cloud.ZkCmdExecutor.retryOperation(ZkCmdExecutor.java:65)
   [junit4]   2> at org.apache.solr.common.cloud.SolrZkClient.getChildren(SolrZkClient.java:232)
   [junit4]   2> at org.apache.solr.cloud.LeaderElector.checkIfIamLeader(LeaderElector.java:84)
   [junit4]   2> at org.apache.solr.cloud.LeaderElector.access$000(LeaderElector.java:55)
   [junit4]   2> at org.apache.solr.cloud.LeaderElector$1.process(LeaderElector.java:129)
   [junit4]   2> at org.apache.zookeeper.ClientCnxn$EventThread.processEvent(ClientCnxn.java:519)
   [junit4]   2> at org.apache.zookeeper.ClientCnxn$EventThread.run(ClientCnxn.java:495)
   [junit4]   2>
   [junit4]   2> 393051 T886 oascc.ZkStateReader$3.process WARN ZooKeeper watch triggered, but Solr cannot talk to ZK
   [junit4]   2> 393052 T886 oascc.ZkStateReader$2.process A cluster state change: WatchedEvent state:SyncConnected type:NodeChildrenChanged path:/live_nodes, has occurred - updating... (live nodes size: 1)
   [junit4]   2> 393052 T886 oascc.ZkStateReader$2.process WARN ZooKeeper watch triggered, but Solr cannot talk to ZK
   [junit4]   2> 393052 T886 oasc.LeaderElector$1.process WARN  org.apache.zookeeper.KeeperException$SessionExpiredException: KeeperErrorCode = Session expired for /collections/new_implicit_coll_1/leader_elect/b/election
   [junit4]   2> at org.apache.zookeeper.KeeperException.create(KeeperException.java:127)
   [junit4]   2> at org.apache.zookeeper.KeeperException.create(KeeperException.java:51)
   [junit4]   2> at org.apache.zookeeper.ZooKeeper.getChildren(ZooKeeper.java:1468)
   [junit4]   2> at org.apache.solr.common.cloud.SolrZkClient$6.execute(SolrZkClient.java:235)
   [junit4]   2> at org.apache.solr.common.cloud.SolrZkClient$6.execute(SolrZkClient.java:232)
   [junit4]   2> at org.apache.solr.common.cloud.ZkCmdExecutor.retryOperation(ZkCmdExecutor.java:65)
   [junit4]   2> at org.apache.solr.common.cloud.SolrZkClient.getChildren(SolrZkClient.java:232)
   [junit4]   2> at org.apache.solr.cloud.LeaderElector.checkIfIamLeader(LeaderElector.java:84)
   [junit4]   2> at org.apache.solr.cloud.LeaderElector.access$000(LeaderElector.java:55)
   [junit4]   2> at org.apache.solr.cloud.LeaderElector$1.process(LeaderElector.java:129)
   [junit4]   2> at org.apache.zookeeper.ClientCnxn$EventThread.processEvent(ClientCnxn.java:519)
   [junit4]   2> at org.apache.zookeeper.ClientCnxn$EventThread.run(ClientCnxn.java:495)
   [junit4]   2>
   [junit4]   2> NOTE: test params are: codec=Lucene42: {timestamp=PostingsFormat(name=Lucene41VarGapFixedInterval), range_facet_l=PostingsFormat(name=Lucene41VarGapFixedInterval), id=PostingsFormat(name=Memory doPackFST= true), range_facet_sl=PostingsFormat(name=Memory doPackFST= true), a_t=PostingsFormat(name=Lucene41VarGapFixedInterval), text=PostingsFormat(name=MockSep), range_facet_si=PostingsFormat(name=Lucene41VarGapFixedInterval), _version_=PostingsFormat(name=Lucene41VarGapFixedInterval), other_tl1=PostingsFormat(name=Lucene41VarGapFixedInterval), multiDefault=PostingsFormat(name=Lucene41VarGapFixedInterval), a_si=PostingsFormat(name=Lucene41VarGapFixedInterval), intDefault=PostingsFormat(name=Lucene41VarGapFixedInterval)}, docValues:{timestamp=DocValuesFormat(name=Lucene42)}, sim=RandomSimilarityProvider(queryNorm=false,coord=yes): {}, locale=ja_JP_JP_#u-ca-japanese, timezone=Asia/Damascus
   [junit4]   2> NOTE: Linux 3.2.0-51-generic amd64/Oracle Corporation 1.7.0_25 (64-bit)/cpus=8,threads=12,free=37362840,total=230694912
   [junit4]   2> NOTE: All tests run in this JVM: [BasicDistributedZk2Test, HighlighterConfigTest, TestReload, TestRTGBase, DisMaxRequestHandlerTest, TestSolr4Spatial, TestUtils, TestUniqueKeyFieldResource, TestPropInject, HdfsSyncSliceTest, TestCoreDiscovery, LeaderElectionIntegrationTest, TestLMJelinekMercerSimilarityFactory, TestDistributedSearch, TestBinaryField, HdfsCollectionsAPIDistributedZkTest, XmlUpdateRequestHandlerTest, TestFoldingMultitermQuery, TestManagedSchema, SortByFunctionTest, TestRandomMergePolicy, TestCopyFieldCollectionResource, SolrPluginUtilsTest, TestRecoveryHdfs, DateMathParserTest, HdfsRecoveryZkTest, TestCodecSupport, TestOmitPositions, ShardRoutingCustomTest, CollectionsAPIDistributedZkTest]
   [junit4] Completed on J1 in 140.21s, 1 test, 1 error <<< FAILURES!

[...truncated 660 lines...]
BUILD FAILED
/mnt/ssd/jenkins/workspace/Lucene-Solr-trunk-Linux/build.xml:389: The following error occurred while executing this line:
/mnt/ssd/jenkins/workspace/Lucene-Solr-trunk-Linux/build.xml:369: The following error occurred while executing this line:
/mnt/ssd/jenkins/workspace/Lucene-Solr-trunk-Linux/build.xml:39: The following error occurred while executing this line:
/mnt/ssd/jenkins/workspace/Lucene-Solr-trunk-Linux/solr/build.xml:181: The following error occurred while executing this line:
/mnt/ssd/jenkins/workspace/Lucene-Solr-trunk-Linux/solr/common-build.xml:449: The following error occurred while executing this line:
/mnt/ssd/jenkins/workspace/Lucene-Solr-trunk-Linux/lucene/common-build.xml:1230: The following error occurred while executing this line:
/mnt/ssd/jenkins/workspace/Lucene-Solr-trunk-Linux/lucene/common-build.xml:873: There were test failures: 320 suites, 1347 tests, 1 error, 34 ignored (6 assumptions)

Total time: 39 minutes 45 seconds
Build step 'Invoke Ant' marked build as failure
Description set: Java: 64bit/jdk1.7.0_25 -XX:+UseCompressedOops -XX:+UseSerialGC
Archiving artifacts
Recording test results
Email was triggered for: Failure
Sending email for trigger: Failure




---------------------------------------------------------------------
To unsubscribe, e-mail: [hidden email]
For additional commands, e-mail: [hidden email]
Reply | Threaded
Open this post in threaded view
|

[JENKINS] Lucene-Solr-trunk-Linux (32bit/jdk1.7.0_25) - Build # 6845 - Still Failing!

Policeman Jenkins Server-2
Build: http://jenkins.thetaphi.de/job/Lucene-Solr-trunk-Linux/6845/
Java: 32bit/jdk1.7.0_25 -client -XX:+UseParallelGC

1 tests failed.
FAILED:  org.apache.solr.cloud.CollectionsAPIDistributedZkTest.testDistribSearch

Error Message:
Server refused connection at: http://127.0.0.1:54974

Stack Trace:
org.apache.solr.client.solrj.SolrServerException: Server refused connection at: http://127.0.0.1:54974
        at __randomizedtesting.SeedInfo.seed([337B722C0CE7B0A3:B29DFC347BB8D09F]:0)
        at org.apache.solr.client.solrj.impl.HttpSolrServer.request(HttpSolrServer.java:428)
        at org.apache.solr.client.solrj.impl.HttpSolrServer.request(HttpSolrServer.java:180)
        at org.apache.solr.cloud.CollectionsAPIDistributedZkTest.testCustomCollectionsAPI(CollectionsAPIDistributedZkTest.java:764)
        at org.apache.solr.cloud.CollectionsAPIDistributedZkTest.doTest(CollectionsAPIDistributedZkTest.java:159)
        at org.apache.solr.BaseDistributedSearchTestCase.testDistribSearch(BaseDistributedSearchTestCase.java:835)
        at sun.reflect.NativeMethodAccessorImpl.invoke0(Native Method)
        at sun.reflect.NativeMethodAccessorImpl.invoke(NativeMethodAccessorImpl.java:57)
        at sun.reflect.DelegatingMethodAccessorImpl.invoke(DelegatingMethodAccessorImpl.java:43)
        at java.lang.reflect.Method.invoke(Method.java:606)
        at com.carrotsearch.randomizedtesting.RandomizedRunner.invoke(RandomizedRunner.java:1559)
        at com.carrotsearch.randomizedtesting.RandomizedRunner.access$600(RandomizedRunner.java:79)
        at com.carrotsearch.randomizedtesting.RandomizedRunner$6.evaluate(RandomizedRunner.java:737)
        at com.carrotsearch.randomizedtesting.RandomizedRunner$7.evaluate(RandomizedRunner.java:773)
        at com.carrotsearch.randomizedtesting.RandomizedRunner$8.evaluate(RandomizedRunner.java:787)
        at com.carrotsearch.randomizedtesting.rules.SystemPropertiesRestoreRule$1.evaluate(SystemPropertiesRestoreRule.java:53)
        at org.apache.lucene.util.TestRuleSetupTeardownChained$1.evaluate(TestRuleSetupTeardownChained.java:50)
        at org.apache.lucene.util.TestRuleFieldCacheSanity$1.evaluate(TestRuleFieldCacheSanity.java:51)
        at org.apache.lucene.util.AbstractBeforeAfterRule$1.evaluate(AbstractBeforeAfterRule.java:46)
        at com.carrotsearch.randomizedtesting.rules.SystemPropertiesInvariantRule$1.evaluate(SystemPropertiesInvariantRule.java:55)
        at org.apache.lucene.util.TestRuleThreadAndTestName$1.evaluate(TestRuleThreadAndTestName.java:49)
        at org.apache.lucene.util.TestRuleIgnoreAfterMaxFailures$1.evaluate(TestRuleIgnoreAfterMaxFailures.java:70)
        at org.apache.lucene.util.TestRuleMarkFailure$1.evaluate(TestRuleMarkFailure.java:48)
        at com.carrotsearch.randomizedtesting.rules.StatementAdapter.evaluate(StatementAdapter.java:36)
        at com.carrotsearch.randomizedtesting.ThreadLeakControl$StatementRunner.run(ThreadLeakControl.java:358)
        at com.carrotsearch.randomizedtesting.ThreadLeakControl.forkTimeoutingTask(ThreadLeakControl.java:782)
        at com.carrotsearch.randomizedtesting.ThreadLeakControl$3.evaluate(ThreadLeakControl.java:442)
        at com.carrotsearch.randomizedtesting.RandomizedRunner.runSingleTest(RandomizedRunner.java:746)
        at com.carrotsearch.randomizedtesting.RandomizedRunner$3.evaluate(RandomizedRunner.java:648)
        at com.carrotsearch.randomizedtesting.RandomizedRunner$4.evaluate(RandomizedRunner.java:682)
        at com.carrotsearch.randomizedtesting.RandomizedRunner$5.evaluate(RandomizedRunner.java:693)
        at com.carrotsearch.randomizedtesting.rules.StatementAdapter.evaluate(StatementAdapter.java:36)
        at com.carrotsearch.randomizedtesting.rules.SystemPropertiesRestoreRule$1.evaluate(SystemPropertiesRestoreRule.java:53)
        at org.apache.lucene.util.AbstractBeforeAfterRule$1.evaluate(AbstractBeforeAfterRule.java:46)
        at org.apache.lucene.util.TestRuleStoreClassName$1.evaluate(TestRuleStoreClassName.java:42)
        at com.carrotsearch.randomizedtesting.rules.SystemPropertiesInvariantRule$1.evaluate(SystemPropertiesInvariantRule.java:55)
        at com.carrotsearch.randomizedtesting.rules.NoShadowingOrOverridesOnMethodsRule$1.evaluate(NoShadowingOrOverridesOnMethodsRule.java:39)
        at com.carrotsearch.randomizedtesting.rules.NoShadowingOrOverridesOnMethodsRule$1.evaluate(NoShadowingOrOverridesOnMethodsRule.java:39)
        at com.carrotsearch.randomizedtesting.rules.StatementAdapter.evaluate(StatementAdapter.java:36)
        at org.apache.lucene.util.TestRuleAssertionsRequired$1.evaluate(TestRuleAssertionsRequired.java:43)
        at org.apache.lucene.util.TestRuleMarkFailure$1.evaluate(TestRuleMarkFailure.java:48)
        at org.apache.lucene.util.TestRuleIgnoreAfterMaxFailures$1.evaluate(TestRuleIgnoreAfterMaxFailures.java:70)
        at org.apache.lucene.util.TestRuleIgnoreTestSuites$1.evaluate(TestRuleIgnoreTestSuites.java:55)
        at com.carrotsearch.randomizedtesting.rules.StatementAdapter.evaluate(StatementAdapter.java:36)
        at com.carrotsearch.randomizedtesting.ThreadLeakControl$StatementRunner.run(ThreadLeakControl.java:358)
        at java.lang.Thread.run(Thread.java:724)
Caused by: org.apache.http.conn.HttpHostConnectException: Connection to http://127.0.0.1:54974 refused
        at org.apache.http.impl.conn.DefaultClientConnectionOperator.openConnection(DefaultClientConnectionOperator.java:190)
        at org.apache.http.impl.conn.ManagedClientConnectionImpl.open(ManagedClientConnectionImpl.java:294)
        at org.apache.http.impl.client.DefaultRequestDirector.tryConnect(DefaultRequestDirector.java:645)
        at org.apache.http.impl.client.DefaultRequestDirector.execute(DefaultRequestDirector.java:480)
        at org.apache.http.impl.client.AbstractHttpClient.execute(AbstractHttpClient.java:906)
        at org.apache.http.impl.client.AbstractHttpClient.execute(AbstractHttpClient.java:805)
        at org.apache.http.impl.client.AbstractHttpClient.execute(AbstractHttpClient.java:784)
        at org.apache.solr.client.solrj.impl.HttpSolrServer.request(HttpSolrServer.java:365)
        ... 44 more
Caused by: java.net.ConnectException: Connection refused
        at java.net.PlainSocketImpl.socketConnect(Native Method)
        at java.net.AbstractPlainSocketImpl.doConnect(AbstractPlainSocketImpl.java:339)
        at java.net.AbstractPlainSocketImpl.connectToAddress(AbstractPlainSocketImpl.java:200)
        at java.net.AbstractPlainSocketImpl.connect(AbstractPlainSocketImpl.java:182)
        at java.net.SocksSocketImpl.connect(SocksSocketImpl.java:392)
        at java.net.Socket.connect(Socket.java:579)
        at org.apache.http.conn.scheme.PlainSocketFactory.connectSocket(PlainSocketFactory.java:127)
        at org.apache.http.impl.conn.DefaultClientConnectionOperator.openConnection(DefaultClientConnectionOperator.java:180)
        ... 51 more




Build Log:
[...truncated 9492 lines...]
   [junit4] Suite: org.apache.solr.cloud.CollectionsAPIDistributedZkTest
   [junit4]   2> 414354 T1736 oas.BaseDistributedSearchTestCase.initHostContext Setting hostContext system property: /
   [junit4]   2> 414357 T1736 oas.SolrTestCaseJ4.setUp ###Starting testDistribSearch
   [junit4]   2> Creating dataDir: /mnt/ssd/jenkins/workspace/Lucene-Solr-trunk-Linux/solr/build/solr-core/test/J1/./solrtest-CollectionsAPIDistributedZkTest-1375450386744
   [junit4]   2> 414358 T1736 oasc.ZkTestServer.run STARTING ZK TEST SERVER
   [junit4]   2> 414358 T1737 oasc.ZkTestServer$ZKServerMain.runFromConfig Starting server
   [junit4]   2> 414458 T1736 oasc.ZkTestServer.run start zk server on port:37013
   [junit4]   2> 414460 T1736 oascc.ConnectionManager.waitForConnected Waiting for client to connect to ZooKeeper
   [junit4]   2> 414549 T1743 oascc.ConnectionManager.process Watcher org.apache.solr.common.cloud.ConnectionManager@7a86a name:ZooKeeperConnection Watcher:127.0.0.1:37013 got event WatchedEvent state:SyncConnected type:None path:null path:null type:None
   [junit4]   2> 414549 T1736 oascc.ConnectionManager.waitForConnected Client is connected to ZooKeeper
   [junit4]   2> 414550 T1736 oascc.SolrZkClient.makePath makePath: /solr
   [junit4]   2> 414557 T1736 oascc.ConnectionManager.waitForConnected Waiting for client to connect to ZooKeeper
   [junit4]   2> 414559 T1745 oascc.ConnectionManager.process Watcher org.apache.solr.common.cloud.ConnectionManager@15b795e name:ZooKeeperConnection Watcher:127.0.0.1:37013/solr got event WatchedEvent state:SyncConnected type:None path:null path:null type:None
   [junit4]   2> 414559 T1736 oascc.ConnectionManager.waitForConnected Client is connected to ZooKeeper
   [junit4]   2> 414559 T1736 oascc.SolrZkClient.makePath makePath: /collections/collection1
   [junit4]   2> 414561 T1736 oascc.SolrZkClient.makePath makePath: /collections/collection1/shards
   [junit4]   2> 414563 T1736 oascc.SolrZkClient.makePath makePath: /collections/control_collection
   [junit4]   2> 414564 T1736 oascc.SolrZkClient.makePath makePath: /collections/control_collection/shards
   [junit4]   2> 414566 T1736 oasc.AbstractZkTestCase.putConfig put /mnt/ssd/jenkins/workspace/Lucene-Solr-trunk-Linux/solr/build/solr-core/test-files/solr/collection1/conf/solrconfig-tlog.xml to /configs/conf1/solrconfig.xml
   [junit4]   2> 414566 T1736 oascc.SolrZkClient.makePath makePath: /configs/conf1/solrconfig.xml
   [junit4]   2> 414570 T1736 oasc.AbstractZkTestCase.putConfig put /mnt/ssd/jenkins/workspace/Lucene-Solr-trunk-Linux/solr/build/solr-core/test-files/solr/collection1/conf/schema.xml to /configs/conf1/schema.xml
   [junit4]   2> 414570 T1736 oascc.SolrZkClient.makePath makePath: /configs/conf1/schema.xml
   [junit4]   2> 414572 T1736 oasc.AbstractZkTestCase.putConfig put /mnt/ssd/jenkins/workspace/Lucene-Solr-trunk-Linux/solr/build/solr-core/test-files/solr/collection1/conf/stopwords.txt to /configs/conf1/stopwords.txt
   [junit4]   2> 414573 T1736 oascc.SolrZkClient.makePath makePath: /configs/conf1/stopwords.txt
   [junit4]   2> 414575 T1736 oasc.AbstractZkTestCase.putConfig put /mnt/ssd/jenkins/workspace/Lucene-Solr-trunk-Linux/solr/build/solr-core/test-files/solr/collection1/conf/protwords.txt to /configs/conf1/protwords.txt
   [junit4]   2> 414575 T1736 oascc.SolrZkClient.makePath makePath: /configs/conf1/protwords.txt
   [junit4]   2> 414577 T1736 oasc.AbstractZkTestCase.putConfig put /mnt/ssd/jenkins/workspace/Lucene-Solr-trunk-Linux/solr/build/solr-core/test-files/solr/collection1/conf/currency.xml to /configs/conf1/currency.xml
   [junit4]   2> 414577 T1736 oascc.SolrZkClient.makePath makePath: /configs/conf1/currency.xml
   [junit4]   2> 414579 T1736 oasc.AbstractZkTestCase.putConfig put /mnt/ssd/jenkins/workspace/Lucene-Solr-trunk-Linux/solr/build/solr-core/test-files/solr/collection1/conf/open-exchange-rates.json to /configs/conf1/open-exchange-rates.json
   [junit4]   2> 414579 T1736 oascc.SolrZkClient.makePath makePath: /configs/conf1/open-exchange-rates.json
   [junit4]   2> 414581 T1736 oasc.AbstractZkTestCase.putConfig put /mnt/ssd/jenkins/workspace/Lucene-Solr-trunk-Linux/solr/build/solr-core/test-files/solr/collection1/conf/mapping-ISOLatin1Accent.txt to /configs/conf1/mapping-ISOLatin1Accent.txt
   [junit4]   2> 414582 T1736 oascc.SolrZkClient.makePath makePath: /configs/conf1/mapping-ISOLatin1Accent.txt
   [junit4]   2> 414584 T1736 oasc.AbstractZkTestCase.putConfig put /mnt/ssd/jenkins/workspace/Lucene-Solr-trunk-Linux/solr/build/solr-core/test-files/solr/collection1/conf/old_synonyms.txt to /configs/conf1/old_synonyms.txt
   [junit4]   2> 414584 T1736 oascc.SolrZkClient.makePath makePath: /configs/conf1/old_synonyms.txt
   [junit4]   2> 414586 T1736 oasc.AbstractZkTestCase.putConfig put /mnt/ssd/jenkins/workspace/Lucene-Solr-trunk-Linux/solr/build/solr-core/test-files/solr/collection1/conf/synonyms.txt to /configs/conf1/synonyms.txt
   [junit4]   2> 414586 T1736 oascc.SolrZkClient.makePath makePath: /configs/conf1/synonyms.txt
   [junit4]   2> 414649 T1736 oejs.Server.doStart jetty-8.1.10.v20130312
   [junit4]   2> 414652 T1736 oejs.AbstractConnector.doStart Started SelectChannelConnector@127.0.0.1:39942
   [junit4]   2> 414653 T1736 oass.SolrDispatchFilter.init SolrDispatchFilter.init()
   [junit4]   2> 414653 T1736 oasc.SolrResourceLoader.locateSolrHome JNDI not configured for solr (NoInitialContextEx)
   [junit4]   2> 414653 T1736 oasc.SolrResourceLoader.locateSolrHome using system property solr.solr.home: /mnt/ssd/jenkins/workspace/Lucene-Solr-trunk-Linux/solr/build/solr-core/test/J1/./org.apache.solr.cloud.CollectionsAPIDistributedZkTest-controljetty-1375450386975
   [junit4]   2> 414654 T1736 oasc.SolrResourceLoader.<init> new SolrResourceLoader for directory: '/mnt/ssd/jenkins/workspace/Lucene-Solr-trunk-Linux/solr/build/solr-core/test/J1/./org.apache.solr.cloud.CollectionsAPIDistributedZkTest-controljetty-1375450386975/'
   [junit4]   2> 414664 T1736 oasc.ConfigSolr.fromFile Loading container configuration from /mnt/ssd/jenkins/workspace/Lucene-Solr-trunk-Linux/solr/build/solr-core/test/J1/./org.apache.solr.cloud.CollectionsAPIDistributedZkTest-controljetty-1375450386975/solr.xml
   [junit4]   2> 414700 T1736 oasc.ConfigSolrXml.<init> Config-defined core root directory:
   [junit4]   2> 414701 T1736 oasc.CoreContainer.<init> New CoreContainer 21350947
   [junit4]   2> 414701 T1736 oasc.CoreContainer.load Loading cores into CoreContainer [instanceDir=/mnt/ssd/jenkins/workspace/Lucene-Solr-trunk-Linux/solr/build/solr-core/test/J1/./org.apache.solr.cloud.CollectionsAPIDistributedZkTest-controljetty-1375450386975/]
   [junit4]   2> 414702 T1736 oashc.HttpShardHandlerFactory.getParameter Setting socketTimeout to: 120000
   [junit4]   2> 414703 T1736 oashc.HttpShardHandlerFactory.getParameter Setting urlScheme to: http://
   [junit4]   2> 414703 T1736 oashc.HttpShardHandlerFactory.getParameter Setting connTimeout to: 15000
   [junit4]   2> 414703 T1736 oashc.HttpShardHandlerFactory.getParameter Setting maxConnectionsPerHost to: 20
   [junit4]   2> 414704 T1736 oashc.HttpShardHandlerFactory.getParameter Setting corePoolSize to: 0
   [junit4]   2> 414704 T1736 oashc.HttpShardHandlerFactory.getParameter Setting maximumPoolSize to: 2147483647
   [junit4]   2> 414704 T1736 oashc.HttpShardHandlerFactory.getParameter Setting maxThreadIdleTime to: 5
   [junit4]   2> 414705 T1736 oashc.HttpShardHandlerFactory.getParameter Setting sizeOfQueue to: -1
   [junit4]   2> 414705 T1736 oashc.HttpShardHandlerFactory.getParameter Setting fairnessPolicy to: false
   [junit4]   2> 414705 T1736 oascsi.HttpClientUtil.createClient Creating new http client, config:maxConnectionsPerHost=20&maxConnections=10000&socketTimeout=120000&connTimeout=15000&retry=false
   [junit4]   2> 414708 T1736 oasc.ZkContainer.initZooKeeper Zookeeper client=127.0.0.1:37013/solr
   [junit4]   2> 414708 T1736 oasc.ZkController.checkChrootPath zkHost includes chroot
   [junit4]   2> 414709 T1736 oascc.ConnectionManager.waitForConnected Waiting for client to connect to ZooKeeper
   [junit4]   2> 414710 T1756 oascc.ConnectionManager.process Watcher org.apache.solr.common.cloud.ConnectionManager@1c64116 name:ZooKeeperConnection Watcher:127.0.0.1:37013 got event WatchedEvent state:SyncConnected type:None path:null path:null type:None
   [junit4]   2> 414711 T1736 oascc.ConnectionManager.waitForConnected Client is connected to ZooKeeper
   [junit4]   2> 414712 T1736 oascsi.HttpClientUtil.createClient Creating new http client, config:maxConnections=500&maxConnectionsPerHost=16&socketTimeout=120000&connTimeout=15000
   [junit4]   2> 414715 T1736 oascc.ConnectionManager.waitForConnected Waiting for client to connect to ZooKeeper
   [junit4]   2> 414716 T1758 oascc.ConnectionManager.process Watcher org.apache.solr.common.cloud.ConnectionManager@de1eda name:ZooKeeperConnection Watcher:127.0.0.1:37013/solr got event WatchedEvent state:SyncConnected type:None path:null path:null type:None
   [junit4]   2> 414716 T1736 oascc.ConnectionManager.waitForConnected Client is connected to ZooKeeper
   [junit4]   2> 414718 T1736 oascc.SolrZkClient.makePath makePath: /overseer/queue
   [junit4]   2> 414720 T1736 oascc.SolrZkClient.makePath makePath: /overseer/collection-queue-work
   [junit4]   2> 414723 T1736 oascc.SolrZkClient.makePath makePath: /live_nodes
   [junit4]   2> 414724 T1736 oasc.ZkController.createEphemeralLiveNode Register node as live in ZooKeeper:/live_nodes/127.0.0.1:39942_
   [junit4]   2> 414724 T1736 oascc.SolrZkClient.makePath makePath: /live_nodes/127.0.0.1:39942_
   [junit4]   2> 414727 T1736 oascc.SolrZkClient.makePath makePath: /overseer_elect/election
   [junit4]   2> 414731 T1736 oascc.SolrZkClient.makePath makePath: /overseer_elect/leader
   [junit4]   2> 414735 T1736 oasc.Overseer.start Overseer (id=90141516545851395-127.0.0.1:39942_-n_0000000000) starting
   [junit4]   2> 414738 T1736 oascc.SolrZkClient.makePath makePath: /overseer/queue-work
   [junit4]   2> 414741 T1760 oasc.OverseerCollectionProcessor.run Process current queue of collection creations
   [junit4]   2> 414741 T1736 oascc.SolrZkClient.makePath makePath: /clusterstate.json
   [junit4]   2> 414743 T1736 oascc.SolrZkClient.makePath makePath: /aliases.json
   [junit4]   2> 414744 T1736 oascc.ZkStateReader.createClusterStateWatchersAndUpdate Updating cluster state from ZooKeeper...
   [junit4]   2> 414746 T1759 oasc.Overseer$ClusterStateUpdater.run Starting to work on the main queue
   [junit4]   2> 414748 T1736 oasc.CorePropertiesLocator.discover Looking for core definitions underneath /mnt/ssd/jenkins/workspace/Lucene-Solr-trunk-Linux/solr/build/solr-core/test/J1/./org.apache.solr.cloud.CollectionsAPIDistributedZkTest-controljetty-1375450386975
   [junit4]   2> 414771 T1736 oasc.CorePropertiesLocator.discoverUnder Found core conf in /mnt/ssd/jenkins/workspace/Lucene-Solr-trunk-Linux/solr/build/solr-core/test/J1/./org.apache.solr.cloud.CollectionsAPIDistributedZkTest-controljetty-1375450386975/conf/
   [junit4]   2> 414772 T1736 oasc.CorePropertiesLocator.discover Found 1 core definitions
   [junit4]   2> 414772 T1736 oass.SolrDispatchFilter.init user.dir=/mnt/ssd/jenkins/workspace/Lucene-Solr-trunk-Linux/solr/build/solr-core/test/J1
   [junit4]   2> 414772 T1736 oass.SolrDispatchFilter.init SolrDispatchFilter.init() done
   [junit4]   2> 414773 T1736 oascsi.HttpClientUtil.createClient Creating new http client, config:maxConnections=128&maxConnectionsPerHost=32&followRedirects=false
   [junit4]   2> 414775 T1736 oascsi.HttpClientUtil.createClient Creating new http client, config:
   [junit4]   2> 414776 T1736 oascc.ConnectionManager.waitForConnected Waiting for client to connect to ZooKeeper
   [junit4]   2> 414778 T1763 oascc.ConnectionManager.process Watcher org.apache.solr.common.cloud.ConnectionManager@1f82875 name:ZooKeeperConnection Watcher:127.0.0.1:37013/solr got event WatchedEvent state:SyncConnected type:None path:null path:null type:None
   [junit4]   2> 414778 T1736 oascc.ConnectionManager.waitForConnected Client is connected to ZooKeeper
   [junit4]   2> 414779 T1736 oascc.ZkStateReader.createClusterStateWatchersAndUpdate Updating cluster state from ZooKeeper...
   [junit4]   2> 414781 T1736 oasc.ChaosMonkey.monkeyLog monkey: init - expire sessions:true cause connection loss:true
   [junit4]   2> 414841 T1736 oejs.Server.doStart jetty-8.1.10.v20130312
   [junit4]   2> 414843 T1736 oejs.AbstractConnector.doStart Started SelectChannelConnector@127.0.0.1:54974
   [junit4]   2> 414844 T1736 oass.SolrDispatchFilter.init SolrDispatchFilter.init()
   [junit4]   2> 414844 T1736 oasc.SolrResourceLoader.locateSolrHome JNDI not configured for solr (NoInitialContextEx)
   [junit4]   2> 414845 T1736 oasc.SolrResourceLoader.locateSolrHome using system property solr.solr.home: /mnt/ssd/jenkins/workspace/Lucene-Solr-trunk-Linux/solr/build/solr-core/test/J1/./org.apache.solr.cloud.CollectionsAPIDistributedZkTest-jetty1-1375450387167
   [junit4]   2> 414845 T1736 oasc.SolrResourceLoader.<init> new SolrResourceLoader for directory: '/mnt/ssd/jenkins/workspace/Lucene-Solr-trunk-Linux/solr/build/solr-core/test/J1/./org.apache.solr.cloud.CollectionsAPIDistributedZkTest-jetty1-1375450387167/'
   [junit4]   2> 414855 T1736 oasc.ConfigSolr.fromFile Loading container configuration from /mnt/ssd/jenkins/workspace/Lucene-Solr-trunk-Linux/solr/build/solr-core/test/J1/./org.apache.solr.cloud.CollectionsAPIDistributedZkTest-jetty1-1375450387167/solr.xml
   [junit4]   2> 414891 T1736 oasc.ConfigSolrXml.<init> Config-defined core root directory:
   [junit4]   2> 414891 T1736 oasc.CoreContainer.<init> New CoreContainer 15028170
   [junit4]   2> 414892 T1736 oasc.CoreContainer.load Loading cores into CoreContainer [instanceDir=/mnt/ssd/jenkins/workspace/Lucene-Solr-trunk-Linux/solr/build/solr-core/test/J1/./org.apache.solr.cloud.CollectionsAPIDistributedZkTest-jetty1-1375450387167/]
   [junit4]   2> 414893 T1736 oashc.HttpShardHandlerFactory.getParameter Setting socketTimeout to: 120000
   [junit4]   2> 414893 T1736 oashc.HttpShardHandlerFactory.getParameter Setting urlScheme to: http://
   [junit4]   2> 414893 T1736 oashc.HttpShardHandlerFactory.getParameter Setting connTimeout to: 15000
   [junit4]   2> 414894 T1736 oashc.HttpShardHandlerFactory.getParameter Setting maxConnectionsPerHost to: 20
   [junit4]   2> 414894 T1736 oashc.HttpShardHandlerFactory.getParameter Setting corePoolSize to: 0
   [junit4]   2> 414894 T1736 oashc.HttpShardHandlerFactory.getParameter Setting maximumPoolSize to: 2147483647
   [junit4]   2> 414894 T1736 oashc.HttpShardHandlerFactory.getParameter Setting maxThreadIdleTime to: 5
   [junit4]   2> 414895 T1736 oashc.HttpShardHandlerFactory.getParameter Setting sizeOfQueue to: -1
   [junit4]   2> 414895 T1736 oashc.HttpShardHandlerFactory.getParameter Setting fairnessPolicy to: false
   [junit4]   2> 414895 T1736 oascsi.HttpClientUtil.createClient Creating new http client, config:maxConnectionsPerHost=20&maxConnections=10000&socketTimeout=120000&connTimeout=15000&retry=false
   [junit4]   2> 414898 T1736 oasc.ZkContainer.initZooKeeper Zookeeper client=127.0.0.1:37013/solr
   [junit4]   2> 414898 T1736 oasc.ZkController.checkChrootPath zkHost includes chroot
   [junit4]   2> 414899 T1736 oascc.ConnectionManager.waitForConnected Waiting for client to connect to ZooKeeper
   [junit4]   2> 414900 T1774 oascc.ConnectionManager.process Watcher org.apache.solr.common.cloud.ConnectionManager@10b0741 name:ZooKeeperConnection Watcher:127.0.0.1:37013 got event WatchedEvent state:SyncConnected type:None path:null path:null type:None
   [junit4]   2> 414901 T1736 oascc.ConnectionManager.waitForConnected Client is connected to ZooKeeper
   [junit4]   2> 414902 T1736 oascsi.HttpClientUtil.createClient Creating new http client, config:maxConnections=500&maxConnectionsPerHost=16&socketTimeout=120000&connTimeout=15000
   [junit4]   2> 414905 T1736 oascc.ConnectionManager.waitForConnected Waiting for client to connect to ZooKeeper
   [junit4]   2> 414907 T1776 oascc.ConnectionManager.process Watcher org.apache.solr.common.cloud.ConnectionManager@c01284 name:ZooKeeperConnection Watcher:127.0.0.1:37013/solr got event WatchedEvent state:SyncConnected type:None path:null path:null type:None
   [junit4]   2> 414908 T1736 oascc.ConnectionManager.waitForConnected Client is connected to ZooKeeper
   [junit4]   2> 414912 T1736 oascc.ZkStateReader.createClusterStateWatchersAndUpdate Updating cluster state from ZooKeeper...
   [junit4]   2> 415915 T1736 oasc.ZkController.createEphemeralLiveNode Register node as live in ZooKeeper:/live_nodes/127.0.0.1:54974_
   [junit4]   2> 415917 T1736 oascc.SolrZkClient.makePath makePath: /live_nodes/127.0.0.1:54974_
   [junit4]   2> 415922 T1758 oascc.ZkStateReader$3.process Updating live nodes... (2)
   [junit4]   2> 415922 T1763 oascc.ZkStateReader$3.process Updating live nodes... (2)
   [junit4]   2> 415922 T1776 oascc.ZkStateReader$3.process Updating live nodes... (2)
   [junit4]   2> 415931 T1736 oasc.CorePropertiesLocator.discover Looking for core definitions underneath /mnt/ssd/jenkins/workspace/Lucene-Solr-trunk-Linux/solr/build/solr-core/test/J1/./org.apache.solr.cloud.CollectionsAPIDistributedZkTest-jetty1-1375450387167
   [junit4]   2> 415956 T1736 oasc.CorePropertiesLocator.discoverUnder Found core conf in /mnt/ssd/jenkins/workspace/Lucene-Solr-trunk-Linux/solr/build/solr-core/test/J1/./org.apache.solr.cloud.CollectionsAPIDistributedZkTest-jetty1-1375450387167/conf/
   [junit4]   2> 415957 T1736 oasc.CorePropertiesLocator.discover Found 1 core definitions
   [junit4]   2> 415957 T1736 oass.SolrDispatchFilter.init user.dir=/mnt/ssd/jenkins/workspace/Lucene-Solr-trunk-Linux/solr/build/solr-core/test/J1
   [junit4]   2> 415957 T1736 oass.SolrDispatchFilter.init SolrDispatchFilter.init() done
   [junit4]   2> 415958 T1736 oascsi.HttpClientUtil.createClient Creating new http client, config:maxConnections=128&maxConnectionsPerHost=32&followRedirects=false
   [junit4]   2> 416019 T1736 oejs.Server.doStart jetty-8.1.10.v20130312
   [junit4]   2> 416026 T1736 oejs.AbstractConnector.doStart Started SelectChannelConnector@127.0.0.1:39620
   [junit4]   2> 416028 T1736 oass.SolrDispatchFilter.init SolrDispatchFilter.init()
   [junit4]   2> 416028 T1736 oasc.SolrResourceLoader.locateSolrHome JNDI not configured for solr (NoInitialContextEx)
   [junit4]   2> 416028 T1736 oasc.SolrResourceLoader.locateSolrHome using system property solr.solr.home: /mnt/ssd/jenkins/workspace/Lucene-Solr-trunk-Linux/solr/build/solr-core/test/J1/./org.apache.solr.cloud.CollectionsAPIDistributedZkTest-jetty2-1375450388346
   [junit4]   2> 416029 T1736 oasc.SolrResourceLoader.<init> new SolrResourceLoader for directory: '/mnt/ssd/jenkins/workspace/Lucene-Solr-trunk-Linux/solr/build/solr-core/test/J1/./org.apache.solr.cloud.CollectionsAPIDistributedZkTest-jetty2-1375450388346/'
   [junit4]   2> 416043 T1736 oasc.ConfigSolr.fromFile Loading container configuration from /mnt/ssd/jenkins/workspace/Lucene-Solr-trunk-Linux/solr/build/solr-core/test/J1/./org.apache.solr.cloud.CollectionsAPIDistributedZkTest-jetty2-1375450388346/solr.xml
   [junit4]   2> 416076 T1736 oasc.ConfigSolrXml.<init> Config-defined core root directory:
   [junit4]   2> 416077 T1736 oasc.CoreContainer.<init> New CoreContainer 9258316
   [junit4]   2> 416077 T1736 oasc.CoreContainer.load Loading cores into CoreContainer [instanceDir=/mnt/ssd/jenkins/workspace/Lucene-Solr-trunk-Linux/solr/build/solr-core/test/J1/./org.apache.solr.cloud.CollectionsAPIDistributedZkTest-jetty2-1375450388346/]
   [junit4]   2> 416078 T1736 oashc.HttpShardHandlerFactory.getParameter Setting socketTimeout to: 120000
   [junit4]   2> 416078 T1736 oashc.HttpShardHandlerFactory.getParameter Setting urlScheme to: http://
   [junit4]   2> 416078 T1736 oashc.HttpShardHandlerFactory.getParameter Setting connTimeout to: 15000
   [junit4]   2> 416079 T1736 oashc.HttpShardHandlerFactory.getParameter Setting maxConnectionsPerHost to: 20
   [junit4]   2> 416079 T1736 oashc.HttpShardHandlerFactory.getParameter Setting corePoolSize to: 0
   [junit4]   2> 416079 T1736 oashc.HttpShardHandlerFactory.getParameter Setting maximumPoolSize to: 2147483647
   [junit4]   2> 416080 T1736 oashc.HttpShardHandlerFactory.getParameter Setting maxThreadIdleTime to: 5
   [junit4]   2> 416080 T1736 oashc.HttpShardHandlerFactory.getParameter Setting sizeOfQueue to: -1
   [junit4]   2> 416080 T1736 oashc.HttpShardHandlerFactory.getParameter Setting fairnessPolicy to: false
   [junit4]   2> 416080 T1736 oascsi.HttpClientUtil.createClient Creating new http client, config:maxConnectionsPerHost=20&maxConnections=10000&socketTimeout=120000&connTimeout=15000&retry=false
   [junit4]   2> 416083 T1736 oasc.ZkContainer.initZooKeeper Zookeeper client=127.0.0.1:37013/solr
   [junit4]   2> 416083 T1736 oasc.ZkController.checkChrootPath zkHost includes chroot
   [junit4]   2> 416084 T1736 oascc.ConnectionManager.waitForConnected Waiting for client to connect to ZooKeeper
   [junit4]   2> 416086 T1788 oascc.ConnectionManager.process Watcher org.apache.solr.common.cloud.ConnectionManager@163a522 name:ZooKeeperConnection Watcher:127.0.0.1:37013 got event WatchedEvent state:SyncConnected type:None path:null path:null type:None
   [junit4]   2> 416086 T1736 oascc.ConnectionManager.waitForConnected Client is connected to ZooKeeper
   [junit4]   2> 416088 T1736 oascsi.HttpClientUtil.createClient Creating new http client, config:maxConnections=500&maxConnectionsPerHost=16&socketTimeout=120000&connTimeout=15000
   [junit4]   2> 416090 T1736 oascc.ConnectionManager.waitForConnected Waiting for client to connect to ZooKeeper
   [junit4]   2> 416091 T1790 oascc.ConnectionManager.process Watcher org.apache.solr.common.cloud.ConnectionManager@a2d0e8 name:ZooKeeperConnection Watcher:127.0.0.1:37013/solr got event WatchedEvent state:SyncConnected type:None path:null path:null type:None
   [junit4]   2> 416091 T1736 oascc.ConnectionManager.waitForConnected Client is connected to ZooKeeper
   [junit4]   2> 416095 T1736 oascc.ZkStateReader.createClusterStateWatchersAndUpdate Updating cluster state from ZooKeeper...
   [junit4]   2> 417097 T1736 oasc.ZkController.createEphemeralLiveNode Register node as live in ZooKeeper:/live_nodes/127.0.0.1:39620_
   [junit4]   2> 417099 T1736 oascc.SolrZkClient.makePath makePath: /live_nodes/127.0.0.1:39620_
   [junit4]   2> 417104 T1763 oascc.ZkStateReader$3.process Updating live nodes... (3)
   [junit4]   2> 417104 T1758 oascc.ZkStateReader$3.process Updating live nodes... (3)
   [junit4]   2> 417104 T1790 oascc.ZkStateReader$3.process Updating live nodes... (3)
   [junit4]   2> 417104 T1776 oascc.ZkStateReader$3.process Updating live nodes... (3)
   [junit4]   2> 417114 T1736 oasc.CorePropertiesLocator.discover Looking for core definitions underneath /mnt/ssd/jenkins/workspace/Lucene-Solr-trunk-Linux/solr/build/solr-core/test/J1/./org.apache.solr.cloud.CollectionsAPIDistributedZkTest-jetty2-1375450388346
   [junit4]   2> 417138 T1736 oasc.CorePropertiesLocator.discoverUnder Found core conf in /mnt/ssd/jenkins/workspace/Lucene-Solr-trunk-Linux/solr/build/solr-core/test/J1/./org.apache.solr.cloud.CollectionsAPIDistributedZkTest-jetty2-1375450388346/conf/
   [junit4]   2> 417138 T1736 oasc.CorePropertiesLocator.discover Found 1 core definitions
   [junit4]   2> 417138 T1736 oass.SolrDispatchFilter.init user.dir=/mnt/ssd/jenkins/workspace/Lucene-Solr-trunk-Linux/solr/build/solr-core/test/J1
   [junit4]   2> 417139 T1736 oass.SolrDispatchFilter.init SolrDispatchFilter.init() done
   [junit4]   2> 417139 T1736 oascsi.HttpClientUtil.createClient Creating new http client, config:maxConnections=128&maxConnectionsPerHost=32&followRedirects=false
   [junit4]   2> 417203 T1736 oejs.Server.doStart jetty-8.1.10.v20130312
   [junit4]   2> 417205 T1736 oejs.AbstractConnector.doStart Started SelectChannelConnector@127.0.0.1:46847
   [junit4]   2> 417206 T1736 oass.SolrDispatchFilter.init SolrDispatchFilter.init()
   [junit4]   2> 417206 T1736 oasc.SolrResourceLoader.locateSolrHome JNDI not configured for solr (NoInitialContextEx)
   [junit4]   2> 417207 T1736 oasc.SolrResourceLoader.locateSolrHome using system property solr.solr.home: /mnt/ssd/jenkins/workspace/Lucene-Solr-trunk-Linux/solr/build/solr-core/test/J1/./org.apache.solr.cloud.CollectionsAPIDistributedZkTest-jetty3-1375450389528
   [junit4]   2> 417208 T1736 oasc.SolrResourceLoader.<init> new SolrResourceLoader for directory: '/mnt/ssd/jenkins/workspace/Lucene-Solr-trunk-Linux/solr/build/solr-core/test/J1/./org.apache.solr.cloud.CollectionsAPIDistributedZkTest-jetty3-1375450389528/'
   [junit4]   2> 417222 T1736 oasc.ConfigSolr.fromFile Loading container configuration from /mnt/ssd/jenkins/workspace/Lucene-Solr-trunk-Linux/solr/build/solr-core/test/J1/./org.apache.solr.cloud.CollectionsAPIDistributedZkTest-jetty3-1375450389528/solr.xml
   [junit4]   2> 417256 T1736 oasc.ConfigSolrXml.<init> Config-defined core root directory:
   [junit4]   2> 417257 T1736 oasc.CoreContainer.<init> New CoreContainer 7934951
   [junit4]   2> 417257 T1736 oasc.CoreContainer.load Loading cores into CoreContainer [instanceDir=/mnt/ssd/jenkins/workspace/Lucene-Solr-trunk-Linux/solr/build/solr-core/test/J1/./org.apache.solr.cloud.CollectionsAPIDistributedZkTest-jetty3-1375450389528/]
   [junit4]   2> 417258 T1736 oashc.HttpShardHandlerFactory.getParameter Setting socketTimeout to: 120000
   [junit4]   2> 417258 T1736 oashc.HttpShardHandlerFactory.getParameter Setting urlScheme to: http://
   [junit4]   2> 417258 T1736 oashc.HttpShardHandlerFactory.getParameter Setting connTimeout to: 15000
   [junit4]   2> 417259 T1736 oashc.HttpShardHandlerFactory.getParameter Setting maxConnectionsPerHost to: 20
   [junit4]   2> 417259 T1736 oashc.HttpShardHandlerFactory.getParameter Setting corePoolSize to: 0
   [junit4]   2> 417259 T1736 oashc.HttpShardHandlerFactory.getParameter Setting maximumPoolSize to: 2147483647
   [junit4]   2> 417260 T1736 oashc.HttpShardHandlerFactory.getParameter Setting maxThreadIdleTime to: 5
   [junit4]   2> 417260 T1736 oashc.HttpShardHandlerFactory.getParameter Setting sizeOfQueue to: -1
   [junit4]   2> 417260 T1736 oashc.HttpShardHandlerFactory.getParameter Setting fairnessPolicy to: false
   [junit4]   2> 417260 T1736 oascsi.HttpClientUtil.createClient Creating new http client, config:maxConnectionsPerHost=20&maxConnections=10000&socketTimeout=120000&connTimeout=15000&retry=false
   [junit4]   2> 417263 T1736 oasc.ZkContainer.initZooKeeper Zookeeper client=127.0.0.1:37013/solr
   [junit4]   2> 417263 T1736 oasc.ZkController.checkChrootPath zkHost includes chroot
   [junit4]   2> 417264 T1736 oascc.ConnectionManager.waitForConnected Waiting for client to connect to ZooKeeper
   [junit4]   2> 417266 T1802 oascc.ConnectionManager.process Watcher org.apache.solr.common.cloud.ConnectionManager@184726a name:ZooKeeperConnection Watcher:127.0.0.1:37013 got event WatchedEvent state:SyncConnected type:None path:null path:null type:None
   [junit4]   2> 417266 T1736 oascc.ConnectionManager.waitForConnected Client is connected to ZooKeeper
   [junit4]   2> 417268 T1736 oascsi.HttpClientUtil.createClient Creating new http client, config:maxConnections=500&maxConnectionsPerHost=16&socketTimeout=120000&connTimeout=15000
   [junit4]   2> 417270 T1736 oascc.ConnectionManager.waitForConnected Waiting for client to connect to ZooKeeper
   [junit4]   2> 417272 T1804 oascc.ConnectionManager.process Watcher org.apache.solr.common.cloud.ConnectionManager@16ab61c name:ZooKeeperConnection Watcher:127.0.0.1:37013/solr got event WatchedEvent state:SyncConnected type:None path:null path:null type:None
   [junit4]   2> 417272 T1736 oascc.ConnectionManager.waitForConnected Client is connected to ZooKeeper
   [junit4]   2> 417277 T1736 oascc.ZkStateReader.createClusterStateWatchersAndUpdate Updating cluster state from ZooKeeper...
   [junit4]   2> 418281 T1736 oasc.ZkController.createEphemeralLiveNode Register node as live in ZooKeeper:/live_nodes/127.0.0.1:46847_
   [junit4]   2> 418283 T1736 oascc.SolrZkClient.makePath makePath: /live_nodes/127.0.0.1:46847_
   [junit4]   2> 418287 T1763 oascc.ZkStateReader$3.process Updating live nodes... (4)
   [junit4]   2> 418287 T1790 oascc.ZkStateReader$3.process Updating live nodes... (4)
   [junit4]   2> 418287 T1776 oascc.ZkStateReader$3.process Updating live nodes... (4)
   [junit4]   2> 418287 T1758 oascc.ZkStateReader$3.process Updating live nodes... (4)
   [junit4]   2> 418287 T1804 oascc.ZkStateReader$3.process Updating live nodes... (4)
   [junit4]   2> 418295 T1736 oasc.CorePropertiesLocator.discover Looking for core definitions underneath /mnt/ssd/jenkins/workspace/Lucene-Solr-trunk-Linux/solr/build/solr-core/test/J1/./org.apache.solr.cloud.CollectionsAPIDistributedZkTest-jetty3-1375450389528
   [junit4]   2> 418329 T1736 oasc.CorePropertiesLocator.discoverUnder Found core conf in /mnt/ssd/jenkins/workspace/Lucene-Solr-trunk-Linux/solr/build/solr-core/test/J1/./org.apache.solr.cloud.CollectionsAPIDistributedZkTest-jetty3-1375450389528/conf/
   [junit4]   2> 418330 T1736 oasc.CorePropertiesLocator.discover Found 1 core definitions
   [junit4]   2> 418330 T1736 oass.SolrDispatchFilter.init user.dir=/mnt/ssd/jenkins/workspace/Lucene-Solr-trunk-Linux/solr/build/solr-core/test/J1
   [junit4]   2> 418330 T1736 oass.SolrDispatchFilter.init SolrDispatchFilter.init() done
   [junit4]   2> 418331 T1736 oascsi.HttpClientUtil.createClient Creating new http client, config:maxConnections=128&maxConnectionsPerHost=32&followRedirects=false
   [junit4]   2> 418392 T1736 oejs.Server.doStart jetty-8.1.10.v20130312
   [junit4]   2> 418395 T1736 oejs.AbstractConnector.doStart Started SelectChannelConnector@127.0.0.1:59789
   [junit4]   2> 418395 T1736 oass.SolrDispatchFilter.init SolrDispatchFilter.init()
   [junit4]   2> 418395 T1736 oasc.SolrResourceLoader.locateSolrHome JNDI not configured for solr (NoInitialContextEx)
   [junit4]   2> 418396 T1736 oasc.SolrResourceLoader.locateSolrHome using system property solr.solr.home: /mnt/ssd/jenkins/workspace/Lucene-Solr-trunk-Linux/solr/build/solr-core/test/J1/./org.apache.solr.cloud.CollectionsAPIDistributedZkTest-jetty4-1375450390719
   [junit4]   2> 418396 T1736 oasc.SolrResourceLoader.<init> new SolrResourceLoader for directory: '/mnt/ssd/jenkins/workspace/Lucene-Solr-trunk-Linux/solr/build/solr-core/test/J1/./org.apache.solr.cloud.CollectionsAPIDistributedZkTest-jetty4-1375450390719/'
   [junit4]   2> 418406 T1736 oasc.ConfigSolr.fromFile Loading container configuration from /mnt/ssd/jenkins/workspace/Lucene-Solr-trunk-Linux/solr/build/solr-core/test/J1/./org.apache.solr.cloud.CollectionsAPIDistributedZkTest-jetty4-1375450390719/solr.xml
   [junit4]   2> 418439 T1736 oasc.ConfigSolrXml.<init> Config-defined core root directory:
   [junit4]   2> 418440 T1736 oasc.CoreContainer.<init> New CoreContainer 2175296
   [junit4]   2> 418440 T1736 oasc.CoreContainer.load Loading cores into CoreContainer [instanceDir=/mnt/ssd/jenkins/workspace/Lucene-Solr-trunk-Linux/solr/build/solr-core/test/J1/./org.apache.solr.cloud.CollectionsAPIDistributedZkTest-jetty4-1375450390719/]
   [junit4]   2> 418441 T1736 oashc.HttpShardHandlerFactory.getParameter Setting socketTimeout to: 120000
   [junit4]   2> 418442 T1736 oashc.HttpShardHandlerFactory.getParameter Setting urlScheme to: http://
   [junit4]   2> 418442 T1736 oashc.HttpShardHandlerFactory.getParameter Setting connTimeout to: 15000
   [junit4]   2> 418442 T1736 oashc.HttpShardHandlerFactory.getParameter Setting maxConnectionsPerHost to: 20
   [junit4]   2> 418442 T1736 oashc.HttpShardHandlerFactory.getParameter Setting corePoolSize to: 0
   [junit4]   2> 418443 T1736 oashc.HttpShardHandlerFactory.getParameter Setting maximumPoolSize to: 2147483647
   [junit4]   2> 418443 T1736 oashc.HttpShardHandlerFactory.getParameter Setting maxThreadIdleTime to: 5
   [junit4]   2> 418443 T1736 oashc.HttpShardHandlerFactory.getParameter Setting sizeOfQueue to: -1
   [junit4]   2> 418443 T1736 oashc.HttpShardHandlerFactory.getParameter Setting fairnessPolicy to: false
   [junit4]   2> 418444 T1736 oascsi.HttpClientUtil.createClient Creating new http client, config:maxConnectionsPerHost=20&maxConnections=10000&socketTimeout=120000&connTimeout=15000&retry=false
   [junit4]   2> 418446 T1736 oasc.ZkContainer.initZooKeeper Zookeeper client=127.0.0.1:37013/solr
   [junit4]   2> 418447 T1736 oasc.ZkController.checkChrootPath zkHost includes chroot
   [junit4]   2> 418447 T1736 oascc.ConnectionManager.waitForConnected Waiting for client to connect to ZooKeeper
   [junit4]   2> 418449 T1816 oascc.ConnectionManager.process Watcher org.apache.solr.common.cloud.ConnectionManager@1b94876 name:ZooKeeperConnection Watcher:127.0.0.1:37013 got event WatchedEvent state:SyncConnected type:None path:null path:null type:None
   [junit4]   2> 418450 T1736 oascc.ConnectionManager.waitForConnected Client is connected to ZooKeeper
   [junit4]   2> 418452 T1736 oascsi.HttpClientUtil.createClient Creating new http client, config:maxConnections=500&maxConnectionsPerHost=16&socketTimeout=120000&connTimeout=15000
   [junit4]   2> 418455 T1736 oascc.ConnectionManager.waitForConnected Waiting for client to connect to ZooKeeper
   [junit4]   2> 418456 T1818 oascc.ConnectionManager.process Watcher org.apache.solr.common.cloud.ConnectionManager@e3676a name:ZooKeeperConnection Watcher:127.0.0.1:37013/solr got event WatchedEvent state:SyncConnected type:None path:null path:null type:None
   [junit4]   2> 418456 T1736 oascc.ConnectionManager.waitForConnected Client is connected to ZooKeeper
   [junit4]   2> 418462 T1736 oascc.ZkStateReader.createClusterStateWatchersAndUpdate Updating cluster state from ZooKeeper...
   [junit4]   2> 419465 T1736 oasc.ZkController.createEphemeralLiveNode Register node as live in ZooKeeper:/live_nodes/127.0.0.1:59789_
   [junit4]   2> 419467 T1736 oascc.SolrZkClient.makePath makePath: /live_nodes/127.0.0.1:59789_
   [junit4]   2> 419473 T1804 oascc.ZkStateReader$3.process Updating live nodes... (5)
   [junit4]   2> 419474 T1818 oascc.ZkStateReader$3.process Updating live nodes... (5)
   [junit4]   2> 419473 T1758 oascc.ZkStateReader$3.process Updating live nodes... (5)
   [junit4]   2> 419473 T1763 oascc.ZkStateReader$3.process Updating live nodes... (5)
   [junit4]   2> 419473 T1776 oascc.ZkStateReader$3.process Updating live nodes... (5)
   [junit4]   2> 419473 T1790 oascc.ZkStateReader$3.process Updating live nodes... (5)
   [junit4]   2> 419483 T1736 oasc.CorePropertiesLocator.discover Looking for core definitions underneath /mnt/ssd/jenkins/workspace/Lucene-Solr-trunk-Linux/solr/build/solr-core/test/J1/./org.apache.solr.cloud.CollectionsAPIDistributedZkTest-jetty4-1375450390719
   [junit4]   2> 419513 T1736 oasc.CorePropertiesLocator.discoverUnder Found core conf in /mnt/ssd/jenkins/workspace/Lucene-Solr-trunk-Linux/solr/build/solr-core/test/J1/./org.apache.solr.cloud.CollectionsAPIDistributedZkTest-jetty4-1375450390719/conf/
   [junit4]   2> 419513 T1736 oasc.CorePropertiesLocator.discover Found 1 core definitions
   [junit4]   2> 419514 T1736 oass.SolrDispatchFilter.init user.dir=/mnt/ssd/jenkins/workspace/Lucene-Solr-trunk-Linux/solr/build/solr-core/test/J1
   [junit4]   2> 419514 T1736 oass.SolrDispatchFilter.init SolrDispatchFilter.init() done
   [junit4]   2> 419514 T1736 oascsi.HttpClientUtil.createClient Creating new http client, config:maxConnections=128&maxConnectionsPerHost=32&followRedirects=false
   [junit4]   2> 419517 T1736 oascsi.HttpClientUtil.createClient Creating new http client, config:maxConnections=128&maxConnectionsPerHost=32&followRedirects=false
   [junit4]   2> 419520 T1770 oasha.CollectionsHandler.handleCreateAction Creating Collection : numShards=2&name=nodes_used_collection&replicationFactor=2&action=CREATE&wt=javabin&version=2
   [junit4]   2> 419522 T1758 oasc.DistributedQueue$LatchChildWatcher.process Watcher fired on path: /overseer/collection-queue-work state: SyncConnected type NodeChildrenChanged
   [junit4]   2> 419524 T1760 oasc.OverseerCollectionProcessor.run Overseer Collection Processor: Get the message id:/overseer/collection-queue-work/qn-0000000000 message:{
   [junit4]   2>  "operation":"createcollection",
   [junit4]   2>  "numShards":"2",
   [junit4]   2>  "name":"nodes_used_collection",
   [junit4]   2>  "replicationFactor":"2"}
   [junit4]   2> 419524 T1760 oasc.OverseerCollectionProcessor.processMessage WARN OverseerCollectionProcessor.processMessage : createcollection , {
   [junit4]   2>  "operation":"createcollection",
   [junit4]   2>  "numShards":"2",
   [junit4]   2>  "name":"nodes_used_collection",
   [junit4]   2>  "replicationFactor":"2"}
   [junit4]   2> 420759 T1759 oascc.ZkStateReader.updateClusterState Updating cloud state from ZooKeeper...
   [junit4]   2> 420760 T1759 oasc.Overseer$ClusterStateUpdater.buildCollection building a new collection: nodes_used_collection
   [junit4]   2> 420761 T1759 oasc.Overseer$ClusterStateUpdater.createCollection Create collection nodes_used_collection with shards [shard1, shard2]
   [junit4]   2> 420767 T1818 oascc.ZkStateReader$2.process A cluster state change: WatchedEvent state:SyncConnected type:NodeDataChanged path:/clusterstate.json, has occurred - updating... (live nodes size: 5)
   [junit4]   2> 420768 T1763 oascc.ZkStateReader$2.process A cluster state change: WatchedEvent state:SyncConnected type:NodeDataChanged path:/clusterstate.json, has occurred - updating... (live nodes size: 5)
   [junit4]   2> 420768 T1776 oascc.ZkStateReader$2.process A cluster state change: WatchedEvent state:SyncConnected type:NodeDataChanged path:/clusterstate.json, has occurred - updating... (live nodes size: 5)
   [junit4]   2> 420767 T1758 oascc.ZkStateReader$2.process A cluster state change: WatchedEvent state:SyncConnected type:NodeDataChanged path:/clusterstate.json, has occurred - updating... (live nodes size: 5)
   [junit4]   2> 420767 T1790 oascc.ZkStateReader$2.process A cluster state change: WatchedEvent state:SyncConnected type:NodeDataChanged path:/clusterstate.json, has occurred - updating... (live nodes size: 5)
   [junit4]   2> 420767 T1804 oascc.ZkStateReader$2.process A cluster state change: WatchedEvent state:SyncConnected type:NodeDataChanged path:/clusterstate.json, has occurred - updating... (live nodes size: 5)
   [junit4]   2> 420831 T1760 oasc.OverseerCollectionProcessor.createCollection going to create cores replicas shardNames [shard1, shard2] , repFactor : 2
   [junit4]   2> 420831 T1760 oasc.OverseerCollectionProcessor.createCollection Creating shard nodes_used_collection_shard1_replica1 as part of slice shard1 of collection nodes_used_collection on 127.0.0.1:46847_
   [junit4]   2> 420832 T1760 oasc.OverseerCollectionProcessor.createCollection Creating shard nodes_used_collection_shard1_replica2 as part of slice shard1 of collection nodes_used_collection on 127.0.0.1:54974_
   [junit4]   2> 420833 T1760 oasc.OverseerCollectionProcessor.createCollection Creating shard nodes_used_collection_shard2_replica1 as part of slice shard2 of collection nodes_used_collection on 127.0.0.1:39942_
   [junit4]   2> 420834 T1760 oasc.OverseerCollectionProcessor.createCollection Creating shard nodes_used_collection_shard2_replica2 as part of slice shard2 of collection nodes_used_collection on 127.0.0.1:59789_
   [junit4]   2> 420839 T1772 oasc.ZkController.publish publishing core=nodes_used_collection_shard1_replica2 state=down
   [junit4]   2> 420839 T1797 oasc.ZkController.publish publishing core=nodes_used_collection_shard1_replica1 state=down
   [junit4]   2> 420839 T1811 oasc.ZkController.publish publishing core=nodes_used_collection_shard2_replica2 state=down
   [junit4]   2> 420839 T1752 oasc.ZkController.publish publishing core=nodes_used_collection_shard2_replica1 state=down
   [junit4]   2> 420841 T1797 oasc.ZkController.waitForCoreNodeName look for our core node name
   [junit4]   2> 420840 T1772 oasc.ZkController.waitForCoreNodeName look for our core node name
   [junit4]   2> 420842 T1752 oasc.ZkController.waitForCoreNodeName look for our core node name
   [junit4]   2> 420842 T1811 oasc.ZkController.waitForCoreNodeName look for our core node name
   [junit4]   2> 422275 T1759 oascc.ZkStateReader.updateClusterState Updating cloud state from ZooKeeper...
   [junit4]   2> 422277 T1759 oasc.Overseer$ClusterStateUpdater.updateState WARN Could not find collection node for nodes_used_collection, skipping publish state
   [junit4]   2> 422278 T1759 oasc.Overseer$ClusterStateUpdater.updateState Update state numShards=2 message={
   [junit4]   2>  "operation":"state",
   [junit4]   2>  "core_node_name":"core_node1",
   [junit4]   2>  "numShards":"2",
   [junit4]   2>  "shard":"shard1",
   [junit4]   2>  "roles":null,
   [junit4]   2>  "state":"down",
   [junit4]   2>  "shard_state":"active",
   [junit4]   2>  "core":"nodes_used_collection_shard1_replica2",
   [junit4]   2>  "collection":"nodes_used_collection",
   [junit4]   2>  "shard_range":null,
   [junit4]   2>  "node_name":"127.0.0.1:54974_",
   [junit4]   2>  "base_url":"http://127.0.0.1:54974"}
   [junit4]   2> 422284 T1759 oasc.Overseer$ClusterStateUpdater.updateState WARN Could not find collection node for nodes_used_collection, skipping publish state
   [junit4]   2> 422284 T1759 oasc.Overseer$ClusterStateUpdater.updateState Update state numShards=2 message={
   [junit4]   2>  "operation":"state",
   [junit4]   2>  "core_node_name":"core_node2",
   [junit4]   2>  "numShards":"2",
   [junit4]   2>  "shard":"shard1",
   [junit4]   2>  "roles":null,
   [junit4]   2>  "state":"down",
   [junit4]   2>  "shard_state":"active",
   [junit4]   2>  "core":"nodes_used_collection_shard1_replica1",
   [junit4]   2>  "collection":"nodes_used_collection",
   [junit4]   2>  "shard_range":null,
   [junit4]   2>  "node_name":"127.0.0.1:46847_",
   [junit4]   2>  "base_url":"http://127.0.0.1:46847"}
   [junit4]   2> 422289 T1759 oasc.Overseer$ClusterStateUpdater.updateState WARN Could not find collection node for nodes_used_collection, skipping publish state
   [junit4]   2> 422290 T1759 oasc.Overseer$ClusterStateUpdater.updateState Update state numShards=2 message={
   [junit4]   2>  "operation":"state",
   [junit4]   2>  "core_node_name":"core_node3",
   [junit4]   2>  "numShards":"2",
   [junit4]   2>  "shard":"shard2",
   [junit4]   2>  "roles":null,
   [junit4]   2>  "state":"down",
   [junit4]   2>  "shard_state":"active",
   [junit4]   2>  "core":"nodes_used_collection_shard2_replica2",
   [junit4]   2>  "collection":"nodes_used_collection",
   [junit4]   2>  "shard_range":null,
   [junit4]   2>  "node_name":"127.0.0.1:59789_",
   [junit4]   2>  "base_url":"http://127.0.0.1:59789"}
   [junit4]   2> 422295 T1759 oasc.Overseer$ClusterStateUpdater.updateState WARN Could not find collection node for nodes_used_collection, skipping publish state
   [junit4]   2> 422295 T1759 oasc.Overseer$ClusterStateUpdater.updateState Update state numShards=2 message={
   [junit4]   2>  "operation":"state",
   [junit4]   2>  "core_node_name":"core_node4",
   [junit4]   2>  "numShards":"2",
   [junit4]   2>  "shard":"shard2",
   [junit4]   2>  "roles":null,
   [junit4]   2>  "state":"down",
   [junit4]   2>  "shard_state":"active",
   [junit4]   2>  "core":"nodes_used_collection_shard2_replica1",
   [junit4]   2>  "collection":"nodes_used_collection",
   [junit4]   2>  "shard_range":null,
   [junit4]   2>  "node_name":"127.0.0.1:39942_",
   [junit4]   2>  "base_url":"http://127.0.0.1:39942"}
   [junit4]   2> 422301 T1818 oascc.ZkStateReader$2.process A cluster state change: WatchedEvent state:SyncConnected type:NodeDataChanged path:/clusterstate.json, has occurred - updating... (live nodes size: 5)
   [junit4]   2> 422302 T1758 oascc.ZkStateReader$2.process A cluster state change: WatchedEvent state:SyncConnected type:NodeDataChanged path:/clusterstate.json, has occurred - updating... (live nodes size: 5)
   [junit4]   2> 422302 T1763 oascc.ZkStateReader$2.process A cluster state change: WatchedEvent state:SyncConnected type:NodeDataChanged path:/clusterstate.json, has occurred - updating... (live nodes size: 5)
   [junit4]   2> 422302 T1804 oascc.ZkStateReader$2.process A cluster state change: WatchedEvent state:SyncConnected type:NodeDataChanged path:/clusterstate.json, has occurred - updating... (live nodes size: 5)
   [junit4]   2> 422302 T1776 oascc.ZkStateReader$2.process A cluster state change: WatchedEvent state:SyncConnected type:NodeDataChanged path:/clusterstate.json, has occurred - updating... (live nodes size: 5)
   [junit4]   2> 422302 T1790 oascc.ZkStateReader$2.process A cluster state change: WatchedEvent state:SyncConnected type:NodeDataChanged path:/clusterstate.json, has occurred - updating... (live nodes size: 5)
   [junit4]   2> 422843 T1797 oasc.ZkController.waitForShardId waiting to find shard id in clusterstate for nodes_used_collection_shard1_replica1
   [junit4]   2> 422843 T1772 oasc.ZkController.waitForShardId waiting to find shard id in clusterstate for nodes_used_collection_shard1_replica2
   [junit4]   2> 422844 T1797 oasc.CorePropertiesLocator.writePropertiesFile ERROR Couldn't persist core properties to /mnt/ssd/jenkins/workspace/Lucene-Solr-trunk-Linux/solr/build/solr-core/test/J1/./org.apache.solr.cloud.CollectionsAPIDistributedZkTest-jetty3-1375450389528/nodes_used_collection_shard1_replica1/core.properties: java.io.FileNotFoundException: /mnt/ssd/jenkins/workspace/Lucene-Solr-trunk-Linux/solr/build/solr-core/test/J1/./org.apache.solr.cloud.CollectionsAPIDistributedZkTest-jetty3-1375450389528/nodes_used_collection_shard1_replica1/core.properties (No such file or directory)
   [junit4]   2> 422845 T1797 oasc.CoreContainer.create Creating SolrCore 'nodes_used_collection_shard1_replica1' using instanceDir: /mnt/ssd/jenkins/workspace/Lucene-Solr-trunk-Linux/solr/build/solr-core/test/J1/./org.apache.solr.cloud.CollectionsAPIDistributedZkTest-jetty3-1375450389528/nodes_used_collection_shard1_replica1
   [junit4]   2> 422845 T1797 oasc.ZkController.createCollectionZkNode Check for collection zkNode:nodes_used_collection
   [junit4]   2> 422844 T1772 oasc.CorePropertiesLocator.writePropertiesFile ERROR Couldn't persist core properties to /mnt/ssd/jenkins/workspace/Lucene-Solr-trunk-Linux/solr/build/solr-core/test/J1/./org.apache.solr.cloud.CollectionsAPIDistributedZkTest-jetty1-1375450387167/nodes_used_collection_shard1_replica2/core.properties: java.io.FileNotFoundException: /mnt/ssd/jenkins/workspace/Lucene-Solr-trunk-Linux/solr/build/solr-core/test/J1/./org.apache.solr.cloud.CollectionsAPIDistributedZkTest-jetty1-1375450387167/nodes_used_collection_shard1_replica2/core.properties (No such file or directory)
   [junit4]   2> 422844 T1811 oasc.ZkController.waitForShardId waiting to find shard id in clusterstate for nodes_used_collection_shard2_replica2
   [junit4]   2> 422843 T1752 oasc.ZkController.waitForShardId waiting to find shard id in clusterstate for nodes_used_collection_shard2_replica1
   [junit4]   2> 422847 T1811 oasc.CorePropertiesLocator.writePropertiesFile ERROR Couldn't persist core properties to /mnt/ssd/jenkins/workspace/Lucene-Solr-trunk-Linux/solr/build/solr-core/test/J1/./org.apache.solr.cloud.CollectionsAPIDistributedZkTest-jetty4-1375450390719/nodes_used_collection_shard2_replica2/core.properties: java.io.FileNotFoundException: /mnt/ssd/jenkins/workspace/Lucene-Solr-trunk-Linux/solr/build/solr-core/test/J1/./org.apache.solr.cloud.CollectionsAPIDistributedZkTest-jetty4-1375450390719/nodes_used_collection_shard2_replica2/core.properties (No such file or directory)
   [junit4]   2> 422847 T1797 oasc.ZkController.createCollectionZkNode Creating collection in ZooKeeper:nodes_used_collection
   [junit4]   2> 422847 T1772 oasc.CoreContainer.create Creating SolrCore 'nodes_used_collection_shard1_replica2' using instanceDir: /mnt/ssd/jenkins/workspace/Lucene-Solr-trunk-Linux/solr/build/solr-core/test/J1/./org.apache.solr.cloud.CollectionsAPIDistributedZkTest-jetty1-1375450387167/nodes_used_collection_shard1_replica2
   [junit4]   2> 422850 T1772 oasc.ZkController.createCollectionZkNode Check for collection zkNode:nodes_used_collection
   [junit4]   2> 422849 T1797 oasc.ZkController.getConfName Looking for collection configName
   [junit4]   2> 422848 T1811 oasc.CoreContainer.create Creating SolrCore 'nodes_used_collection_shard2_replica2' using instanceDir: /mnt/ssd/jenkins/workspace/Lucene-Solr-trunk-Linux/solr/build/solr-core/test/J1/./org.apache.solr.cloud.CollectionsAPIDistributedZkTest-jetty4-1375450390719/nodes_used_collection_shard2_replica2
   [junit4]   2> 422852 T1811 oasc.ZkController.createCollectionZkNode Check for collection zkNode:nodes_used_collection
   [junit4]   2> 422848 T1752 oasc.CorePropertiesLocator.writePropertiesFile ERROR Couldn't persist core properties to /mnt/ssd/jenkins/workspace/Lucene-Solr-trunk-Linux/solr/build/solr-core/test/J1/./org.apache.solr.cloud.CollectionsAPIDistributedZkTest-controljetty-1375450386975/nodes_used_collection_shard2_replica1/core.properties: java.io.FileNotFoundException: /mnt/ssd/jenkins/workspace/Lucene-Solr-trunk-Linux/solr/build/solr-core/test/J1/./org.apache.solr.cloud.CollectionsAPIDistributedZkTest-controljetty-1375450386975/nodes_used_collection_shard2_replica1/core.properties (No such file or directory)
   [junit4]   2> 422853 T1811 oasc.ZkController.createCollectionZkNode Creating collection in ZooKeeper:nodes_used_collection
   [junit4]   2> 422853 T1797 oasc.ZkController.getConfName Only one config set found in zk - using it:conf1
   [junit4]   2> 422851 T1772 oasc.ZkController.createCollectionZkNode Creating collection in ZooKeeper:nodes_used_collection
   [junit4]   2> 422854 T1797 oascc.SolrZkClient.makePath makePath: /collections/nodes_used_collection
   [junit4]   2> 422854 T1811 oasc.ZkController.getConfName Looking for collection configName
   [junit4]   2> 422853 T1752 oasc.CoreContainer.create Creating SolrCore 'nodes_used_collection_shard2_replica1' using instanceDir: /mnt/ssd/jenkins/workspace/Lucene-Solr-trunk-Linux/solr/build/solr-core/test/J1/./org.apache.solr.cloud.CollectionsAPIDistributedZkTest-controljetty-1375450386975/nodes_used_collection_shard2_replica1
   [junit4]   2> 422857 T1752 oasc.ZkController.createCollectionZkNode Check for collection zkNode:nodes_used_collection
   [junit4]   2> 422855 T1772 oasc.ZkController.getConfName Looking for collection configName
   [junit4]   2> 422857 T1811 oasc.ZkController.getConfName Only one config set found in zk - using it:conf1
   [junit4]   2> 422859 T1811 oascc.SolrZkClient.makePath makePath: /collections/nodes_used_collection
   [junit4]   2> 422859 T1752 oasc.ZkController.createCollectionZkNode Collection zkNode exists
   [junit4]   2> 422859 T1772 oascc.SolrZkClient.makePath makePath: /collections/nodes_used_collection
   [junit4]   2> 422859 T1797 oasc.ZkController.readConfigName Load collection config from:/collections/nodes_used_collection
   [junit4]   2> 422860 T1752 oasc.ZkController.readConfigName Load collection config from:/collections/nodes_used_collection
   [junit4]   2> 422862 T1811 oasc.ZkController.readConfigName Load collection config from:/collections/nodes_used_collection
   [junit4]   2> 422863 T1797 oasc.SolrResourceLoader.<init> new SolrResourceLoader for directory: '/mnt/ssd/jenkins/workspace/Lucene-Solr-trunk-Linux/solr/build/solr-core/test/J1/./org.apache.solr.cloud.CollectionsAPIDistributedZkTest-jetty3-1375450389528/nodes_used_collection_shard1_replica1/'
   [junit4]   2> 422863 T1772 oasc.ZkController.readConfigName Load collection config from:/collections/nodes_used_collection
   [junit4]   2> 422864 T1811 oasc.SolrResourceLoader.<init> new SolrResourceLoader for directory: '/mnt/ssd/jenkins/workspace/Lucene-Solr-trunk-Linux/solr/build/solr-core/test/J1/./org.apache.solr.cloud.CollectionsAPIDistributedZkTest-jetty4-1375450390719/nodes_used_collection_shard2_replica2/'
   [junit4]   2> 422864 T1752 oasc.SolrResourceLoader.<init> new SolrResourceLoader for directory: '/mnt/ssd/jenkins/workspace/Lucene-Solr-trunk-Linux/solr/build/solr-core/test/J1/./org.apache.solr.cloud.CollectionsAPIDistributedZkTest-controljetty-1375450386975/nodes_used_collection_shard2_replica1/'
   [junit4]   2> 422866 T1772 oasc.SolrResourceLoader.<init> new SolrResourceLoader for directory: '/mnt/ssd/jenkins/workspace/Lucene-Solr-trunk-Linux/solr/build/solr-core/test/J1/./org.apache.solr.cloud.CollectionsAPIDistributedZkTest-jetty1-1375450387167/nodes_used_collection_shard1_replica2/'
   [junit4]   2> 422937 T1752 oasc.SolrConfig.<init> Using Lucene MatchVersion: LUCENE_50
   [junit4]   2> 422939 T1797 oasc.SolrConfig.<init> Using Lucene MatchVersion: LUCENE_50
   [junit4]   2> 422940 T1772 oasc.SolrConfig.<init> Using Lucene MatchVersion: LUCENE_50
   [junit4]   2> 422943 T1811 oasc.SolrConfig.<init> Using Lucene MatchVersion: LUCENE_50
   [junit4]   2> 422979 T1752 oasc.SolrConfig.<init> Loaded SolrConfig: solrconfig.xml
   [junit4]   2> 422980 T1752 oass.IndexSchema.readSchema Reading Solr Schema from schema.xml
   [junit4]   2> 422981 T1797 oasc.SolrConfig.<init> Loaded SolrConfig: solrconfig.xml
   [junit4]   2> 422982 T1772 oasc.SolrConfig.<init> Loaded SolrConfig: solrconfig.xml
   [junit4]   2> 422982 T1797 oass.IndexSchema.readSchema Reading Solr Schema from schema.xml
   [junit4]   2> 422983 T1772 oass.IndexSchema.readSchema Reading Solr Schema from schema.xml
   [junit4]   2> 422986 T1811 oasc.SolrConfig.<init> Loaded SolrConfig: solrconfig.xml
   [junit4]   2> 422987 T1811 oass.IndexSchema.readSchema Reading Solr Schema from schema.xml
   [junit4]   2> 422989 T1752 oass.IndexSchema.readSchema [nodes_used_collection_shard2_replica1] Schema name=test
   [junit4]   2> 422990 T1797 oass.IndexSchema.readSchema [nodes_used_collection_shard1_replica1] Schema name=test
   [junit4]   2> 422991 T1772 oass.IndexSchema.readSchema [nodes_used_collection_shard1_replica2] Schema name=test
   [junit4]   2> 422995 T1811 oass.IndexSchema.readSchema [nodes_used_collection_shard2_replica2] Schema name=test
   [junit4]   2> 423439 T1811 oass.OpenExchangeRatesOrgProvider.init Initialized with rates=open-exchange-rates.json, refreshInterval=1440.
   [junit4]   2> 423446 T1811 oass.IndexSchema.readSchema default search field in schema is text
   [junit4]   2> 423449 T1811 oass.IndexSchema.readSchema unique key field: id
   [junit4]   2> 423450 T1797 oass.OpenExchangeRatesOrgProvider.init Initialized with rates=open-exchange-rates.json, refreshInterval=1440.
   [junit4]   2> 423456 T1797 oass.IndexSchema.readSchema default search field in schema is text
   [junit4]   2> 423459 T1811 oass.FileExchangeRateProvider.reload Reloading exchange rates from file currency.xml
   [junit4]   2> 423460 T1797 oass.IndexSchema.readSchema unique key field: id
   [junit4]   2> 423463 T1811 oass.FileExchangeRateProvider.reload Reloading exchange rates from file currency.xml
   [junit4]   2> 423471 T1811 oass.OpenExchangeRatesOrgProvider.reload Reloading exchange rates from open-exchange-rates.json
   [junit4]   2> 423472 T1797 oass.FileExchangeRateProvider.reload Reloading exchange rates from file currency.xml
   [junit4]   2> 423473 T1811 oass.OpenExchangeRatesOrgProvider$OpenExchangeRates.<init> WARN Unknown key IMPORTANT NOTE
   [junit4]   2> 423473 T1811 oass.OpenExchangeRatesOrgProvider$OpenExchangeRates.<init> WARN Expected key, got STRING
   [junit4]   2> 423473 T1811 oass.OpenExchangeRatesOrgProvider.reload Reloading exchange rates from open-exchange-rates.json
   [junit4]   2> 423474 T1811 oass.OpenExchangeRatesOrgProvider$OpenExchangeRates.<init> WARN Unknown key IMPORTANT NOTE
   [junit4]   2> 423475 T1811 oass.OpenExchangeRatesOrgProvider$OpenExchangeRates.<init> WARN Expected key, got STRING
   [junit4]   2> 423475 T1811 oasc.SolrCore.initDirectoryFactory org.apache.solr.core.MockDirectoryFactory
   [junit4]   2> 423475 T1797 oass.FileExchangeRateProvider.reload Reloading exchange rates from file currency.xml
   [junit4]   2> 423476 T1811 oasc.SolrCore.<init> [nodes_used_collection_shard2_replica2] Opening new SolrCore at /mnt/ssd/jenkins/workspace/Lucene-Solr-trunk-Linux/solr/build/solr-core/test/J1/./org.apache.solr.cloud.CollectionsAPIDistributedZkTest-jetty4-1375450390719/nodes_used_collection_shard2_replica2/, dataDir=/mnt/ssd/jenkins/workspace/Lucene-Solr-trunk-Linux/solr/build/solr-core/test/J1/./org.apache.solr.cloud.CollectionsAPIDistributedZkTest-jetty4-1375450390719//nodes_used_collection_shard2_replica2/data/
   [junit4]   2> 423476 T1811 oasc.JmxMonitoredMap.<init> JMX monitoring is enabled. Adding Solr mbeans to JMX Server: com.sun.jmx.mbeanserver.JmxMBeanServer@1ff1bd3
   [junit4]   2> 423477 T1811 oasc.CachingDirectoryFactory.get return new directory for /mnt/ssd/jenkins/workspace/Lucene-Solr-trunk-Linux/solr/build/solr-core/test/J1/./org.apache.solr.cloud.CollectionsAPIDistributedZkTest-jetty4-1375450390719//nodes_used_collection_shard2_replica2/data
   [junit4]   2> 423478 T1811 oasc.SolrCore.getNewIndexDir New index directory detected: old=null new=/mnt/ssd/jenkins/workspace/Lucene-Solr-trunk-Linux/solr/build/solr-core/test/J1/./org.apache.solr.cloud.CollectionsAPIDistributedZkTest-jetty4-1375450390719//nodes_used_collection_shard2_replica2/data/index/
   [junit4]   2> 423478 T1811 oasc.SolrCore.initIndex WARN [nodes_used_collection_shard2_replica2] Solr index directory '/mnt/ssd/jenkins/workspace/Lucene-Solr-trunk-Linux/solr/build/solr-core/test/J1/./org.apache.solr.cloud.CollectionsAPIDistributedZkTest-jetty4-1375450390719/nodes_used_collection_shard2_replica2/data/index' doesn't exist. Creating new index...
   [junit4]   2> 423478 T1797 oass.OpenExchangeRatesOrgProvider.reload Reloading exchange rates from open-exchange-rates.json
   [junit4]   2> 423479 T1811 oasc.CachingDirectoryFactory.get return new directory for /mnt/ssd/jenkins/workspace/Lucene-Solr-trunk-Linux/solr/build/solr-core/test/J1/./org.apache.solr.cloud.CollectionsAPIDistributedZkTest-jetty4-1375450390719//nodes_used_collection_shard2_replica2/data/index
   [junit4]   2> 423479 T1797 oass.OpenExchangeRatesOrgProvider$OpenExchangeRates.<init> WARN Unknown key IMPORTANT NOTE
   [junit4]   2> 423480 T1797 oass.OpenExchangeRatesOrgProvider$OpenExchangeRates.<init> WARN Expected key, got STRING
   [junit4]   2> 423480 T1797 oass.OpenExchangeRatesOrgProvider.reload Reloading exchange rates from open-exchange-rates.json
   [junit4]   2> 423481 T1811 oasc.SolrDeletionPolicy.onCommit SolrDeletionPolicy.onCommit: commits: num=1
   [junit4]   2> commit{dir=MockDirWrapper(RateLimitedDirectoryWrapper(org.apache.lucene.store.RAMDirectory@19af0c5 lockFactory=org.apache.lucene.store.NativeFSLockFactory@d0274c)),segFN=segments_1,generation=1}
   [junit4]   2> 423481 T1811 oasc.SolrDeletionPolicy.updateCommits newest commit generation = 1
   [junit4]   2> 423481 T1797 oass.OpenExchangeRatesOrgProvider$OpenExchangeRates.<init> WARN Unknown key IMPORTANT NOTE
   [junit4]   2> 423482 T1797 oass.OpenExchangeRatesOrgProvider$OpenExchangeRates.<init> WARN Expected key, got STRING
   [junit4]   2> 423482 T1797 oasc.SolrCore.initDirectoryFactory org.apache.solr.core.MockDirectoryFactory
   [junit4]   2> 423483 T1797 oasc.SolrCore.<init> [nodes_used_collection_shard1_replica1] Opening new SolrCore at /mnt/ssd/jenkins/workspace/Lucene-Solr-trunk-Linux/solr/build/solr-core/test/J1/./org.apache.solr.cloud.CollectionsAPIDistributedZkTest-jetty3-1375450389528/nodes_used_collection_shard1_replica1/, dataDir=/mnt/ssd/jenkins/workspace/Lucene-Solr-trunk-Linux/solr/build/solr-core/test/J1/./org.apache.solr.cloud.CollectionsAPIDistributedZkTest-jetty3-1375450389528//nodes_used_collection_shard1_replica1/data/
   [junit4]   2> 423483 T1797 oasc.JmxMonitoredMap.<init> JMX monitoring is enabled. Adding Solr mbeans to JMX Server: com.sun.jmx.mbeanserver.JmxMBeanServer@1ff1bd3
   [junit4]   2> 423484 T1797 oasc.CachingDirectoryFactory.get return new directory for /mnt/ssd/jenkins/workspace/Lucene-Solr-trunk-Linux/solr/build/solr-core/test/J1/./org.apache.solr.cloud.CollectionsAPIDistributedZkTest-jetty3-1375450389528//nodes_used_collection_shard1_replica1/data
   [junit4]   2> 423484 T1797 oasc.SolrCore.getNewIndexDir New index directory detected: old=null new=/mnt/ssd/jenkins/workspace/Lucene-Solr-trunk-Linux/solr/build/solr-core/test/J1/./org.apache.solr.cloud.CollectionsAPIDistributedZkTest-jetty3-1375450389528//nodes_used_collection_shard1_replica1/data/index/
   [junit4]   2> 423484 T1772 oass.OpenExchangeRatesOrgProvider.init Initialized with rates=open-exchange-rates.json, refreshInterval=1440.
   [junit4]   2> 423484 T1797 oasc.SolrCore.initIndex WARN [nodes_used_collection_shard1_replica1] Solr index directory '/mnt/ssd/jenkins/workspace/Lucene-Solr-trunk-Linux/solr/build/solr-core/test/J1/./org.apache.solr.cloud.CollectionsAPIDistributedZkTest-jetty3-1375450389528/nodes_used_collection_shard1_replica1/data/index' doesn't exist. Creating new index...
   [junit4]   2> 423485 T1797 oasc.CachingDirectoryFactory.get return new directory for /mnt/ssd/jenkins/workspace/Lucene-Solr-trunk-Linux/solr/build/solr-core/test/J1/./org.apache.solr.cloud.CollectionsAPIDistributedZkTest-jetty3-1375450389528//nodes_used_collection_shard1_replica1/data/index
   [junit4]   2> 423486 T1811 oasup.UpdateRequestProcessorChain.init inserting DistributedUpdateProcessorFactory into updateRequestProcessorChain "dedupe"
   [junit4]   2> 423486 T1811 oasup.UpdateRequestProcessorChain.init inserting DistributedUpdateProcessorFactory into updateRequestProcessorChain "stored_sig"
   [junit4]   2> 423486 T1797 oasc.SolrDeletionPolicy.onCommit SolrDeletionPolicy.onCommit: commits: num=1
   [junit4]   2> commit{dir=MockDirWrapper(RateLimitedDirectoryWrapper(org.apache.lucene.store.RAMDirectory@474151 lockFactory=org.apache.lucene.store.NativeFSLockFactory@de2a54)),segFN=segments_1,generation=1}
   [junit4]   2> 423487 T1797 oasc.SolrDeletionPolicy.updateCommits newest commit generation = 1
   [junit4]   2> 423487 T1811 oasup.UpdateRequestProcessorChain.init inserting DistributedUpdateProcessorFactory into updateRequestProcessorChain "distrib-dup-test-chain-implicit"
   [junit4]   2> 423488 T1811 oasc.RequestHandlers.initHandlersFromConfig created standard: solr.StandardRequestHandler
   [junit4]   2> 423489 T1811 oasc.RequestHandlers.initHandlersFromConfig created /get: solr.RealTimeGetHandler
   [junit4]   2> 423489 T1811 oasc.RequestHandlers.initHandlersFromConfig adding lazy requestHandler: solr.ReplicationHandler
   [junit4]   2> 423490 T1797 oasup.UpdateRequestProcessorChain.init inserting DistributedUpdateProcessorFactory into updateRequestProcessorChain "dedupe"
   [junit4]   2> 423490 T1811 oasc.RequestHandlers.initHandlersFromConfig created /replication: solr.ReplicationHandler
   [junit4]   2> 423490 T1797 oasup.UpdateRequestProcessorChain.init inserting DistributedUpdateProcessorFactory into updateRequestProcessorChain "stored_sig"
   [junit4]   2> 423491 T1811 oasc.RequestHandlers.initHandlersFromConfig created /update: solr.UpdateRequestHandler
   [junit4]   2> 423491 T1797 oasup.UpdateRequestProcessorChain.init inserting DistributedUpdateProcessorFactory into updateRequestProcessorChain "distrib-dup-test-chain-implicit"
   [junit4]   2> 423491 T1772 oass.IndexSchema.readSchema default search field in schema is text
   [junit4]   2> 423491 T1811 oasc.RequestHandlers.initHandlersFromConfig created /admin/: org.apache.solr.handler.admin.AdminHandlers
   [junit4]   2> 423492 T1797 oasc.RequestHandlers.initHandlersFromConfig created standard: solr.StandardRequestHandler
   [junit4]   2> 423492 T1797 oasc.RequestHandlers.initHandlersFromConfig created /get: solr.RealTimeGetHandler
   [junit4]   2> 423493 T1797 oasc.RequestHandlers.initHandlersFromConfig adding lazy requestHandler: solr.ReplicationHandler
   [junit4]   2> 423493 T1797 oasc.RequestHandlers.initHandlersFromConfig created /replication: solr.ReplicationHandler
   [junit4]   2> 423494 T1797 oasc.RequestHandlers.initHandlersFromConfig created /update: solr.UpdateRequestHandler
   [junit4]   2> 423494 T1797 oasc.RequestHandlers.initHandlersFromConfig created /admin/: org.apache.solr.handler.admin.AdminHandlers
   [junit4]   2> 423494 T1772 oass.IndexSchema.readSchema unique key field: id
   [junit4]   2> 423495 T1797 oashl.XMLLoader.init xsltCacheLifetimeSeconds=60
   [junit4]   2> 423495 T1811 oashl.XMLLoader.init xsltCacheLifetimeSeconds=60
   [junit4]   2> 423497 T1797 oass.SolrIndexSearcher.<init> Opening Searcher@5ebea2 main
   [junit4]   2> 423498 T1797 oasu.CommitTracker.<init> Hard AutoCommit: disabled
   [junit4]   2> 423498 T1797 oasu.CommitTracker.<init> Soft AutoCommit: disabled
   [junit4]   2> 423499 T1811 oass.SolrIndexSearcher.<init> Opening Searcher@dfb33d main
   [junit4]   2> 423500 T1811 oasu.CommitTracker.<init> Hard AutoCommit: disabled
   [junit4]   2> 423500 T1811 oasu.CommitTracker.<init> Soft AutoCommit: disabled
   [junit4]   2> 423503 T1824 oasc.SolrCore.registerSearcher [nodes_used_collection_shard1_replica1] Registered new searcher Searcher@5ebea2 main{StandardDirectoryReader(segments_1:1)}
   [junit4]   2> 423504 T1797 oasc.CoreContainer.registerCore registering core: nodes_used_collection_shard1_replica1
   [junit4]   2> 423504 T1797 oasc.ZkController.register Register replica - core:nodes_used_collection_shard1_replica1 address:http://127.0.0.1:46847 collection:nodes_used_collection shard:shard1
   [junit4]   2> 423504 T1752 oass.OpenExchangeRatesOrgProvider.init Initialized with rates=open-exchange-rates.json, refreshInterval=1440.
   [junit4]   2> 423504 T1797 oascsi.HttpClientUtil.createClient Creating new http client, config:maxConnections=10000&maxConnectionsPerHost=20&connTimeout=15000&socketTimeout=30000&retry=false
   [junit4]   2> 423505 T1825 oasc.SolrCore.registerSearcher [nodes_used_collection_shard2_replica2] Registered new searcher Searcher@dfb33d main{StandardDirectoryReader(segments_1:1)}
   [junit4]   2> 423506 T1772 oass.FileExchangeRateProvider.reload Reloading exchange rates from file currency.xml
   [junit4]   2> 423508 T1811 oasc.CoreContainer.registerCore registering core: nodes_used_collection_shard2_replica2
   [junit4]   2> 423508 T1797 oascc.SolrZkClient.makePath makePath: /collections/nodes_used_collection/leader_elect/shard1/election
   [junit4]   2> 423508 T1811 oasc.ZkController.register Register replica - core:nodes_used_collection_shard2_replica2 address:http://127.0.0.1:59789 collection:nodes_used_collection shard:shard2
   [junit4]   2> 423509 T1811 oascsi.HttpClientUtil.createClient Creating new http client, config:maxConnections=10000&maxConnectionsPerHost=20&connTimeout=15000&socketTimeout=30000&retry=false
   [junit4]   2> 423511 T1772 oass.FileExchangeRateProvider.reload Reloading exchange rates from file currency.xml
   [junit4]   2> 423513 T1752 oass.IndexSchema.readSchema default search field in schema is text
   [junit4]   2> 423513 T1811 oascc.SolrZkClient.makePath makePath: /collections/nodes_used_collection/leader_elect/shard2/election
   [junit4]   2> 423514 T1797 oasc.ShardLeaderElectionContext.runLeaderProcess Running the leader process for shard shard1
   [junit4]   2> 423514 T1772 oass.OpenExchangeRatesOrgProvider.reload Reloading exchange rates from open-exchange-rates.json
   [junit4]   2> 423515 T1772 oass.OpenExchangeRatesOrgProvider$OpenExchangeRates.<init> WARN Unknown key IMPORTANT NOTE
   [junit4]   2> 423516 T1797 oasc.ShardLeaderElectionContext.waitForReplicasToComeUp Waiting until we see more replicas up for shard shard1: total=2 found=1 timeoutin=179999
   [junit4]   2> 423516 T1772 oass.OpenExchangeRatesOrgProvider$OpenExchangeRates.<init> WARN Expected key, got STRING
   [junit4]   2> 423516 T1752 oass.IndexSchema.readSchema unique key field: id
   [junit4]   2> 423516 T1772 oass.OpenExchangeRatesOrgProvider.reload Reloading exchange rates from open-exchange-rates.json
   [junit4]   2> 423518 T1772 oass.OpenExchangeRatesOrgProvider$OpenExchangeRates.<init> WARN Unknown key IMPORTANT NOTE
   [junit4]   2> 423518 T1772 oass.OpenExchangeRatesOrgProvider$OpenExchangeRates.<init> WARN Expected key, got STRING
   [junit4]   2> 423518 T1772 oasc.SolrCore.initDirectoryFactory org.apache.solr.core.MockDirectoryFactory
   [junit4]   2> 423519 T1811 oasc.ShardLeaderElectionContext.runLeaderProcess Running the leader process for shard shard2
   [junit4]   2> 423519 T1772 oasc.SolrCore.<init> [nodes_used_collection_shard1_replica2] Opening new SolrCore at /mnt/ssd/jenkins/workspace/Lucene-Solr-trunk-Linux/solr/build/solr-core/test/J1/./org.apache.solr.cloud.CollectionsAPIDistributedZkTest-jetty1-1375450387167/nodes_used_collection_shard1_replica2/, dataDir=/mnt/ssd/jenkins/workspace/Lucene-Solr-trunk-Linux/solr/build/solr-core/test/J1/./org.apache.solr.cloud.CollectionsAPIDistributedZkTest-jetty1-1375450387167//nodes_used_collection_shard1_replica2/data/
   [junit4]   2> 423519 T1772 oasc.JmxMonitoredMap.<init> JMX monitoring is enabled. Adding Solr mbeans to JMX Server: com.sun.jmx.mbeanserver.JmxMBeanServer@1ff1bd3
   [junit4]   2> 423520 T1772 oasc.CachingDirectoryFactory.get return new directory for /mnt/ssd/jenkins/workspace/Lucene-Solr-trunk-Linux/solr/build/solr-core/test/J1/./org.apache.solr.cloud.CollectionsAPIDistributedZkTest-jetty1-1375450387167//nodes_used_collection_shard1_replica2/data
   [junit4]   2> 423521 T1772 oasc.SolrCore.getNewIndexDir New index directory detected: old=null new=/mnt/ssd/jenkins/workspace/Lucene-Solr-trunk-Linux/solr/build/solr-core/test/J1/./org.apache.solr.cloud.CollectionsAPIDistributedZkTest-jetty1-1375450387167//nodes_used_collection_shard1_replica2/data/index/
   [junit4]   2> 423521 T1772 oasc.SolrCore.initIndex WARN [nodes_used_collection_shard1_replica2] Solr index directory '/mnt/ssd/jenkins/workspace/Lucene-Solr-trunk-Linux/solr/build/solr-core/test/J1/./org.apache.solr.cloud.CollectionsAPIDistributedZkTest-jetty1-1375450387167/nodes_used_collection_shard1_replica2/data/index' doesn't exist. Creating new index...
   [junit4]   2> 423521 T1811 oasc.ShardLeaderElectionContext.waitForReplicasToComeUp Waiting until we see more replicas up for shard shard2: total=2 found=1 timeoutin=180000
   [junit4]   2> 423521 T1772 oasc.CachingDirectoryFactory.get return new directory for /mnt/ssd/jenkins/workspace/Lucene-Solr-trunk-Linux/solr/build/solr-core/test/J1/./org.apache.solr.cloud.CollectionsAPIDistributedZkTest-jetty1-1375450387167//nodes_used_collection_shard1_replica2/data/index
   [junit4]   2> 423523 T1772 oasc.SolrDeletionPolicy.onCommit SolrDeletionPolicy.onCommit: commits: num=1
   [junit4]   2> commit{dir=MockDirWrapper(RateLimitedDirectoryWrapper(org.apache.lucene.store.RAMDirectory@c4256 lockFactory=org.apache.lucene.store.NativeFSLockFactory@13b485c)),segFN=segments_1,generation=1}
   [junit4]   2> 423524 T1772 oasc.SolrDeletionPolicy.updateCommits newest commit generation = 1
   [junit4]   2> 423527 T1772 oasup.UpdateRequestProcessorChain.init inserting DistributedUpdateProcessorFactory into updateRequestProcessorChain "dedupe"
   [junit4]   2> 423527 T1772 oasup.UpdateRequestProcessorChain.init inserting DistributedUpdateProcessorFactory into updateRequestProcessorChain "stored_sig"
   [junit4]   2> 423528 T1772 oasup.UpdateRequestProcessorChain.init inserting DistributedUpdateProcessorFactory into updateRequestProcessorChain "distrib-dup-test-chain-implicit"
   [junit4]   2> 423528 T1752 oass.FileExchangeRateProvider.reload Reloading exchange rates from file currency.xml
   [junit4]   2> 423528 T1772 oasc.RequestHandlers.initHandlersFromConfig created standard: solr.StandardRequestHandler
   [junit4]   2> 423529 T1772 oasc.RequestHandlers.initHandlersFromConfig created /get: solr.RealTimeGetHandler
   [junit4]   2> 423529 T1772 oasc.RequestHandlers.initHandlersFromConfig adding lazy requestHandler: solr.ReplicationHandler
   [junit4]   2> 423530 T1772 oasc.RequestHandlers.initHandlersFromConfig created /replication: solr.ReplicationHandler
   [junit4]   2> 423530 T1772 oasc.RequestHandlers.initHandlersFromConfig created /update: solr.UpdateRequestHandler
   [junit4]   2> 423531 T1772 oasc.RequestHandlers.initHandlersFromConfig created /admin/: org.apache.solr.handler.admin.AdminHandlers
   [junit4]   2> 423533 T1772 oashl.XMLLoader.init xsltCacheLifetimeSeconds=60
   [junit4]   2> 423535 T1752 oass.FileExchangeRateProvider.reload Reloading exchange rates from file currency.xml
   [junit4]   2> 423536 T1772 oass.SolrIndexSearcher.<init> Opening Searcher@1b83e58 main
   [junit4]   2> 423537 T1772 oasu.CommitTracker.<init> Hard AutoCommit: disabled
   [junit4]   2> 423537 T1772 oasu.CommitTracker.<init> Soft AutoCommit: disabled
   [junit4]   2> 423539 T1752 oass.OpenExchangeRatesOrgProvider.reload Reloading exchange rates from open-exchange-rates.json
   [junit4]   2> 423541 T1752 oass.OpenExchangeRatesOrgProvider$OpenExchangeRates.<init> WARN Unknown key IMPORTANT NOTE
   [junit4]   2> 423541 T1752 oass.OpenExchangeRatesOrgProvider$OpenExchangeRates.<init> WARN Expected key, got STRING
   [junit4]   2> 423541 T1826 oasc.SolrCore.registerSearcher [nodes_used_collection_shard1_replica2] Registered new searcher Searcher@1b83e58 main{StandardDirectoryReader(segments_1:1)}
   [junit4]   2> 423542 T1772 oasc.CoreContainer.registerCore registering core: nodes_used_collection_shard1_replica2
   [junit4]   2> 423542 T1772 oasc.ZkController.register Register replica - core:nodes_used_collection_shard1_replica2 address:http://127.0.0.1:54974 collection:nodes_used_collection shard:shard1
   [junit4]   2> 423541 T1752 oass.OpenExchangeRatesOrgProvider.reload Reloading exchange rates from open-exchange-rates.json
   [junit4]   2> 423542 T1772 oascsi.HttpClientUtil.createClient Creating new http client, config:maxConnections=10000&maxConnectionsPerHost=20&connTimeout=15000&socketTimeout=30000&retry=false
   [junit4]   2> 423543 T1752 oass.OpenExchangeRatesOrgProvider$OpenExchangeRates.<init> WARN Unknown key IMPORTANT NOTE
   [junit4]   2> 423544 T1752 oass.OpenExchangeRatesOrgProvider$OpenExchangeRates.<init> WARN Expected key, got STRING
   [junit4]   2> 423544 T1752 oasc.SolrCore.initDirectoryFactory org.apache.solr.core.MockDirectoryFactory
   [junit4]   2> 423545 T1752 oasc.SolrCore.<init> [nodes_used_collection_shard2_replica1] Opening new SolrCore at /mnt/ssd/jenkins/workspace/Lucene-Solr-trunk-Linux/solr/build/solr-core/test/J1/./org.apache.solr.cloud.CollectionsAPIDistributedZkTest-controljetty-1375450386975/nodes_used_collection_shard2_replica1/, dataDir=/mnt/ssd/jenkins/workspace/Lucene-Solr-trunk-Linux/solr/build/solr-core/test/J1/./org.apache.solr.cloud.CollectionsAPIDistributedZkTest-controljetty-1375450386975//nodes_used_collection_shard2_replica1/data/
   [junit4]   2> 423545 T1752 oasc.JmxMonitoredMap.<init> JMX monitoring is enabled. Adding Solr mbeans to JMX Server: com.sun.jmx.mbeanserver.JmxMBeanServer@1ff1bd3
   [junit4]   2> 423546 T1752 oasc.CachingDirectoryFactory.get return new directory for /mnt/ssd/jenkins/workspace/Lucene-Solr-trunk-Linux/solr/build/solr-core/test/J1/./org.apache.solr.cloud.CollectionsAPIDistributedZkTest-controljetty-1375450386975//nodes_used_collection_shard2_replica1/data
   [junit4]   2> 423546 T1752 oasc.SolrCore.getNewIndexDir New index directory detected: old=null new=/mnt/ssd/jenkins/workspace/Lucene-Solr-trunk-Linux/solr/build/solr-core/test/J1/./org.apache.solr.cloud.CollectionsAPIDistributedZkTest-controljetty-1375450386975//nodes_used_collection_shard2_replica1/data/index/
   [junit4]   2> 423547 T1752 oasc.SolrCore.initIndex WARN [nodes_used_collection_shard2_replica1] Solr index directory '/mnt/ssd/jenkins/workspace/Lucene-Solr-trunk-Linux/solr/build/solr-core/test/J1/./org.apache.solr.cloud.CollectionsAPIDistributedZkTest-controljetty-1375450386975/nodes_used_collection_shard2_replica1/data/index' doesn't exist. Creating new index...
   [junit4]   2> 423548 T1752 oasc.CachingDirectoryFactory.get return new directory for /mnt/ssd/jenkins/workspace/Lucene-Solr-trunk-Linux/solr/build/solr-core/test/J1/./org.apache.solr.cloud.CollectionsAPIDistributedZkTest-controljetty-1375450386975//nodes_used_collection_shard2_replica1/data/index
   [junit4]   2> 423550 T1752 oasc.SolrDeletionPolicy.onCommit SolrDeletionPolicy.onCommit: commits: num=1
   [junit4]   2> commit{dir=MockDirWrapper(RateLimitedDirectoryWrapper(org.apache.lucene.store.RAMDirectory@195df39 lockFactory=org.apache.lucene.store.NativeFSLockFactory@c3a7e6)),segFN=segments_1,generation=1}
   [junit4]   2> 423550 T1752 oasc.SolrDeletionPolicy.updateCommits newest commit generation = 1
   [junit4]   2> 423555 T1752 oasup.UpdateRequestProcessorChain.init inserting DistributedUpdateProcessorFactory into updateRequestProcessorChain "dedupe"
   [junit4]   2> 423556 T1752 oasup.UpdateRequestProcessorChain.init inserting DistributedUpdateProcessorFactory into updateRequestProcessorChain "stored_sig"
   [junit4]   2> 423557 T1752 oasup.UpdateRequestProcessorChain.init inserting DistributedUpdateProcessorFactory into updateRequestProcessorChain "distrib-dup-test-chain-implicit"
   [junit4]   2> 423557 T1752 oasc.RequestHandlers.initHandlersFromConfig created standard: solr.StandardRequestHandler
   [junit4]   2> 423558 T1752 oasc.RequestHandlers.initHandlersFromConfig created /get: solr.RealTimeGetHandler
   [junit4]   2> 423558 T1752 oasc.RequestHandlers.initHandlersFromConfig adding lazy requestHandler: solr.ReplicationHandler
   [junit4]   2> 423559 T1752 oasc.RequestHandlers.initHandlersFromConfig created /replication: solr.ReplicationHandler
   [junit4]   2> 423559 T1752 oasc.RequestHandlers.initHandlersFromConfig created /update: solr.UpdateRequestHandler
   [junit4]   2> 423560 T1752 oasc.RequestHandlers.initHandlersFromConfig created /admin/: org.apache.solr.handler.admin.AdminHandlers
   [junit4]   2> 423564 T1752 oashl.XMLLoader.init xsltCacheLifetimeSeconds=60
   [junit4]   2> 423568 T1752 oass.SolrIndexSearcher.<init> Opening Searcher@9abfcf main
   [junit4]   2> 423569 T1752 oasu.CommitTracker.<init> Hard AutoCommit: disabled
   [junit4]   2> 423569 T1752 oasu.CommitTracker.<init> Soft AutoCommit: disabled
   [junit4]   2> 423574 T1827 oasc.SolrCore.registerSearcher [nodes_used_collection_shard2_replica1] Registered new searcher Searcher@9abfcf main{StandardDirectoryReader(segments_1:1)}
   [junit4]   2> 423577 T1752 oasc.CoreContainer.registerCore registering core: nodes_used_collection_shard2_replica1
   [junit4]   2> 423577 T1752 oasc.ZkController.register Register replica - core:nodes_used_collection_shard2_replica1 address:http://127.0.0.1:39942 collection:nodes_used_collection shard:shard2
   [junit4]   2> 423577 T1752 oascsi.HttpClientUtil.createClient Creating new http client, config:maxConnections=10000&maxConnectionsPerHost=20&connTimeout=15000&socketTimeout=30000&retry=false
   [junit4]   2> 423819 T1759 oascc.ZkStateReader.updateClusterState Updating cloud state from ZooKeeper...
   [junit4]   2> 423828 T1818 oascc.ZkStateReader$2.process A cluster state change: WatchedEvent state:SyncConnected type:NodeDataChanged path:/clusterstate.json, has occurred - updating... (live nodes size: 5)
   [junit4]   2> 423829 T1790 oascc.ZkStateReader$2.process A cluster state change: WatchedEvent state:SyncConnected type:NodeDataChanged path:/clusterstate.json, has occurred - updating... (live nodes size: 5)
   [junit4]   2> 423829 T1776 oascc.ZkStateReader$2.process A cluster state change: WatchedEvent state:SyncConnected type:NodeDataChanged path:/clusterstate.json, has occurred - updating... (live nodes size: 5)
   [junit4]   2> 423829 T1758 oascc.ZkStateReader$2.process A cluster state change: WatchedEvent state:SyncConnected type:NodeDataChanged path:/clusterstate.json, has occurred - updating... (live nodes size: 5)
   [junit4]   2> 423828 T1804 oascc.ZkStateReader$2.process A cluster state change: WatchedEvent state:SyncConnected type:NodeDataChanged path:/clusterstate.json, has occurred - updating... (live nodes size: 5)
   [junit4]   2> 423829 T1763 oascc.ZkStateReader$2.process A cluster state change: WatchedEvent state:SyncConnected type:NodeDataChanged path:/clusterstate.json, has occurred - updating... (live nodes size: 5)
   [junit4]   2> 424017 T1797 oasc.ShardLeaderElectionContext.waitForReplicasToComeUp Enough replicas found to continue.
   [junit4]   2> 424018 T1797 oasc.ShardLeaderElectionContext.runLeaderProcess I may be the new leader - try and sync
   [junit4]   2> 424018 T1797 oasc.SyncStrategy.sync Sync replicas to http://127.0.0.1:46847/nodes_used_collection_shard1_replica1/
   [junit4]   2> 424019 T1797 oasu.PeerSync.sync PeerSync: core=nodes_used_collection_shard1_replica1 url=http://127.0.0.1:46847 START replicas=[http://127.0.0.1:54974/nodes_used_collection_shard1_replica2/] nUpdates=100
   [junit4]   2> 424020 T1797 oasu.PeerSync.sync PeerSync: core=nodes_used_collection_shard1_replica1 url=http://127.0.0.1:46847 DONE.  We have no versions.  sync failed.
   [junit4]   2> 424021 T1797 oasc.SyncStrategy.syncReplicas Leader's attempt to sync with shard failed, moving to the next candidate
   [junit4]   2> 424021 T1797 oasc.ShardLeaderElectionContext.runLeaderProcess We failed sync, but we have no versions - we can't sync in that case - we were active before, so become leader anyway
   [junit4]   2> 424021 T1797 oasc.ShardLeaderElectionContext.runLeaderProcess I am the new leader: http://127.0.0.1:46847/nodes_used_collection_shard1_replica1/ shard1
   [junit4]   2> 424022 T1797 oascc.SolrZkClient.makePath makePath: /collections/nodes_used_collection/leaders/shard1
   [junit4]   2> 424023 T1811 oasc.ShardLeaderElectionContext.waitForReplicasToComeUp Enough replicas found to continue.
   [junit4]   2> 424023 T1811 oasc.ShardLeaderElectionContext.runLeaderProcess I may be the new leader - try and sync
   [junit4]   2> 424024 T1811 oasc.SyncStrategy.sync Sync replicas to http://127.0.0.1:59789/nodes_used_collection_shard2_replica2/
   [junit4]   2> 424024 T1811 oasu.PeerSync.sync PeerSync: core=nodes_used_collection_shard2_replica2 url=http://127.0.0.1:59789 START replicas=[http://127.0.0.1:39942/nodes_used_collection_shard2_replica1/] nUpdates=100
   [junit4]   2> 424025 T1811 oasu.PeerSync.sync PeerSync: core=nodes_used_collection_shard2_replica2 url=http://127.0.0.1:59789 DONE.  We have no versions.  sync failed.
   [junit4]   2> 424026 T1811 oasc.SyncStrategy.syncReplicas Leader's attempt to sync with shard failed, moving to the next candidate
   [junit4]   2> 424026 T1811 oasc.ShardLeaderElectionContext.runLeaderProcess We failed sync, but we have no versions - we can't sync in that case - we were active before, so become leader anyway
   [junit4]   2> 424027 T1811 oasc.ShardLeaderElectionContext.runLeaderProcess I am the new leader: http://127.0.0.1:59789/nodes_used_collection_shard2_replica2/ shard2
   [junit4]   2> 424027 T1811 oascc.SolrZkClient.makePath makePath: /collections/nodes_used_collection/le

[...truncated too long message...]

nit4]   2> 515266 T1818 oascc.ZkStateReader$2.process WARN ZooKeeper watch triggered, but Solr cannot talk to ZK
   [junit4]   2> 515266 T1818 oascc.ZkStateReader$3.process WARN ZooKeeper watch triggered, but Solr cannot talk to ZK
   [junit4]   2> 515267 T1818 oasc.LeaderElector$1.process WARN  org.apache.zookeeper.KeeperException$SessionExpiredException: KeeperErrorCode = Session expired for /collections/new_implicit_coll_1/leader_elect/c/election
   [junit4]   2> at org.apache.zookeeper.KeeperException.create(KeeperException.java:127)
   [junit4]   2> at org.apache.zookeeper.KeeperException.create(KeeperException.java:51)
   [junit4]   2> at org.apache.zookeeper.ZooKeeper.getChildren(ZooKeeper.java:1468)
   [junit4]   2> at org.apache.solr.common.cloud.SolrZkClient$6.execute(SolrZkClient.java:235)
   [junit4]   2> at org.apache.solr.common.cloud.SolrZkClient$6.execute(SolrZkClient.java:232)
   [junit4]   2> at org.apache.solr.common.cloud.ZkCmdExecutor.retryOperation(ZkCmdExecutor.java:65)
   [junit4]   2> at org.apache.solr.common.cloud.SolrZkClient.getChildren(SolrZkClient.java:232)
   [junit4]   2> at org.apache.solr.cloud.LeaderElector.checkIfIamLeader(LeaderElector.java:84)
   [junit4]   2> at org.apache.solr.cloud.LeaderElector.access$000(LeaderElector.java:55)
   [junit4]   2> at org.apache.solr.cloud.LeaderElector$1.process(LeaderElector.java:129)
   [junit4]   2> at org.apache.zookeeper.ClientCnxn$EventThread.processEvent(ClientCnxn.java:519)
   [junit4]   2> at org.apache.zookeeper.ClientCnxn$EventThread.run(ClientCnxn.java:495)
   [junit4]   2>
   [junit4]   2> 515267 T1818 oasc.LeaderElector$1.process WARN  org.apache.zookeeper.KeeperException$SessionExpiredException: KeeperErrorCode = Session expired for /collections/new_implicit_coll_0/leader_elect/b/election
   [junit4]   2> at org.apache.zookeeper.KeeperException.create(KeeperException.java:127)
   [junit4]   2> at org.apache.zookeeper.KeeperException.create(KeeperException.java:51)
   [junit4]   2> at org.apache.zookeeper.ZooKeeper.getChildren(ZooKeeper.java:1468)
   [junit4]   2> at org.apache.solr.common.cloud.SolrZkClient$6.execute(SolrZkClient.java:235)
   [junit4]   2> at org.apache.solr.common.cloud.SolrZkClient$6.execute(SolrZkClient.java:232)
   [junit4]   2> at org.apache.solr.common.cloud.ZkCmdExecutor.retryOperation(ZkCmdExecutor.java:65)
   [junit4]   2> at org.apache.solr.common.cloud.SolrZkClient.getChildren(SolrZkClient.java:232)
   [junit4]   2> at org.apache.solr.cloud.LeaderElector.checkIfIamLeader(LeaderElector.java:84)
   [junit4]   2> at org.apache.solr.cloud.LeaderElector.access$000(LeaderElector.java:55)
   [junit4]   2> at org.apache.solr.cloud.LeaderElector$1.process(LeaderElector.java:129)
   [junit4]   2> at org.apache.zookeeper.ClientCnxn$EventThread.processEvent(ClientCnxn.java:519)
   [junit4]   2> at org.apache.zookeeper.ClientCnxn$EventThread.run(ClientCnxn.java:495)
   [junit4]   2>
   [junit4]   2> 515287 T1736 oejsh.ContextHandler.doStop stopped o.e.j.s.ServletContextHandler{/,null}
   [junit4]   2> 515342 T1736 oas.SolrTestCaseJ4.tearDown ###Ending testDistribSearch
   [junit4]   2> 515345 T1736 oasc.ZkTestServer.send4LetterWord connecting to 127.0.0.1:37013 37013
   [junit4]   1> client port:0.0.0.0/0.0.0.0:0
   [junit4]   2> NOTE: reproduce with: ant test  -Dtestcase=CollectionsAPIDistributedZkTest -Dtests.method=testDistribSearch -Dtests.seed=337B722C0CE7B0A3 -Dtests.multiplier=3 -Dtests.slow=true -Dtests.locale=th -Dtests.timezone=ECT -Dtests.file.encoding=ISO-8859-1
   [junit4] ERROR    101s J1 | CollectionsAPIDistributedZkTest.testDistribSearch <<<
   [junit4]    > Throwable #1: org.apache.solr.client.solrj.SolrServerException: Server refused connection at: http://127.0.0.1:54974
   [junit4]    > at __randomizedtesting.SeedInfo.seed([337B722C0CE7B0A3:B29DFC347BB8D09F]:0)
   [junit4]    > at org.apache.solr.client.solrj.impl.HttpSolrServer.request(HttpSolrServer.java:428)
   [junit4]    > at org.apache.solr.client.solrj.impl.HttpSolrServer.request(HttpSolrServer.java:180)
   [junit4]    > at org.apache.solr.cloud.CollectionsAPIDistributedZkTest.testCustomCollectionsAPI(CollectionsAPIDistributedZkTest.java:764)
   [junit4]    > at org.apache.solr.cloud.CollectionsAPIDistributedZkTest.doTest(CollectionsAPIDistributedZkTest.java:159)
   [junit4]    > at org.apache.solr.BaseDistributedSearchTestCase.testDistribSearch(BaseDistributedSearchTestCase.java:835)
   [junit4]    > at java.lang.Thread.run(Thread.java:724)
   [junit4]    > Caused by: org.apache.http.conn.HttpHostConnectException: Connection to http://127.0.0.1:54974 refused
   [junit4]    > at org.apache.http.impl.conn.DefaultClientConnectionOperator.openConnection(DefaultClientConnectionOperator.java:190)
   [junit4]    > at org.apache.http.impl.conn.ManagedClientConnectionImpl.open(ManagedClientConnectionImpl.java:294)
   [junit4]    > at org.apache.http.impl.client.DefaultRequestDirector.tryConnect(DefaultRequestDirector.java:645)
   [junit4]    > at org.apache.http.impl.client.DefaultRequestDirector.execute(DefaultRequestDirector.java:480)
   [junit4]    > at org.apache.http.impl.client.AbstractHttpClient.execute(AbstractHttpClient.java:906)
   [junit4]    > at org.apache.http.impl.client.AbstractHttpClient.execute(AbstractHttpClient.java:805)
   [junit4]    > at org.apache.http.impl.client.AbstractHttpClient.execute(AbstractHttpClient.java:784)
   [junit4]    > at org.apache.solr.client.solrj.impl.HttpSolrServer.request(HttpSolrServer.java:365)
   [junit4]    > ... 44 more
   [junit4]    > Caused by: java.net.ConnectException: Connection refused
   [junit4]    > at java.net.PlainSocketImpl.socketConnect(Native Method)
   [junit4]    > at java.net.AbstractPlainSocketImpl.doConnect(AbstractPlainSocketImpl.java:339)
   [junit4]    > at java.net.AbstractPlainSocketImpl.connectToAddress(AbstractPlainSocketImpl.java:200)
   [junit4]    > at java.net.AbstractPlainSocketImpl.connect(AbstractPlainSocketImpl.java:182)
   [junit4]    > at java.net.SocksSocketImpl.connect(SocksSocketImpl.java:392)
   [junit4]    > at java.net.Socket.connect(Socket.java:579)
   [junit4]    > at org.apache.http.conn.scheme.PlainSocketFactory.connectSocket(PlainSocketFactory.java:127)
   [junit4]    > at org.apache.http.impl.conn.DefaultClientConnectionOperator.openConnection(DefaultClientConnectionOperator.java:180)
   [junit4]    > ... 51 more
   [junit4]   2> 515370 T1736 oas.SolrTestCaseJ4.deleteCore ###deleteCore
   [junit4]   2> 101024 T1735 ccr.ThreadLeakControl.checkThreadLeaks WARNING Will linger awaiting termination of 1 leaked thread(s).
   [junit4]   2> NOTE: test params are: codec=Lucene42: {_route_=PostingsFormat(name=TestBloomFilteredLucene41Postings), range_facet_l=PostingsFormat(name=Asserting), text=PostingsFormat(name=TestBloomFilteredLucene41Postings), _version_=Lucene41(blocksize=128), intDefault=Lucene41(blocksize=128), id=PostingsFormat(name=SimpleText), timestamp=PostingsFormat(name=Asserting), a_t=PostingsFormat(name=Asserting), range_facet_sl=PostingsFormat(name=SimpleText), range_facet_si=PostingsFormat(name=Asserting), other_tl1=Lucene41(blocksize=128), multiDefault=PostingsFormat(name=Asserting), a_si=Lucene41(blocksize=128)}, docValues:{timestamp=DocValuesFormat(name=Disk)}, sim=RandomSimilarityProvider(queryNorm=false,coord=no): {}, locale=th, timezone=ECT
   [junit4]   2> NOTE: Linux 3.2.0-51-generic i386/Oracle Corporation 1.7.0_25 (32-bit)/cpus=8,threads=12,free=56238368,total=258670592
   [junit4]   2> NOTE: All tests run in this JVM: [TestRangeQuery, TestWordDelimiterFilterFactory, TestSchemaResource, ShardRoutingCustomTest, ZkNodePropsTest, StandardRequestHandlerTest, TestDFRSimilarityFactory, TestDistributedSearch, TestRecovery, TestAddFieldRealTimeGet, IndexSchemaRuntimeFieldTest, TestCloudManagedSchema, TestDefaultSimilarityFactory, URLClassifyProcessorTest, TestBinaryField, SpellCheckCollatorTest, DeleteShardTest, SolrCoreCheckLockOnStartupTest, HdfsBasicDistributedZk2Test, TestIndexSearcher, TestUpdate, NoCacheHeaderTest, IndexReaderFactoryTest, TestUniqueKeyFieldResource, HardAutoCommitTest, OpenExchangeRatesOrgProviderTest, OpenCloseCoreStressTest, TestJmxIntegration, ChaosMonkeySafeLeaderTest, ConvertedLegacyTest, CurrencyFieldOpenExchangeTest, HighlighterConfigTest, SolrCmdDistributorTest, TestMergePolicyConfig, TestStressReorder, TestBM25SimilarityFactory, TermVectorComponentDistributedTest, DisMaxRequestHandlerTest, TestSolrJ, XsltUpdateRequestHandlerTest, HdfsSyncSliceTest, DocValuesMultiTest, TestReloadAndDeleteDocs, TestFoldingMultitermQuery, TestOmitPositions, CollectionsAPIDistributedZkTest]
   [junit4] Completed on J1 in 101.30s, 1 test, 1 error <<< FAILURES!

[...truncated 757 lines...]
BUILD FAILED
/mnt/ssd/jenkins/workspace/Lucene-Solr-trunk-Linux/build.xml:389: The following error occurred while executing this line:
/mnt/ssd/jenkins/workspace/Lucene-Solr-trunk-Linux/build.xml:369: The following error occurred while executing this line:
/mnt/ssd/jenkins/workspace/Lucene-Solr-trunk-Linux/build.xml:39: The following error occurred while executing this line:
/mnt/ssd/jenkins/workspace/Lucene-Solr-trunk-Linux/solr/build.xml:181: The following error occurred while executing this line:
/mnt/ssd/jenkins/workspace/Lucene-Solr-trunk-Linux/solr/common-build.xml:449: The following error occurred while executing this line:
/mnt/ssd/jenkins/workspace/Lucene-Solr-trunk-Linux/lucene/common-build.xml:1230: The following error occurred while executing this line:
/mnt/ssd/jenkins/workspace/Lucene-Solr-trunk-Linux/lucene/common-build.xml:873: There were test failures: 320 suites, 1347 tests, 1 error, 34 ignored (6 assumptions)

Total time: 39 minutes 55 seconds
Build step 'Invoke Ant' marked build as failure
Description set: Java: 32bit/jdk1.7.0_25 -client -XX:+UseParallelGC
Archiving artifacts
Recording test results
Email was triggered for: Failure
Sending email for trigger: Failure




---------------------------------------------------------------------
To unsubscribe, e-mail: [hidden email]
For additional commands, e-mail: [hidden email]