[JENKINS] Lucene-Solr-trunk-Linux (64bit/jdk1.8.0_66) - Build # 14869 - Failure!

classic Classic list List threaded Threaded
1 message Options
Reply | Threaded
Open this post in threaded view
|

[JENKINS] Lucene-Solr-trunk-Linux (64bit/jdk1.8.0_66) - Build # 14869 - Failure!

Policeman Jenkins Server-2
Build: http://jenkins.thetaphi.de/job/Lucene-Solr-trunk-Linux/14869/
Java: 64bit/jdk1.8.0_66 -XX:-UseCompressedOops -XX:+UseParallelGC

3 tests failed.
FAILED:  junit.framework.TestSuite.org.apache.solr.cloud.CollectionsAPIDistributedZkTest

Error Message:
5 threads leaked from SUITE scope at org.apache.solr.cloud.CollectionsAPIDistributedZkTest:     1) Thread[id=933, name=zkCallback-36-thread-3, state=TIMED_WAITING, group=TGRP-CollectionsAPIDistributedZkTest]         at sun.misc.Unsafe.park(Native Method)         at java.util.concurrent.locks.LockSupport.parkNanos(LockSupport.java:215)         at java.util.concurrent.SynchronousQueue$TransferStack.awaitFulfill(SynchronousQueue.java:460)         at java.util.concurrent.SynchronousQueue$TransferStack.transfer(SynchronousQueue.java:362)         at java.util.concurrent.SynchronousQueue.poll(SynchronousQueue.java:941)         at java.util.concurrent.ThreadPoolExecutor.getTask(ThreadPoolExecutor.java:1066)         at java.util.concurrent.ThreadPoolExecutor.runWorker(ThreadPoolExecutor.java:1127)         at java.util.concurrent.ThreadPoolExecutor$Worker.run(ThreadPoolExecutor.java:617)         at java.lang.Thread.run(Thread.java:745)    2) Thread[id=258, name=zkCallback-36-thread-1, state=TIMED_WAITING, group=TGRP-CollectionsAPIDistributedZkTest]         at sun.misc.Unsafe.park(Native Method)         at java.util.concurrent.locks.LockSupport.parkNanos(LockSupport.java:215)         at java.util.concurrent.SynchronousQueue$TransferStack.awaitFulfill(SynchronousQueue.java:460)         at java.util.concurrent.SynchronousQueue$TransferStack.transfer(SynchronousQueue.java:362)         at java.util.concurrent.SynchronousQueue.poll(SynchronousQueue.java:941)         at java.util.concurrent.ThreadPoolExecutor.getTask(ThreadPoolExecutor.java:1066)         at java.util.concurrent.ThreadPoolExecutor.runWorker(ThreadPoolExecutor.java:1127)         at java.util.concurrent.ThreadPoolExecutor$Worker.run(ThreadPoolExecutor.java:617)         at java.lang.Thread.run(Thread.java:745)    3) Thread[id=256, name=TEST-CollectionsAPIDistributedZkTest.test-seed#[5C9BBE9138FC6616]-SendThread(127.0.0.1:48848), state=TIMED_WAITING, group=TGRP-CollectionsAPIDistributedZkTest]         at java.lang.Thread.sleep(Native Method)         at org.apache.zookeeper.ClientCnxn$SendThread.run(ClientCnxn.java:994)    4) Thread[id=257, name=TEST-CollectionsAPIDistributedZkTest.test-seed#[5C9BBE9138FC6616]-EventThread, state=WAITING, group=TGRP-CollectionsAPIDistributedZkTest]         at sun.misc.Unsafe.park(Native Method)         at java.util.concurrent.locks.LockSupport.park(LockSupport.java:175)         at java.util.concurrent.locks.AbstractQueuedSynchronizer$ConditionObject.await(AbstractQueuedSynchronizer.java:2039)         at java.util.concurrent.LinkedBlockingQueue.take(LinkedBlockingQueue.java:442)         at org.apache.zookeeper.ClientCnxn$EventThread.run(ClientCnxn.java:494)    5) Thread[id=932, name=zkCallback-36-thread-2, state=TIMED_WAITING, group=TGRP-CollectionsAPIDistributedZkTest]         at sun.misc.Unsafe.park(Native Method)         at java.util.concurrent.locks.LockSupport.parkNanos(LockSupport.java:215)         at java.util.concurrent.SynchronousQueue$TransferStack.awaitFulfill(SynchronousQueue.java:460)         at java.util.concurrent.SynchronousQueue$TransferStack.transfer(SynchronousQueue.java:362)         at java.util.concurrent.SynchronousQueue.poll(SynchronousQueue.java:941)         at java.util.concurrent.ThreadPoolExecutor.getTask(ThreadPoolExecutor.java:1066)         at java.util.concurrent.ThreadPoolExecutor.runWorker(ThreadPoolExecutor.java:1127)         at java.util.concurrent.ThreadPoolExecutor$Worker.run(ThreadPoolExecutor.java:617)         at java.lang.Thread.run(Thread.java:745)

Stack Trace:
com.carrotsearch.randomizedtesting.ThreadLeakError: 5 threads leaked from SUITE scope at org.apache.solr.cloud.CollectionsAPIDistributedZkTest:
   1) Thread[id=933, name=zkCallback-36-thread-3, state=TIMED_WAITING, group=TGRP-CollectionsAPIDistributedZkTest]
        at sun.misc.Unsafe.park(Native Method)
        at java.util.concurrent.locks.LockSupport.parkNanos(LockSupport.java:215)
        at java.util.concurrent.SynchronousQueue$TransferStack.awaitFulfill(SynchronousQueue.java:460)
        at java.util.concurrent.SynchronousQueue$TransferStack.transfer(SynchronousQueue.java:362)
        at java.util.concurrent.SynchronousQueue.poll(SynchronousQueue.java:941)
        at java.util.concurrent.ThreadPoolExecutor.getTask(ThreadPoolExecutor.java:1066)
        at java.util.concurrent.ThreadPoolExecutor.runWorker(ThreadPoolExecutor.java:1127)
        at java.util.concurrent.ThreadPoolExecutor$Worker.run(ThreadPoolExecutor.java:617)
        at java.lang.Thread.run(Thread.java:745)
   2) Thread[id=258, name=zkCallback-36-thread-1, state=TIMED_WAITING, group=TGRP-CollectionsAPIDistributedZkTest]
        at sun.misc.Unsafe.park(Native Method)
        at java.util.concurrent.locks.LockSupport.parkNanos(LockSupport.java:215)
        at java.util.concurrent.SynchronousQueue$TransferStack.awaitFulfill(SynchronousQueue.java:460)
        at java.util.concurrent.SynchronousQueue$TransferStack.transfer(SynchronousQueue.java:362)
        at java.util.concurrent.SynchronousQueue.poll(SynchronousQueue.java:941)
        at java.util.concurrent.ThreadPoolExecutor.getTask(ThreadPoolExecutor.java:1066)
        at java.util.concurrent.ThreadPoolExecutor.runWorker(ThreadPoolExecutor.java:1127)
        at java.util.concurrent.ThreadPoolExecutor$Worker.run(ThreadPoolExecutor.java:617)
        at java.lang.Thread.run(Thread.java:745)
   3) Thread[id=256, name=TEST-CollectionsAPIDistributedZkTest.test-seed#[5C9BBE9138FC6616]-SendThread(127.0.0.1:48848), state=TIMED_WAITING, group=TGRP-CollectionsAPIDistributedZkTest]
        at java.lang.Thread.sleep(Native Method)
        at org.apache.zookeeper.ClientCnxn$SendThread.run(ClientCnxn.java:994)
   4) Thread[id=257, name=TEST-CollectionsAPIDistributedZkTest.test-seed#[5C9BBE9138FC6616]-EventThread, state=WAITING, group=TGRP-CollectionsAPIDistributedZkTest]
        at sun.misc.Unsafe.park(Native Method)
        at java.util.concurrent.locks.LockSupport.park(LockSupport.java:175)
        at java.util.concurrent.locks.AbstractQueuedSynchronizer$ConditionObject.await(AbstractQueuedSynchronizer.java:2039)
        at java.util.concurrent.LinkedBlockingQueue.take(LinkedBlockingQueue.java:442)
        at org.apache.zookeeper.ClientCnxn$EventThread.run(ClientCnxn.java:494)
   5) Thread[id=932, name=zkCallback-36-thread-2, state=TIMED_WAITING, group=TGRP-CollectionsAPIDistributedZkTest]
        at sun.misc.Unsafe.park(Native Method)
        at java.util.concurrent.locks.LockSupport.parkNanos(LockSupport.java:215)
        at java.util.concurrent.SynchronousQueue$TransferStack.awaitFulfill(SynchronousQueue.java:460)
        at java.util.concurrent.SynchronousQueue$TransferStack.transfer(SynchronousQueue.java:362)
        at java.util.concurrent.SynchronousQueue.poll(SynchronousQueue.java:941)
        at java.util.concurrent.ThreadPoolExecutor.getTask(ThreadPoolExecutor.java:1066)
        at java.util.concurrent.ThreadPoolExecutor.runWorker(ThreadPoolExecutor.java:1127)
        at java.util.concurrent.ThreadPoolExecutor$Worker.run(ThreadPoolExecutor.java:617)
        at java.lang.Thread.run(Thread.java:745)
        at __randomizedtesting.SeedInfo.seed([5C9BBE9138FC6616]:0)


FAILED:  junit.framework.TestSuite.org.apache.solr.cloud.CollectionsAPIDistributedZkTest

Error Message:
There are still zombie threads that couldn't be terminated:    1) Thread[id=933, name=zkCallback-36-thread-3, state=TIMED_WAITING, group=TGRP-CollectionsAPIDistributedZkTest]         at sun.misc.Unsafe.park(Native Method)         at java.util.concurrent.locks.LockSupport.parkNanos(LockSupport.java:215)         at java.util.concurrent.SynchronousQueue$TransferStack.awaitFulfill(SynchronousQueue.java:460)         at java.util.concurrent.SynchronousQueue$TransferStack.transfer(SynchronousQueue.java:362)         at java.util.concurrent.SynchronousQueue.poll(SynchronousQueue.java:941)         at java.util.concurrent.ThreadPoolExecutor.getTask(ThreadPoolExecutor.java:1066)         at java.util.concurrent.ThreadPoolExecutor.runWorker(ThreadPoolExecutor.java:1127)         at java.util.concurrent.ThreadPoolExecutor$Worker.run(ThreadPoolExecutor.java:617)         at java.lang.Thread.run(Thread.java:745)    2) Thread[id=258, name=zkCallback-36-thread-1, state=TIMED_WAITING, group=TGRP-CollectionsAPIDistributedZkTest]         at sun.misc.Unsafe.park(Native Method)         at java.util.concurrent.locks.LockSupport.parkNanos(LockSupport.java:215)         at java.util.concurrent.SynchronousQueue$TransferStack.awaitFulfill(SynchronousQueue.java:460)         at java.util.concurrent.SynchronousQueue$TransferStack.transfer(SynchronousQueue.java:362)         at java.util.concurrent.SynchronousQueue.poll(SynchronousQueue.java:941)         at java.util.concurrent.ThreadPoolExecutor.getTask(ThreadPoolExecutor.java:1066)         at java.util.concurrent.ThreadPoolExecutor.runWorker(ThreadPoolExecutor.java:1127)         at java.util.concurrent.ThreadPoolExecutor$Worker.run(ThreadPoolExecutor.java:617)         at java.lang.Thread.run(Thread.java:745)    3) Thread[id=256, name=TEST-CollectionsAPIDistributedZkTest.test-seed#[5C9BBE9138FC6616]-SendThread(127.0.0.1:48848), state=TIMED_WAITING, group=TGRP-CollectionsAPIDistributedZkTest]         at java.lang.Thread.sleep(Native Method)         at org.apache.zookeeper.ClientCnxn$SendThread.run(ClientCnxn.java:994)    4) Thread[id=932, name=zkCallback-36-thread-2, state=TIMED_WAITING, group=TGRP-CollectionsAPIDistributedZkTest]         at sun.misc.Unsafe.park(Native Method)         at java.util.concurrent.locks.LockSupport.parkNanos(LockSupport.java:215)         at java.util.concurrent.SynchronousQueue$TransferStack.awaitFulfill(SynchronousQueue.java:460)         at java.util.concurrent.SynchronousQueue$TransferStack.transfer(SynchronousQueue.java:362)         at java.util.concurrent.SynchronousQueue.poll(SynchronousQueue.java:941)         at java.util.concurrent.ThreadPoolExecutor.getTask(ThreadPoolExecutor.java:1066)         at java.util.concurrent.ThreadPoolExecutor.runWorker(ThreadPoolExecutor.java:1127)         at java.util.concurrent.ThreadPoolExecutor$Worker.run(ThreadPoolExecutor.java:617)         at java.lang.Thread.run(Thread.java:745)

Stack Trace:
com.carrotsearch.randomizedtesting.ThreadLeakError: There are still zombie threads that couldn't be terminated:
   1) Thread[id=933, name=zkCallback-36-thread-3, state=TIMED_WAITING, group=TGRP-CollectionsAPIDistributedZkTest]
        at sun.misc.Unsafe.park(Native Method)
        at java.util.concurrent.locks.LockSupport.parkNanos(LockSupport.java:215)
        at java.util.concurrent.SynchronousQueue$TransferStack.awaitFulfill(SynchronousQueue.java:460)
        at java.util.concurrent.SynchronousQueue$TransferStack.transfer(SynchronousQueue.java:362)
        at java.util.concurrent.SynchronousQueue.poll(SynchronousQueue.java:941)
        at java.util.concurrent.ThreadPoolExecutor.getTask(ThreadPoolExecutor.java:1066)
        at java.util.concurrent.ThreadPoolExecutor.runWorker(ThreadPoolExecutor.java:1127)
        at java.util.concurrent.ThreadPoolExecutor$Worker.run(ThreadPoolExecutor.java:617)
        at java.lang.Thread.run(Thread.java:745)
   2) Thread[id=258, name=zkCallback-36-thread-1, state=TIMED_WAITING, group=TGRP-CollectionsAPIDistributedZkTest]
        at sun.misc.Unsafe.park(Native Method)
        at java.util.concurrent.locks.LockSupport.parkNanos(LockSupport.java:215)
        at java.util.concurrent.SynchronousQueue$TransferStack.awaitFulfill(SynchronousQueue.java:460)
        at java.util.concurrent.SynchronousQueue$TransferStack.transfer(SynchronousQueue.java:362)
        at java.util.concurrent.SynchronousQueue.poll(SynchronousQueue.java:941)
        at java.util.concurrent.ThreadPoolExecutor.getTask(ThreadPoolExecutor.java:1066)
        at java.util.concurrent.ThreadPoolExecutor.runWorker(ThreadPoolExecutor.java:1127)
        at java.util.concurrent.ThreadPoolExecutor$Worker.run(ThreadPoolExecutor.java:617)
        at java.lang.Thread.run(Thread.java:745)
   3) Thread[id=256, name=TEST-CollectionsAPIDistributedZkTest.test-seed#[5C9BBE9138FC6616]-SendThread(127.0.0.1:48848), state=TIMED_WAITING, group=TGRP-CollectionsAPIDistributedZkTest]
        at java.lang.Thread.sleep(Native Method)
        at org.apache.zookeeper.ClientCnxn$SendThread.run(ClientCnxn.java:994)
   4) Thread[id=932, name=zkCallback-36-thread-2, state=TIMED_WAITING, group=TGRP-CollectionsAPIDistributedZkTest]
        at sun.misc.Unsafe.park(Native Method)
        at java.util.concurrent.locks.LockSupport.parkNanos(LockSupport.java:215)
        at java.util.concurrent.SynchronousQueue$TransferStack.awaitFulfill(SynchronousQueue.java:460)
        at java.util.concurrent.SynchronousQueue$TransferStack.transfer(SynchronousQueue.java:362)
        at java.util.concurrent.SynchronousQueue.poll(SynchronousQueue.java:941)
        at java.util.concurrent.ThreadPoolExecutor.getTask(ThreadPoolExecutor.java:1066)
        at java.util.concurrent.ThreadPoolExecutor.runWorker(ThreadPoolExecutor.java:1127)
        at java.util.concurrent.ThreadPoolExecutor$Worker.run(ThreadPoolExecutor.java:617)
        at java.lang.Thread.run(Thread.java:745)
        at __randomizedtesting.SeedInfo.seed([5C9BBE9138FC6616]:0)


FAILED:  org.apache.solr.cloud.CollectionsAPIDistributedZkTest.test

Error Message:
Error from server at http://127.0.0.1:44425/awholynewcollection_0: non ok status: 500, message:Server Error

Stack Trace:
org.apache.solr.client.solrj.impl.HttpSolrClient$RemoteSolrException: Error from server at http://127.0.0.1:44425/awholynewcollection_0: non ok status: 500, message:Server Error
        at __randomizedtesting.SeedInfo.seed([5C9BBE9138FC6616:D4CF814B96000BEE]:0)
        at org.apache.solr.client.solrj.impl.HttpSolrClient.executeMethod(HttpSolrClient.java:509)
        at org.apache.solr.client.solrj.impl.HttpSolrClient.request(HttpSolrClient.java:241)
        at org.apache.solr.client.solrj.impl.HttpSolrClient.request(HttpSolrClient.java:230)
        at org.apache.solr.client.solrj.SolrRequest.process(SolrRequest.java:150)
        at org.apache.solr.client.solrj.SolrClient.query(SolrClient.java:943)
        at org.apache.solr.client.solrj.SolrClient.query(SolrClient.java:958)
        at org.apache.solr.cloud.AbstractFullDistribZkTestBase.waitForNon403or404or503(AbstractFullDistribZkTestBase.java:1753)
        at org.apache.solr.cloud.CollectionsAPIDistributedZkTest.testCollectionsAPI(CollectionsAPIDistributedZkTest.java:653)
        at org.apache.solr.cloud.CollectionsAPIDistributedZkTest.test(CollectionsAPIDistributedZkTest.java:155)
        at sun.reflect.NativeMethodAccessorImpl.invoke0(Native Method)
        at sun.reflect.NativeMethodAccessorImpl.invoke(NativeMethodAccessorImpl.java:62)
        at sun.reflect.DelegatingMethodAccessorImpl.invoke(DelegatingMethodAccessorImpl.java:43)
        at java.lang.reflect.Method.invoke(Method.java:497)
        at com.carrotsearch.randomizedtesting.RandomizedRunner.invoke(RandomizedRunner.java:1660)
        at com.carrotsearch.randomizedtesting.RandomizedRunner$8.evaluate(RandomizedRunner.java:866)
        at com.carrotsearch.randomizedtesting.RandomizedRunner$9.evaluate(RandomizedRunner.java:902)
        at com.carrotsearch.randomizedtesting.RandomizedRunner$10.evaluate(RandomizedRunner.java:916)
        at org.apache.solr.BaseDistributedSearchTestCase$ShardsRepeatRule$ShardsFixedStatement.callStatement(BaseDistributedSearchTestCase.java:963)
        at org.apache.solr.BaseDistributedSearchTestCase$ShardsRepeatRule$ShardsStatement.evaluate(BaseDistributedSearchTestCase.java:938)
        at com.carrotsearch.randomizedtesting.rules.SystemPropertiesRestoreRule$1.evaluate(SystemPropertiesRestoreRule.java:57)
        at org.apache.lucene.util.TestRuleSetupTeardownChained$1.evaluate(TestRuleSetupTeardownChained.java:50)
        at org.apache.lucene.util.AbstractBeforeAfterRule$1.evaluate(AbstractBeforeAfterRule.java:46)
        at org.apache.lucene.util.TestRuleThreadAndTestName$1.evaluate(TestRuleThreadAndTestName.java:49)
        at org.apache.lucene.util.TestRuleIgnoreAfterMaxFailures$1.evaluate(TestRuleIgnoreAfterMaxFailures.java:65)
        at org.apache.lucene.util.TestRuleMarkFailure$1.evaluate(TestRuleMarkFailure.java:48)
        at com.carrotsearch.randomizedtesting.rules.StatementAdapter.evaluate(StatementAdapter.java:36)
        at com.carrotsearch.randomizedtesting.ThreadLeakControl$StatementRunner.run(ThreadLeakControl.java:367)
        at com.carrotsearch.randomizedtesting.ThreadLeakControl.forkTimeoutingTask(ThreadLeakControl.java:809)
        at com.carrotsearch.randomizedtesting.ThreadLeakControl$3.evaluate(ThreadLeakControl.java:460)
        at com.carrotsearch.randomizedtesting.RandomizedRunner.runSingleTest(RandomizedRunner.java:875)
        at com.carrotsearch.randomizedtesting.RandomizedRunner$5.evaluate(RandomizedRunner.java:777)
        at com.carrotsearch.randomizedtesting.RandomizedRunner$6.evaluate(RandomizedRunner.java:811)
        at com.carrotsearch.randomizedtesting.RandomizedRunner$7.evaluate(RandomizedRunner.java:822)
        at com.carrotsearch.randomizedtesting.rules.StatementAdapter.evaluate(StatementAdapter.java:36)
        at com.carrotsearch.randomizedtesting.rules.SystemPropertiesRestoreRule$1.evaluate(SystemPropertiesRestoreRule.java:57)
        at org.apache.lucene.util.AbstractBeforeAfterRule$1.evaluate(AbstractBeforeAfterRule.java:46)
        at com.carrotsearch.randomizedtesting.rules.StatementAdapter.evaluate(StatementAdapter.java:36)
        at org.apache.lucene.util.TestRuleStoreClassName$1.evaluate(TestRuleStoreClassName.java:42)
        at com.carrotsearch.randomizedtesting.rules.NoShadowingOrOverridesOnMethodsRule$1.evaluate(NoShadowingOrOverridesOnMethodsRule.java:40)
        at com.carrotsearch.randomizedtesting.rules.NoShadowingOrOverridesOnMethodsRule$1.evaluate(NoShadowingOrOverridesOnMethodsRule.java:40)
        at com.carrotsearch.randomizedtesting.rules.StatementAdapter.evaluate(StatementAdapter.java:36)
        at com.carrotsearch.randomizedtesting.rules.StatementAdapter.evaluate(StatementAdapter.java:36)
        at com.carrotsearch.randomizedtesting.rules.StatementAdapter.evaluate(StatementAdapter.java:36)
        at org.apache.lucene.util.TestRuleAssertionsRequired$1.evaluate(TestRuleAssertionsRequired.java:54)
        at org.apache.lucene.util.TestRuleMarkFailure$1.evaluate(TestRuleMarkFailure.java:48)
        at org.apache.lucene.util.TestRuleIgnoreAfterMaxFailures$1.evaluate(TestRuleIgnoreAfterMaxFailures.java:65)
        at org.apache.lucene.util.TestRuleIgnoreTestSuites$1.evaluate(TestRuleIgnoreTestSuites.java:55)
        at com.carrotsearch.randomizedtesting.rules.StatementAdapter.evaluate(StatementAdapter.java:36)
        at com.carrotsearch.randomizedtesting.ThreadLeakControl$StatementRunner.run(ThreadLeakControl.java:367)
        at java.lang.Thread.run(Thread.java:745)




Build Log:
[...truncated 9533 lines...]
   [junit4] Suite: org.apache.solr.cloud.CollectionsAPIDistributedZkTest
   [junit4]   2> Creating dataDir: /home/jenkins/workspace/Lucene-Solr-trunk-Linux/solr/build/solr-core/test/J1/temp/solr.cloud.CollectionsAPIDistributedZkTest_5C9BBE9138FC6616-001/init-core-data-001
   [junit4]   2> 11503 INFO  (SUITE-CollectionsAPIDistributedZkTest-seed#[5C9BBE9138FC6616]-worker) [    ] o.a.s.SolrTestCaseJ4 Randomized ssl (false) and clientAuth (false)
   [junit4]   2> 11503 INFO  (SUITE-CollectionsAPIDistributedZkTest-seed#[5C9BBE9138FC6616]-worker) [    ] o.a.s.BaseDistributedSearchTestCase Setting hostContext system property: /
   [junit4]   2> 11513 INFO  (TEST-CollectionsAPIDistributedZkTest.test-seed#[5C9BBE9138FC6616]) [    ] o.a.s.c.ZkTestServer STARTING ZK TEST SERVER
   [junit4]   2> 11514 INFO  (Thread-20) [    ] o.a.s.c.ZkTestServer client port:0.0.0.0/0.0.0.0:0
   [junit4]   2> 11515 INFO  (Thread-20) [    ] o.a.s.c.ZkTestServer Starting server
   [junit4]   2> 11614 INFO  (TEST-CollectionsAPIDistributedZkTest.test-seed#[5C9BBE9138FC6616]) [    ] o.a.s.c.ZkTestServer start zk server on port:48848
   [junit4]   2> 11631 INFO  (TEST-CollectionsAPIDistributedZkTest.test-seed#[5C9BBE9138FC6616]) [    ] o.a.s.c.c.SolrZkClient Using default ZkCredentialsProvider
   [junit4]   2> 11670 INFO  (TEST-CollectionsAPIDistributedZkTest.test-seed#[5C9BBE9138FC6616]) [    ] o.a.s.c.c.ConnectionManager Waiting for client to connect to ZooKeeper
   [junit4]   2> 11704 INFO  (zkCallback-2-thread-1) [    ] o.a.s.c.c.ConnectionManager Watcher org.apache.solr.common.cloud.ConnectionManager@54c1a0b7 name:ZooKeeperConnection Watcher:127.0.0.1:48848 got event WatchedEvent state:SyncConnected type:None path:null path:null type:None
   [junit4]   2> 11705 INFO  (TEST-CollectionsAPIDistributedZkTest.test-seed#[5C9BBE9138FC6616]) [    ] o.a.s.c.c.ConnectionManager Client is connected to ZooKeeper
   [junit4]   2> 11706 INFO  (TEST-CollectionsAPIDistributedZkTest.test-seed#[5C9BBE9138FC6616]) [    ] o.a.s.c.c.SolrZkClient Using default ZkACLProvider
   [junit4]   2> 11708 INFO  (TEST-CollectionsAPIDistributedZkTest.test-seed#[5C9BBE9138FC6616]) [    ] o.a.s.c.c.SolrZkClient makePath: /solr
   [junit4]   2> 11732 INFO  (TEST-CollectionsAPIDistributedZkTest.test-seed#[5C9BBE9138FC6616]) [    ] o.a.s.c.c.SolrZkClient Using default ZkCredentialsProvider
   [junit4]   2> 11732 INFO  (TEST-CollectionsAPIDistributedZkTest.test-seed#[5C9BBE9138FC6616]) [    ] o.a.s.c.c.ConnectionManager Waiting for client to connect to ZooKeeper
   [junit4]   2> 11735 INFO  (zkCallback-3-thread-1) [    ] o.a.s.c.c.ConnectionManager Watcher org.apache.solr.common.cloud.ConnectionManager@9678120 name:ZooKeeperConnection Watcher:127.0.0.1:48848/solr got event WatchedEvent state:SyncConnected type:None path:null path:null type:None
   [junit4]   2> 11735 INFO  (TEST-CollectionsAPIDistributedZkTest.test-seed#[5C9BBE9138FC6616]) [    ] o.a.s.c.c.ConnectionManager Client is connected to ZooKeeper
   [junit4]   2> 11735 INFO  (TEST-CollectionsAPIDistributedZkTest.test-seed#[5C9BBE9138FC6616]) [    ] o.a.s.c.c.SolrZkClient Using default ZkACLProvider
   [junit4]   2> 11738 INFO  (TEST-CollectionsAPIDistributedZkTest.test-seed#[5C9BBE9138FC6616]) [    ] o.a.s.c.c.SolrZkClient makePath: /collections/collection1
   [junit4]   2> 11741 INFO  (TEST-CollectionsAPIDistributedZkTest.test-seed#[5C9BBE9138FC6616]) [    ] o.a.s.c.c.SolrZkClient makePath: /collections/collection1/shards
   [junit4]   2> 11744 INFO  (TEST-CollectionsAPIDistributedZkTest.test-seed#[5C9BBE9138FC6616]) [    ] o.a.s.c.c.SolrZkClient makePath: /collections/control_collection
   [junit4]   2> 11746 INFO  (TEST-CollectionsAPIDistributedZkTest.test-seed#[5C9BBE9138FC6616]) [    ] o.a.s.c.c.SolrZkClient makePath: /collections/control_collection/shards
   [junit4]   2> 11749 INFO  (TEST-CollectionsAPIDistributedZkTest.test-seed#[5C9BBE9138FC6616]) [    ] o.a.s.c.AbstractZkTestCase put /home/jenkins/workspace/Lucene-Solr-trunk-Linux/solr/core/src/test-files/solr/collection1/conf/solrconfig-tlog.xml to /configs/conf1/solrconfig.xml
   [junit4]   2> 11755 INFO  (TEST-CollectionsAPIDistributedZkTest.test-seed#[5C9BBE9138FC6616]) [    ] o.a.s.c.c.SolrZkClient makePath: /configs/conf1/solrconfig.xml
   [junit4]   2> 11759 INFO  (TEST-CollectionsAPIDistributedZkTest.test-seed#[5C9BBE9138FC6616]) [    ] o.a.s.c.AbstractZkTestCase put /home/jenkins/workspace/Lucene-Solr-trunk-Linux/solr/core/src/test-files/solr/collection1/conf/schema.xml to /configs/conf1/schema.xml
   [junit4]   2> 11760 INFO  (TEST-CollectionsAPIDistributedZkTest.test-seed#[5C9BBE9138FC6616]) [    ] o.a.s.c.c.SolrZkClient makePath: /configs/conf1/schema.xml
   [junit4]   2> 11762 INFO  (TEST-CollectionsAPIDistributedZkTest.test-seed#[5C9BBE9138FC6616]) [    ] o.a.s.c.AbstractZkTestCase put /home/jenkins/workspace/Lucene-Solr-trunk-Linux/solr/core/src/test-files/solr/collection1/conf/solrconfig.snippet.randomindexconfig.xml to /configs/conf1/solrconfig.snippet.randomindexconfig.xml
   [junit4]   2> 11762 INFO  (TEST-CollectionsAPIDistributedZkTest.test-seed#[5C9BBE9138FC6616]) [    ] o.a.s.c.c.SolrZkClient makePath: /configs/conf1/solrconfig.snippet.randomindexconfig.xml
   [junit4]   2> 11765 INFO  (TEST-CollectionsAPIDistributedZkTest.test-seed#[5C9BBE9138FC6616]) [    ] o.a.s.c.AbstractZkTestCase put /home/jenkins/workspace/Lucene-Solr-trunk-Linux/solr/core/src/test-files/solr/collection1/conf/stopwords.txt to /configs/conf1/stopwords.txt
   [junit4]   2> 11765 INFO  (TEST-CollectionsAPIDistributedZkTest.test-seed#[5C9BBE9138FC6616]) [    ] o.a.s.c.c.SolrZkClient makePath: /configs/conf1/stopwords.txt
   [junit4]   2> 11779 INFO  (TEST-CollectionsAPIDistributedZkTest.test-seed#[5C9BBE9138FC6616]) [    ] o.a.s.c.AbstractZkTestCase put /home/jenkins/workspace/Lucene-Solr-trunk-Linux/solr/core/src/test-files/solr/collection1/conf/protwords.txt to /configs/conf1/protwords.txt
   [junit4]   2> 11779 INFO  (TEST-CollectionsAPIDistributedZkTest.test-seed#[5C9BBE9138FC6616]) [    ] o.a.s.c.c.SolrZkClient makePath: /configs/conf1/protwords.txt
   [junit4]   2> 11781 INFO  (TEST-CollectionsAPIDistributedZkTest.test-seed#[5C9BBE9138FC6616]) [    ] o.a.s.c.AbstractZkTestCase put /home/jenkins/workspace/Lucene-Solr-trunk-Linux/solr/core/src/test-files/solr/collection1/conf/currency.xml to /configs/conf1/currency.xml
   [junit4]   2> 11781 INFO  (TEST-CollectionsAPIDistributedZkTest.test-seed#[5C9BBE9138FC6616]) [    ] o.a.s.c.c.SolrZkClient makePath: /configs/conf1/currency.xml
   [junit4]   2> 11784 INFO  (TEST-CollectionsAPIDistributedZkTest.test-seed#[5C9BBE9138FC6616]) [    ] o.a.s.c.AbstractZkTestCase put /home/jenkins/workspace/Lucene-Solr-trunk-Linux/solr/core/src/test-files/solr/collection1/conf/enumsConfig.xml to /configs/conf1/enumsConfig.xml
   [junit4]   2> 11784 INFO  (TEST-CollectionsAPIDistributedZkTest.test-seed#[5C9BBE9138FC6616]) [    ] o.a.s.c.c.SolrZkClient makePath: /configs/conf1/enumsConfig.xml
   [junit4]   2> 11786 INFO  (TEST-CollectionsAPIDistributedZkTest.test-seed#[5C9BBE9138FC6616]) [    ] o.a.s.c.AbstractZkTestCase put /home/jenkins/workspace/Lucene-Solr-trunk-Linux/solr/core/src/test-files/solr/collection1/conf/open-exchange-rates.json to /configs/conf1/open-exchange-rates.json
   [junit4]   2> 11786 INFO  (TEST-CollectionsAPIDistributedZkTest.test-seed#[5C9BBE9138FC6616]) [    ] o.a.s.c.c.SolrZkClient makePath: /configs/conf1/open-exchange-rates.json
   [junit4]   2> 11787 INFO  (TEST-CollectionsAPIDistributedZkTest.test-seed#[5C9BBE9138FC6616]) [    ] o.a.s.c.AbstractZkTestCase put /home/jenkins/workspace/Lucene-Solr-trunk-Linux/solr/core/src/test-files/solr/collection1/conf/mapping-ISOLatin1Accent.txt to /configs/conf1/mapping-ISOLatin1Accent.txt
   [junit4]   2> 11788 INFO  (TEST-CollectionsAPIDistributedZkTest.test-seed#[5C9BBE9138FC6616]) [    ] o.a.s.c.c.SolrZkClient makePath: /configs/conf1/mapping-ISOLatin1Accent.txt
   [junit4]   2> 11789 INFO  (TEST-CollectionsAPIDistributedZkTest.test-seed#[5C9BBE9138FC6616]) [    ] o.a.s.c.AbstractZkTestCase put /home/jenkins/workspace/Lucene-Solr-trunk-Linux/solr/core/src/test-files/solr/collection1/conf/old_synonyms.txt to /configs/conf1/old_synonyms.txt
   [junit4]   2> 11789 INFO  (TEST-CollectionsAPIDistributedZkTest.test-seed#[5C9BBE9138FC6616]) [    ] o.a.s.c.c.SolrZkClient makePath: /configs/conf1/old_synonyms.txt
   [junit4]   2> 11791 INFO  (TEST-CollectionsAPIDistributedZkTest.test-seed#[5C9BBE9138FC6616]) [    ] o.a.s.c.AbstractZkTestCase put /home/jenkins/workspace/Lucene-Solr-trunk-Linux/solr/core/src/test-files/solr/collection1/conf/synonyms.txt to /configs/conf1/synonyms.txt
   [junit4]   2> 11791 INFO  (TEST-CollectionsAPIDistributedZkTest.test-seed#[5C9BBE9138FC6616]) [    ] o.a.s.c.c.SolrZkClient makePath: /configs/conf1/synonyms.txt
   [junit4]   2> 11793 INFO  (TEST-CollectionsAPIDistributedZkTest.test-seed#[5C9BBE9138FC6616]) [    ] o.a.s.c.c.SolrZkClient Using default ZkCredentialsProvider
   [junit4]   2> 11794 INFO  (TEST-CollectionsAPIDistributedZkTest.test-seed#[5C9BBE9138FC6616]) [    ] o.a.s.c.c.ConnectionManager Waiting for client to connect to ZooKeeper
   [junit4]   2> 11795 INFO  (zkCallback-4-thread-1) [    ] o.a.s.c.c.ConnectionManager Watcher org.apache.solr.common.cloud.ConnectionManager@7b1af5c8 name:ZooKeeperConnection Watcher:127.0.0.1:48848 got event WatchedEvent state:SyncConnected type:None path:null path:null type:None
   [junit4]   2> 11795 INFO  (TEST-CollectionsAPIDistributedZkTest.test-seed#[5C9BBE9138FC6616]) [    ] o.a.s.c.c.ConnectionManager Client is connected to ZooKeeper
   [junit4]   2> 11796 INFO  (TEST-CollectionsAPIDistributedZkTest.test-seed#[5C9BBE9138FC6616]) [    ] o.a.s.c.c.SolrZkClient Using default ZkACLProvider
   [junit4]   2> 11796 INFO  (TEST-CollectionsAPIDistributedZkTest.test-seed#[5C9BBE9138FC6616]) [    ] o.a.s.c.c.SolrZkClient makePath: /solr
   [junit4]   2> 11801 INFO  (TEST-CollectionsAPIDistributedZkTest.test-seed#[5C9BBE9138FC6616]) [    ] o.a.s.c.c.SolrZkClient Using default ZkCredentialsProvider
   [junit4]   2> 11801 INFO  (TEST-CollectionsAPIDistributedZkTest.test-seed#[5C9BBE9138FC6616]) [    ] o.a.s.c.c.ConnectionManager Waiting for client to connect to ZooKeeper
   [junit4]   2> 11802 WARN  (NIOServerCxn.Factory:0.0.0.0/0.0.0.0:0) [    ] o.a.z.s.NIOServerCnxn caught end of stream exception
   [junit4]   2> EndOfStreamException: Unable to read additional data from client sessionid 0x150f6b7cc0c0002, likely client has closed socket
   [junit4]   2> at org.apache.zookeeper.server.NIOServerCnxn.doIO(NIOServerCnxn.java:228)
   [junit4]   2> at org.apache.zookeeper.server.NIOServerCnxnFactory.run(NIOServerCnxnFactory.java:208)
   [junit4]   2> at java.lang.Thread.run(Thread.java:745)
   [junit4]   2> 11805 INFO  (zkCallback-5-thread-1) [    ] o.a.s.c.c.ConnectionManager Watcher org.apache.solr.common.cloud.ConnectionManager@23688ccf name:ZooKeeperConnection Watcher:127.0.0.1:48848/solr got event WatchedEvent state:SyncConnected type:None path:null path:null type:None
   [junit4]   2> 11805 INFO  (TEST-CollectionsAPIDistributedZkTest.test-seed#[5C9BBE9138FC6616]) [    ] o.a.s.c.c.ConnectionManager Client is connected to ZooKeeper
   [junit4]   2> 11805 INFO  (TEST-CollectionsAPIDistributedZkTest.test-seed#[5C9BBE9138FC6616]) [    ] o.a.s.c.c.SolrZkClient Using default ZkACLProvider
   [junit4]   2> 11806 INFO  (TEST-CollectionsAPIDistributedZkTest.test-seed#[5C9BBE9138FC6616]) [    ] o.a.s.c.AbstractZkTestCase put /home/jenkins/workspace/Lucene-Solr-trunk-Linux/solr/core/src/test-files/solr/collection1/conf/solrconfig-tlog.xml to /configs/conf2/solrconfig.xml
   [junit4]   2> 11806 INFO  (TEST-CollectionsAPIDistributedZkTest.test-seed#[5C9BBE9138FC6616]) [    ] o.a.s.c.c.SolrZkClient makePath: /configs/conf2/solrconfig.xml
   [junit4]   2> 11809 INFO  (TEST-CollectionsAPIDistributedZkTest.test-seed#[5C9BBE9138FC6616]) [    ] o.a.s.c.AbstractZkTestCase put /home/jenkins/workspace/Lucene-Solr-trunk-Linux/solr/core/src/test-files/solr/collection1/conf/schema.xml to /configs/conf2/schema.xml
   [junit4]   2> 11809 INFO  (TEST-CollectionsAPIDistributedZkTest.test-seed#[5C9BBE9138FC6616]) [    ] o.a.s.c.c.SolrZkClient makePath: /configs/conf2/schema.xml
   [junit4]   2> 11811 INFO  (TEST-CollectionsAPIDistributedZkTest.test-seed#[5C9BBE9138FC6616]) [    ] o.a.s.c.AbstractZkTestCase put /home/jenkins/workspace/Lucene-Solr-trunk-Linux/solr/core/src/test-files/solr/collection1/conf/enumsConfig.xml to /configs/conf2/enumsConfig.xml
   [junit4]   2> 11812 INFO  (TEST-CollectionsAPIDistributedZkTest.test-seed#[5C9BBE9138FC6616]) [    ] o.a.s.c.c.SolrZkClient makePath: /configs/conf2/enumsConfig.xml
   [junit4]   2> 11813 INFO  (TEST-CollectionsAPIDistributedZkTest.test-seed#[5C9BBE9138FC6616]) [    ] o.a.s.c.AbstractZkTestCase put /home/jenkins/workspace/Lucene-Solr-trunk-Linux/solr/core/src/test-files/solr/collection1/conf/solrconfig.snippet.randomindexconfig.xml to /configs/conf2/solrconfig.snippet.randomindexconfig.xml
   [junit4]   2> 11813 INFO  (TEST-CollectionsAPIDistributedZkTest.test-seed#[5C9BBE9138FC6616]) [    ] o.a.s.c.c.SolrZkClient makePath: /configs/conf2/solrconfig.snippet.randomindexconfig.xml
   [junit4]   2> 11815 INFO  (TEST-CollectionsAPIDistributedZkTest.test-seed#[5C9BBE9138FC6616]) [    ] o.a.s.c.AbstractZkTestCase put /home/jenkins/workspace/Lucene-Solr-trunk-Linux/solr/core/src/test-files/solr/collection1/conf/stopwords.txt to /configs/conf2/stopwords.txt
   [junit4]   2> 11815 INFO  (TEST-CollectionsAPIDistributedZkTest.test-seed#[5C9BBE9138FC6616]) [    ] o.a.s.c.c.SolrZkClient makePath: /configs/conf2/stopwords.txt
   [junit4]   2> 11816 INFO  (TEST-CollectionsAPIDistributedZkTest.test-seed#[5C9BBE9138FC6616]) [    ] o.a.s.c.AbstractZkTestCase put /home/jenkins/workspace/Lucene-Solr-trunk-Linux/solr/core/src/test-files/solr/collection1/conf/protwords.txt to /configs/conf2/protwords.txt
   [junit4]   2> 11817 INFO  (TEST-CollectionsAPIDistributedZkTest.test-seed#[5C9BBE9138FC6616]) [    ] o.a.s.c.c.SolrZkClient makePath: /configs/conf2/protwords.txt
   [junit4]   2> 11818 INFO  (TEST-CollectionsAPIDistributedZkTest.test-seed#[5C9BBE9138FC6616]) [    ] o.a.s.c.AbstractZkTestCase put /home/jenkins/workspace/Lucene-Solr-trunk-Linux/solr/core/src/test-files/solr/collection1/conf/currency.xml to /configs/conf2/currency.xml
   [junit4]   2> 11818 INFO  (TEST-CollectionsAPIDistributedZkTest.test-seed#[5C9BBE9138FC6616]) [    ] o.a.s.c.c.SolrZkClient makePath: /configs/conf2/currency.xml
   [junit4]   2> 11820 INFO  (TEST-CollectionsAPIDistributedZkTest.test-seed#[5C9BBE9138FC6616]) [    ] o.a.s.c.AbstractZkTestCase put /home/jenkins/workspace/Lucene-Solr-trunk-Linux/solr/core/src/test-files/solr/collection1/conf/open-exchange-rates.json to /configs/conf2/open-exchange-rates.json
   [junit4]   2> 11820 INFO  (TEST-CollectionsAPIDistributedZkTest.test-seed#[5C9BBE9138FC6616]) [    ] o.a.s.c.c.SolrZkClient makePath: /configs/conf2/open-exchange-rates.json
   [junit4]   2> 11822 INFO  (TEST-CollectionsAPIDistributedZkTest.test-seed#[5C9BBE9138FC6616]) [    ] o.a.s.c.AbstractZkTestCase put /home/jenkins/workspace/Lucene-Solr-trunk-Linux/solr/core/src/test-files/solr/collection1/conf/mapping-ISOLatin1Accent.txt to /configs/conf2/mapping-ISOLatin1Accent.txt
   [junit4]   2> 11822 INFO  (TEST-CollectionsAPIDistributedZkTest.test-seed#[5C9BBE9138FC6616]) [    ] o.a.s.c.c.SolrZkClient makePath: /configs/conf2/mapping-ISOLatin1Accent.txt
   [junit4]   2> 11824 INFO  (TEST-CollectionsAPIDistributedZkTest.test-seed#[5C9BBE9138FC6616]) [    ] o.a.s.c.AbstractZkTestCase put /home/jenkins/workspace/Lucene-Solr-trunk-Linux/solr/core/src/test-files/solr/collection1/conf/old_synonyms.txt to /configs/conf2/old_synonyms.txt
   [junit4]   2> 11824 INFO  (TEST-CollectionsAPIDistributedZkTest.test-seed#[5C9BBE9138FC6616]) [    ] o.a.s.c.c.SolrZkClient makePath: /configs/conf2/old_synonyms.txt
   [junit4]   2> 11825 INFO  (TEST-CollectionsAPIDistributedZkTest.test-seed#[5C9BBE9138FC6616]) [    ] o.a.s.c.AbstractZkTestCase put /home/jenkins/workspace/Lucene-Solr-trunk-Linux/solr/core/src/test-files/solr/collection1/conf/synonyms.txt to /configs/conf2/synonyms.txt
   [junit4]   2> 11826 INFO  (TEST-CollectionsAPIDistributedZkTest.test-seed#[5C9BBE9138FC6616]) [    ] o.a.s.c.c.SolrZkClient makePath: /configs/conf2/synonyms.txt
   [junit4]   2> 11827 INFO  (TEST-CollectionsAPIDistributedZkTest.test-seed#[5C9BBE9138FC6616]) [    ] o.a.s.c.AbstractZkTestCase put /home/jenkins/workspace/Lucene-Solr-trunk-Linux/solr/core/src/test-files/solr/collection1/conf/elevate.xml to /configs/conf2/elevate.xml
   [junit4]   2> 11827 INFO  (TEST-CollectionsAPIDistributedZkTest.test-seed#[5C9BBE9138FC6616]) [    ] o.a.s.c.c.SolrZkClient makePath: /configs/conf2/elevate.xml
   [junit4]   2> 11891 INFO  (TEST-CollectionsAPIDistributedZkTest.test-seed#[5C9BBE9138FC6616]) [    ] o.a.s.SolrTestCaseJ4 Writing core.properties file to /home/jenkins/workspace/Lucene-Solr-trunk-Linux/solr/build/solr-core/test/J1/temp/solr.cloud.CollectionsAPIDistributedZkTest_5C9BBE9138FC6616-001/control-001/cores/collection1
   [junit4]   2> 11913 INFO  (TEST-CollectionsAPIDistributedZkTest.test-seed#[5C9BBE9138FC6616]) [    ] o.e.j.u.log Logging initialized @13463ms
   [junit4]   2> 12024 INFO  (TEST-CollectionsAPIDistributedZkTest.test-seed#[5C9BBE9138FC6616]) [    ] o.e.j.s.Server jetty-9.2.13.v20150730
   [junit4]   2> 12074 INFO  (TEST-CollectionsAPIDistributedZkTest.test-seed#[5C9BBE9138FC6616]) [    ] o.e.j.s.h.ContextHandler Started o.e.j.s.ServletContextHandler@753e5b89{/,null,AVAILABLE}
   [junit4]   2> 12081 INFO  (TEST-CollectionsAPIDistributedZkTest.test-seed#[5C9BBE9138FC6616]) [    ] o.e.j.s.ServerConnector Started ServerConnector@b5c5aac{HTTP/1.1}{127.0.0.1:40563}
   [junit4]   2> 12086 INFO  (TEST-CollectionsAPIDistributedZkTest.test-seed#[5C9BBE9138FC6616]) [    ] o.e.j.s.Server Started @13637ms
   [junit4]   2> 12086 INFO  (TEST-CollectionsAPIDistributedZkTest.test-seed#[5C9BBE9138FC6616]) [    ] o.a.s.c.s.e.JettySolrRunner Jetty properties: {solr.data.dir=/home/jenkins/workspace/Lucene-Solr-trunk-Linux/solr/build/solr-core/test/J1/temp/solr.cloud.CollectionsAPIDistributedZkTest_5C9BBE9138FC6616-001/tempDir-001/control/data, hostContext=/, hostPort=40563, coreRootDirectory=/home/jenkins/workspace/Lucene-Solr-trunk-Linux/solr/build/solr-core/test/J1/temp/solr.cloud.CollectionsAPIDistributedZkTest_5C9BBE9138FC6616-001/control-001/cores}
   [junit4]   2> 12095 INFO  (TEST-CollectionsAPIDistributedZkTest.test-seed#[5C9BBE9138FC6616]) [    ] o.a.s.s.SolrDispatchFilter SolrDispatchFilter.init(): sun.misc.Launcher$AppClassLoader@4e0e2f2a
   [junit4]   2> 12100 INFO  (TEST-CollectionsAPIDistributedZkTest.test-seed#[5C9BBE9138FC6616]) [    ] o.a.s.c.SolrResourceLoader new SolrResourceLoader for directory: '/home/jenkins/workspace/Lucene-Solr-trunk-Linux/solr/build/solr-core/test/J1/temp/solr.cloud.CollectionsAPIDistributedZkTest_5C9BBE9138FC6616-001/control-001/'
   [junit4]   2> 12100 INFO  (TEST-CollectionsAPIDistributedZkTest.test-seed#[5C9BBE9138FC6616]) [    ] o.a.s.c.SolrResourceLoader JNDI not configured for solr (NoInitialContextEx)
   [junit4]   2> 12100 INFO  (TEST-CollectionsAPIDistributedZkTest.test-seed#[5C9BBE9138FC6616]) [    ] o.a.s.c.SolrResourceLoader solr home defaulted to 'solr/' (could not find system property or JNDI)
   [junit4]   2> 12120 INFO  (TEST-CollectionsAPIDistributedZkTest.test-seed#[5C9BBE9138FC6616]) [    ] o.a.s.c.c.SolrZkClient Using default ZkCredentialsProvider
   [junit4]   2> 12121 INFO  (TEST-CollectionsAPIDistributedZkTest.test-seed#[5C9BBE9138FC6616]) [    ] o.a.s.c.c.ConnectionManager Waiting for client to connect to ZooKeeper
   [junit4]   2> 12123 INFO  (zkCallback-6-thread-1) [    ] o.a.s.c.c.ConnectionManager Watcher org.apache.solr.common.cloud.ConnectionManager@682cf3b7 name:ZooKeeperConnection Watcher:127.0.0.1:48848/solr got event WatchedEvent state:SyncConnected type:None path:null path:null type:None
   [junit4]   2> 12123 INFO  (TEST-CollectionsAPIDistributedZkTest.test-seed#[5C9BBE9138FC6616]) [    ] o.a.s.c.c.ConnectionManager Client is connected to ZooKeeper
   [junit4]   2> 12124 INFO  (TEST-CollectionsAPIDistributedZkTest.test-seed#[5C9BBE9138FC6616]) [    ] o.a.s.c.c.SolrZkClient Using default ZkACLProvider
   [junit4]   2> 12125 INFO  (TEST-CollectionsAPIDistributedZkTest.test-seed#[5C9BBE9138FC6616]) [    ] o.a.s.s.SolrDispatchFilter Loading solr.xml from SolrHome (not found in ZooKeeper)
   [junit4]   2> 12127 INFO  (TEST-CollectionsAPIDistributedZkTest.test-seed#[5C9BBE9138FC6616]) [    ] o.a.s.c.SolrXmlConfig Loading container configuration from /home/jenkins/workspace/Lucene-Solr-trunk-Linux/solr/build/solr-core/test/J1/temp/solr.cloud.CollectionsAPIDistributedZkTest_5C9BBE9138FC6616-001/control-001/solr.xml
   [junit4]   2> 12147 INFO  (TEST-CollectionsAPIDistributedZkTest.test-seed#[5C9BBE9138FC6616]) [    ] o.a.s.c.CoresLocator Config-defined core root directory: /home/jenkins/workspace/Lucene-Solr-trunk-Linux/solr/build/solr-core/test/J1/temp/solr.cloud.CollectionsAPIDistributedZkTest_5C9BBE9138FC6616-001/control-001/cores
   [junit4]   2> 12147 INFO  (TEST-CollectionsAPIDistributedZkTest.test-seed#[5C9BBE9138FC6616]) [    ] o.a.s.c.CoreContainer New CoreContainer 827371240
   [junit4]   2> 12147 INFO  (TEST-CollectionsAPIDistributedZkTest.test-seed#[5C9BBE9138FC6616]) [    ] o.a.s.c.CoreContainer Loading cores into CoreContainer [instanceDir=/home/jenkins/workspace/Lucene-Solr-trunk-Linux/solr/build/solr-core/test/J1/temp/solr.cloud.CollectionsAPIDistributedZkTest_5C9BBE9138FC6616-001/control-001/]
   [junit4]   2> 12147 INFO  (TEST-CollectionsAPIDistributedZkTest.test-seed#[5C9BBE9138FC6616]) [    ] o.a.s.c.CoreContainer loading shared library: /home/jenkins/workspace/Lucene-Solr-trunk-Linux/solr/build/solr-core/test/J1/temp/solr.cloud.CollectionsAPIDistributedZkTest_5C9BBE9138FC6616-001/control-001/lib
   [junit4]   2> 12147 WARN  (TEST-CollectionsAPIDistributedZkTest.test-seed#[5C9BBE9138FC6616]) [    ] o.a.s.c.SolrResourceLoader Can't find (or read) directory to add to classloader: lib (resolved as: /home/jenkins/workspace/Lucene-Solr-trunk-Linux/solr/build/solr-core/test/J1/temp/solr.cloud.CollectionsAPIDistributedZkTest_5C9BBE9138FC6616-001/control-001/lib).
   [junit4]   2> 12174 INFO  (TEST-CollectionsAPIDistributedZkTest.test-seed#[5C9BBE9138FC6616]) [    ] o.a.s.h.c.HttpShardHandlerFactory created with socketTimeout : 90000,urlScheme : ,connTimeout : 15000,maxConnectionsPerHost : 20,maxConnections : 10000,corePoolSize : 0,maximumPoolSize : 2147483647,maxThreadIdleTime : 5,sizeOfQueue : -1,fairnessPolicy : false,useRetries : false,
   [junit4]   2> 12176 INFO  (TEST-CollectionsAPIDistributedZkTest.test-seed#[5C9BBE9138FC6616]) [    ] o.a.s.u.UpdateShardHandler Creating UpdateShardHandler HTTP client with params: socketTimeout=340000&connTimeout=45000&retry=true
   [junit4]   2> 12177 INFO  (TEST-CollectionsAPIDistributedZkTest.test-seed#[5C9BBE9138FC6616]) [    ] o.a.s.l.LogWatcher SLF4J impl is org.slf4j.impl.Log4jLoggerFactory
   [junit4]   2> 12177 INFO  (TEST-CollectionsAPIDistributedZkTest.test-seed#[5C9BBE9138FC6616]) [    ] o.a.s.l.LogWatcher Registering Log Listener [Log4j (org.slf4j.impl.Log4jLoggerFactory)]
   [junit4]   2> 12177 INFO  (TEST-CollectionsAPIDistributedZkTest.test-seed#[5C9BBE9138FC6616]) [    ] o.a.s.c.ZkContainer Zookeeper client=127.0.0.1:48848/solr
   [junit4]   2> 12193 INFO  (TEST-CollectionsAPIDistributedZkTest.test-seed#[5C9BBE9138FC6616]) [    ] o.a.s.c.ZkController zkHost includes chroot
   [junit4]   2> 12193 INFO  (TEST-CollectionsAPIDistributedZkTest.test-seed#[5C9BBE9138FC6616]) [    ] o.a.s.c.c.SolrZkClient Using default ZkCredentialsProvider
   [junit4]   2> 12194 INFO  (TEST-CollectionsAPIDistributedZkTest.test-seed#[5C9BBE9138FC6616]) [    ] o.a.s.c.c.ConnectionManager Waiting for client to connect to ZooKeeper
   [junit4]   2> 12196 INFO  (zkCallback-8-thread-1) [    ] o.a.s.c.c.ConnectionManager Watcher org.apache.solr.common.cloud.ConnectionManager@3b63d49f name:ZooKeeperConnection Watcher:127.0.0.1:48848 got event WatchedEvent state:SyncConnected type:None path:null path:null type:None
   [junit4]   2> 12196 INFO  (TEST-CollectionsAPIDistributedZkTest.test-seed#[5C9BBE9138FC6616]) [    ] o.a.s.c.c.ConnectionManager Client is connected to ZooKeeper
   [junit4]   2> 12198 INFO  (TEST-CollectionsAPIDistributedZkTest.test-seed#[5C9BBE9138FC6616]) [    ] o.a.s.c.c.SolrZkClient Using default ZkACLProvider
   [junit4]   2> 12206 INFO  (TEST-CollectionsAPIDistributedZkTest.test-seed#[5C9BBE9138FC6616]) [n:127.0.0.1:40563_    ] o.a.s.c.c.ConnectionManager Waiting for client to connect to ZooKeeper
   [junit4]   2> 12208 INFO  (zkCallback-9-thread-1-processing-n:127.0.0.1:40563_) [n:127.0.0.1:40563_    ] o.a.s.c.c.ConnectionManager Watcher org.apache.solr.common.cloud.ConnectionManager@406d50c0 name:ZooKeeperConnection Watcher:127.0.0.1:48848/solr got event WatchedEvent state:SyncConnected type:None path:null path:null type:None
   [junit4]   2> 12210 INFO  (TEST-CollectionsAPIDistributedZkTest.test-seed#[5C9BBE9138FC6616]) [n:127.0.0.1:40563_    ] o.a.s.c.c.ConnectionManager Client is connected to ZooKeeper
   [junit4]   2> 12218 INFO  (TEST-CollectionsAPIDistributedZkTest.test-seed#[5C9BBE9138FC6616]) [n:127.0.0.1:40563_    ] o.a.s.c.c.SolrZkClient makePath: /overseer/queue
   [junit4]   2> 12224 INFO  (TEST-CollectionsAPIDistributedZkTest.test-seed#[5C9BBE9138FC6616]) [n:127.0.0.1:40563_    ] o.a.s.c.c.SolrZkClient makePath: /overseer/collection-queue-work
   [junit4]   2> 12228 INFO  (TEST-CollectionsAPIDistributedZkTest.test-seed#[5C9BBE9138FC6616]) [n:127.0.0.1:40563_    ] o.a.s.c.c.SolrZkClient makePath: /overseer/collection-map-running
   [junit4]   2> 12231 INFO  (TEST-CollectionsAPIDistributedZkTest.test-seed#[5C9BBE9138FC6616]) [n:127.0.0.1:40563_    ] o.a.s.c.c.SolrZkClient makePath: /overseer/collection-map-completed
   [junit4]   2> 12235 INFO  (TEST-CollectionsAPIDistributedZkTest.test-seed#[5C9BBE9138FC6616]) [n:127.0.0.1:40563_    ] o.a.s.c.c.SolrZkClient makePath: /overseer/collection-map-failure
   [junit4]   2> 12243 INFO  (TEST-CollectionsAPIDistributedZkTest.test-seed#[5C9BBE9138FC6616]) [n:127.0.0.1:40563_    ] o.a.s.c.c.SolrZkClient makePath: /live_nodes
   [junit4]   2> 12244 INFO  (TEST-CollectionsAPIDistributedZkTest.test-seed#[5C9BBE9138FC6616]) [n:127.0.0.1:40563_    ] o.a.s.c.c.SolrZkClient makePath: /aliases.json
   [junit4]   2> 12245 INFO  (TEST-CollectionsAPIDistributedZkTest.test-seed#[5C9BBE9138FC6616]) [n:127.0.0.1:40563_    ] o.a.s.c.c.SolrZkClient makePath: /clusterstate.json
   [junit4]   2> 12247 INFO  (TEST-CollectionsAPIDistributedZkTest.test-seed#[5C9BBE9138FC6616]) [n:127.0.0.1:40563_    ] o.a.s.c.c.SolrZkClient makePath: /security.json
   [junit4]   2> 12247 INFO  (TEST-CollectionsAPIDistributedZkTest.test-seed#[5C9BBE9138FC6616]) [n:127.0.0.1:40563_    ] o.a.s.c.ZkController Register node as live in ZooKeeper:/live_nodes/127.0.0.1:40563_
   [junit4]   2> 12251 INFO  (TEST-CollectionsAPIDistributedZkTest.test-seed#[5C9BBE9138FC6616]) [n:127.0.0.1:40563_    ] o.a.s.c.c.SolrZkClient makePath: /live_nodes/127.0.0.1:40563_
   [junit4]   2> 12416 INFO  (TEST-CollectionsAPIDistributedZkTest.test-seed#[5C9BBE9138FC6616]) [n:127.0.0.1:40563_    ] o.a.s.c.c.SolrZkClient makePath: /overseer_elect
   [junit4]   2> 12420 INFO  (TEST-CollectionsAPIDistributedZkTest.test-seed#[5C9BBE9138FC6616]) [n:127.0.0.1:40563_    ] o.a.s.c.c.SolrZkClient makePath: /overseer_elect/election
   [junit4]   2> 12423 INFO  (TEST-CollectionsAPIDistributedZkTest.test-seed#[5C9BBE9138FC6616]) [n:127.0.0.1:40563_    ] o.a.s.c.Overseer Overseer (id=null) closing
   [junit4]   2> 12424 INFO  (TEST-CollectionsAPIDistributedZkTest.test-seed#[5C9BBE9138FC6616]) [n:127.0.0.1:40563_    ] o.a.s.c.LeaderElector Joined leadership election with path: /overseer_elect/election/94846861437566982-127.0.0.1:40563_-n_0000000000
   [junit4]   2> 12429 INFO  (TEST-CollectionsAPIDistributedZkTest.test-seed#[5C9BBE9138FC6616]) [n:127.0.0.1:40563_    ] o.a.s.c.OverseerElectionContext I am going to be the leader 127.0.0.1:40563_
   [junit4]   2> 12430 INFO  (TEST-CollectionsAPIDistributedZkTest.test-seed#[5C9BBE9138FC6616]) [n:127.0.0.1:40563_    ] o.a.s.c.c.SolrZkClient makePath: /overseer_elect/leader
   [junit4]   2> 12432 INFO  (TEST-CollectionsAPIDistributedZkTest.test-seed#[5C9BBE9138FC6616]) [n:127.0.0.1:40563_    ] o.a.s.c.Overseer Overseer (id=94846861437566982-127.0.0.1:40563_-n_0000000000) starting
   [junit4]   2> 12439 INFO  (TEST-CollectionsAPIDistributedZkTest.test-seed#[5C9BBE9138FC6616]) [n:127.0.0.1:40563_    ] o.a.s.c.c.SolrZkClient makePath: /overseer/queue-work
   [junit4]   2> 12467 INFO  (TEST-CollectionsAPIDistributedZkTest.test-seed#[5C9BBE9138FC6616]) [n:127.0.0.1:40563_    ] o.a.s.c.OverseerAutoReplicaFailoverThread Starting OverseerAutoReplicaFailoverThread autoReplicaFailoverWorkLoopDelay=10000 autoReplicaFailoverWaitAfterExpiration=10000 autoReplicaFailoverBadNodeExpiration=60000
   [junit4]   2> 12470 INFO  (OverseerCollectionConfigSetProcessor-94846861437566982-127.0.0.1:40563_-n_0000000000) [n:127.0.0.1:40563_    ] o.a.s.c.OverseerTaskProcessor Process current queue of overseer operations
   [junit4]   2> 12474 INFO  (OverseerStateUpdate-94846861437566982-127.0.0.1:40563_-n_0000000000) [n:127.0.0.1:40563_    ] o.a.s.c.Overseer Starting to work on the main queue
   [junit4]   2> 12482 INFO  (TEST-CollectionsAPIDistributedZkTest.test-seed#[5C9BBE9138FC6616]) [n:127.0.0.1:40563_    ] o.a.s.c.c.ZkStateReader Updating cluster state from ZooKeeper...
   [junit4]   2> 12552 INFO  (TEST-CollectionsAPIDistributedZkTest.test-seed#[5C9BBE9138FC6616]) [n:127.0.0.1:40563_    ] o.a.s.c.CoreContainer Security conf doesn't exist. Skipping setup for authorization module.
   [junit4]   2> 12552 INFO  (TEST-CollectionsAPIDistributedZkTest.test-seed#[5C9BBE9138FC6616]) [n:127.0.0.1:40563_    ] o.a.s.c.CoreContainer No authentication plugin used.
   [junit4]   2> 12554 INFO  (TEST-CollectionsAPIDistributedZkTest.test-seed#[5C9BBE9138FC6616]) [n:127.0.0.1:40563_    ] o.a.s.c.CoresLocator Looking for core definitions underneath /home/jenkins/workspace/Lucene-Solr-trunk-Linux/solr/build/solr-core/test/J1/temp/solr.cloud.CollectionsAPIDistributedZkTest_5C9BBE9138FC6616-001/control-001/cores
   [junit4]   2> 12558 INFO  (TEST-CollectionsAPIDistributedZkTest.test-seed#[5C9BBE9138FC6616]) [n:127.0.0.1:40563_    ] o.a.s.c.SolrCore Created CoreDescriptor: {name=collection1, config=solrconfig.xml, transient=false, schema=schema.xml, loadOnStartup=true, configSetProperties=configsetprops.json, instanceDir=/home/jenkins/workspace/Lucene-Solr-trunk-Linux/solr/build/solr-core/test/J1/temp/solr.cloud.CollectionsAPIDistributedZkTest_5C9BBE9138FC6616-001/control-001/cores/collection1, collection=control_collection, absoluteInstDir=/home/jenkins/workspace/Lucene-Solr-trunk-Linux/solr/build/solr-core/test/J1/temp/solr.cloud.CollectionsAPIDistributedZkTest_5C9BBE9138FC6616-001/control-001/cores/collection1/, coreNodeName=, dataDir=data/, shard=}
   [junit4]   2> 12558 INFO  (TEST-CollectionsAPIDistributedZkTest.test-seed#[5C9BBE9138FC6616]) [n:127.0.0.1:40563_    ] o.a.s.c.CoresLocator Found core collection1 in /home/jenkins/workspace/Lucene-Solr-trunk-Linux/solr/build/solr-core/test/J1/temp/solr.cloud.CollectionsAPIDistributedZkTest_5C9BBE9138FC6616-001/control-001/cores/collection1/
   [junit4]   2> 12558 INFO  (TEST-CollectionsAPIDistributedZkTest.test-seed#[5C9BBE9138FC6616]) [n:127.0.0.1:40563_    ] o.a.s.c.CoresLocator Found 1 core definitions
   [junit4]   2> 12560 INFO  (TEST-CollectionsAPIDistributedZkTest.test-seed#[5C9BBE9138FC6616]) [n:127.0.0.1:40563_    ] o.a.s.s.SolrDispatchFilter user.dir=/home/jenkins/workspace/Lucene-Solr-trunk-Linux/solr/build/solr-core/test/J1
   [junit4]   2> 12560 INFO  (TEST-CollectionsAPIDistributedZkTest.test-seed#[5C9BBE9138FC6616]) [n:127.0.0.1:40563_    ] o.a.s.s.SolrDispatchFilter SolrDispatchFilter.init() done
   [junit4]   2> 12560 INFO  (coreLoadExecutor-57-thread-1-processing-n:127.0.0.1:40563_) [n:127.0.0.1:40563_ c:control_collection   x:collection1] o.a.s.c.ZkController publishing state=down
   [junit4]   2> 12560 INFO  (coreLoadExecutor-57-thread-1-processing-n:127.0.0.1:40563_) [n:127.0.0.1:40563_ c:control_collection   x:collection1] o.a.s.c.ZkController numShards not found on descriptor - reading it from system property
   [junit4]   2> 12567 INFO  (coreLoadExecutor-57-thread-1-processing-n:127.0.0.1:40563_) [n:127.0.0.1:40563_ c:control_collection   x:collection1] o.a.s.c.ZkController look for our core node name
   [junit4]   2> 12567 INFO  (OverseerStateUpdate-94846861437566982-127.0.0.1:40563_-n_0000000000) [n:127.0.0.1:40563_    ] o.a.s.c.Overseer processMessage: queueSize: 1, message = {
   [junit4]   2>   "core":"collection1",
   [junit4]   2>   "roles":null,
   [junit4]   2>   "base_url":"http://127.0.0.1:40563",
   [junit4]   2>   "node_name":"127.0.0.1:40563_",
   [junit4]   2>   "numShards":"1",
   [junit4]   2>   "state":"down",
   [junit4]   2>   "shard":null,
   [junit4]   2>   "collection":"control_collection",
   [junit4]   2>   "operation":"state"} current state version: 0
   [junit4]   2> 12574 INFO  (OverseerStateUpdate-94846861437566982-127.0.0.1:40563_-n_0000000000) [n:127.0.0.1:40563_    ] o.a.s.c.o.ReplicaMutator Update state numShards=1 message={
   [junit4]   2>   "core":"collection1",
   [junit4]   2>   "roles":null,
   [junit4]   2>   "base_url":"http://127.0.0.1:40563",
   [junit4]   2>   "node_name":"127.0.0.1:40563_",
   [junit4]   2>   "numShards":"1",
   [junit4]   2>   "state":"down",
   [junit4]   2>   "shard":null,
   [junit4]   2>   "collection":"control_collection",
   [junit4]   2>   "operation":"state"}
   [junit4]   2> 12576 INFO  (OverseerStateUpdate-94846861437566982-127.0.0.1:40563_-n_0000000000) [n:127.0.0.1:40563_    ] o.a.s.c.o.ClusterStateMutator building a new cName: control_collection
   [junit4]   2> 12582 INFO  (OverseerStateUpdate-94846861437566982-127.0.0.1:40563_-n_0000000000) [n:127.0.0.1:40563_    ] o.a.s.c.o.ReplicaMutator Assigning new node to shard shard=shard1
   [junit4]   2> 12585 INFO  (zkCallback-9-thread-1-processing-n:127.0.0.1:40563_) [n:127.0.0.1:40563_    ] o.a.s.c.c.ZkStateReader A cluster state change: WatchedEvent state:SyncConnected type:NodeDataChanged path:/clusterstate.json, has occurred - updating... (live nodes size: 1)
   [junit4]   2> 13567 INFO  (coreLoadExecutor-57-thread-1-processing-n:127.0.0.1:40563_) [n:127.0.0.1:40563_ c:control_collection   x:collection1] o.a.s.c.ZkController waiting to find shard id in clusterstate for collection1
   [junit4]   2> 13567 INFO  (coreLoadExecutor-57-thread-1-processing-n:127.0.0.1:40563_) [n:127.0.0.1:40563_ c:control_collection   x:collection1] o.a.s.c.ZkController Check for collection zkNode:control_collection
   [junit4]   2> 13568 INFO  (coreLoadExecutor-57-thread-1-processing-n:127.0.0.1:40563_) [n:127.0.0.1:40563_ c:control_collection   x:collection1] o.a.s.c.ZkController Collection zkNode exists
   [junit4]   2> 13568 INFO  (coreLoadExecutor-57-thread-1-processing-n:127.0.0.1:40563_) [n:127.0.0.1:40563_ c:control_collection   x:collection1] o.a.s.c.c.ZkStateReader Load collection config from:/collections/control_collection
   [junit4]   2> 13568 INFO  (coreLoadExecutor-57-thread-1-processing-n:127.0.0.1:40563_) [n:127.0.0.1:40563_ c:control_collection   x:collection1] o.a.s.c.c.ZkStateReader path=/collections/control_collection configName=conf1 specified config exists in ZooKeeper
   [junit4]   2> 13568 INFO  (coreLoadExecutor-57-thread-1-processing-n:127.0.0.1:40563_) [n:127.0.0.1:40563_ c:control_collection   x:collection1] o.a.s.c.SolrResourceLoader new SolrResourceLoader for directory: '/home/jenkins/workspace/Lucene-Solr-trunk-Linux/solr/build/solr-core/test/J1/temp/solr.cloud.CollectionsAPIDistributedZkTest_5C9BBE9138FC6616-001/control-001/cores/collection1/'
   [junit4]   2> 13569 INFO  (coreLoadExecutor-57-thread-1-processing-n:127.0.0.1:40563_) [n:127.0.0.1:40563_ c:control_collection   x:collection1] o.a.s.c.SolrResourceLoader JNDI not configured for solr (NoInitialContextEx)
   [junit4]   2> 13569 INFO  (coreLoadExecutor-57-thread-1-processing-n:127.0.0.1:40563_) [n:127.0.0.1:40563_ c:control_collection   x:collection1] o.a.s.c.SolrResourceLoader solr home defaulted to 'solr/' (could not find system property or JNDI)
   [junit4]   2> 13579 INFO  (coreLoadExecutor-57-thread-1-processing-n:127.0.0.1:40563_) [n:127.0.0.1:40563_ c:control_collection   x:collection1] o.a.s.c.Config loaded config solrconfig.xml with version 0
   [junit4]   2> 13584 INFO  (coreLoadExecutor-57-thread-1-processing-n:127.0.0.1:40563_) [n:127.0.0.1:40563_ c:control_collection   x:collection1] o.a.s.c.SolrConfig current version of requestparams : -1
   [junit4]   2> 13588 INFO  (coreLoadExecutor-57-thread-1-processing-n:127.0.0.1:40563_) [n:127.0.0.1:40563_ c:control_collection   x:collection1] o.a.s.c.SolrConfig Using Lucene MatchVersion: 6.0.0
   [junit4]   2> 13595 INFO  (coreLoadExecutor-57-thread-1-processing-n:127.0.0.1:40563_) [n:127.0.0.1:40563_ c:control_collection   x:collection1] o.a.s.c.Config Loaded SolrConfig: solrconfig.xml
   [junit4]   2> 13596 INFO  (coreLoadExecutor-57-thread-1-processing-n:127.0.0.1:40563_) [n:127.0.0.1:40563_ c:control_collection   x:collection1] o.a.s.s.IndexSchema Reading Solr Schema from /configs/conf1/schema.xml
   [junit4]   2> 13601 INFO  (coreLoadExecutor-57-thread-1-processing-n:127.0.0.1:40563_) [n:127.0.0.1:40563_ c:control_collection   x:collection1] o.a.s.s.IndexSchema [collection1] Schema name=test
   [junit4]   2> 13673 INFO  (coreLoadExecutor-57-thread-1-processing-n:127.0.0.1:40563_) [n:127.0.0.1:40563_ c:control_collection   x:collection1] o.a.s.s.OpenExchangeRatesOrgProvider Initialized with rates=open-exchange-rates.json, refreshInterval=1440.
   [junit4]   2> 13678 INFO  (coreLoadExecutor-57-thread-1-processing-n:127.0.0.1:40563_) [n:127.0.0.1:40563_ c:control_collection   x:collection1] o.a.s.s.IndexSchema default search field in schema is text
   [junit4]   2> 13679 INFO  (coreLoadExecutor-57-thread-1-processing-n:127.0.0.1:40563_) [n:127.0.0.1:40563_ c:control_collection   x:collection1] o.a.s.s.IndexSchema unique key field: id
   [junit4]   2> 13687 INFO  (coreLoadExecutor-57-thread-1-processing-n:127.0.0.1:40563_) [n:127.0.0.1:40563_ c:control_collection   x:collection1] o.a.s.s.FileExchangeRateProvider Reloading exchange rates from file currency.xml
   [junit4]   2> 13689 INFO  (coreLoadExecutor-57-thread-1-processing-n:127.0.0.1:40563_) [n:127.0.0.1:40563_ c:control_collection   x:collection1] o.a.s.s.FileExchangeRateProvider Reloading exchange rates from file currency.xml
   [junit4]   2> 13691 INFO  (coreLoadExecutor-57-thread-1-processing-n:127.0.0.1:40563_) [n:127.0.0.1:40563_ c:control_collection   x:collection1] o.a.s.s.OpenExchangeRatesOrgProvider Reloading exchange rates from open-exchange-rates.json
   [junit4]   2> 13691 WARN  (coreLoadExecutor-57-thread-1-processing-n:127.0.0.1:40563_) [n:127.0.0.1:40563_ c:control_collection   x:collection1] o.a.s.s.OpenExchangeRatesOrgProvider Unknown key IMPORTANT NOTE
   [junit4]   2> 13691 WARN  (coreLoadExecutor-57-thread-1-processing-n:127.0.0.1:40563_) [n:127.0.0.1:40563_ c:control_collection   x:collection1] o.a.s.s.OpenExchangeRatesOrgProvider Expected key, got STRING
   [junit4]   2> 13691 INFO  (coreLoadExecutor-57-thread-1-processing-n:127.0.0.1:40563_) [n:127.0.0.1:40563_ c:control_collection   x:collection1] o.a.s.s.OpenExchangeRatesOrgProvider Reloading exchange rates from open-exchange-rates.json
   [junit4]   2> 13692 WARN  (coreLoadExecutor-57-thread-1-processing-n:127.0.0.1:40563_) [n:127.0.0.1:40563_ c:control_collection   x:collection1] o.a.s.s.OpenExchangeRatesOrgProvider Unknown key IMPORTANT NOTE
   [junit4]   2> 13692 WARN  (coreLoadExecutor-57-thread-1-processing-n:127.0.0.1:40563_) [n:127.0.0.1:40563_ c:control_collection   x:collection1] o.a.s.s.OpenExchangeRatesOrgProvider Expected key, got STRING
   [junit4]   2> 13692 INFO  (coreLoadExecutor-57-thread-1-processing-n:127.0.0.1:40563_) [n:127.0.0.1:40563_ c:control_collection   x:collection1] o.a.s.c.ConfigSetProperties Did not find ConfigSet properties, assuming default properties: Can't find resource 'configsetprops.json' in classpath or '/configs/conf1', cwd=/home/jenkins/workspace/Lucene-Solr-trunk-Linux/solr/build/solr-core/test/J1
   [junit4]   2> 13692 INFO  (coreLoadExecutor-57-thread-1-processing-n:127.0.0.1:40563_) [n:127.0.0.1:40563_ c:control_collection   x:collection1] o.a.s.c.CoreContainer Creating SolrCore 'collection1' using configuration from collection control_collection
   [junit4]   2> 13692 INFO  (coreLoadExecutor-57-thread-1-processing-n:127.0.0.1:40563_) [n:127.0.0.1:40563_ c:control_collection s:shard1 r:core_node1 x:collection1] o.a.s.c.SolrCore org.apache.solr.core.MockDirectoryFactory
   [junit4]   2> 13693 INFO  (coreLoadExecutor-57-thread-1-processing-n:127.0.0.1:40563_) [n:127.0.0.1:40563_ c:control_collection s:shard1 r:core_node1 x:collection1] o.a.s.c.SolrCore [[collection1] ] Opening new SolrCore at [/home/jenkins/workspace/Lucene-Solr-trunk-Linux/solr/build/solr-core/test/J1/temp/solr.cloud.CollectionsAPIDistributedZkTest_5C9BBE9138FC6616-001/control-001/cores/collection1/], dataDir=[null]
   [junit4]   2> 13697 INFO  (coreLoadExecutor-57-thread-1-processing-n:127.0.0.1:40563_) [n:127.0.0.1:40563_ c:control_collection s:shard1 r:core_node1 x:collection1] o.a.s.c.JmxMonitoredMap JMX monitoring is enabled. Adding Solr mbeans to JMX Server: com.sun.jmx.mbeanserver.JmxMBeanServer@4f07fb06
   [junit4]   2> 13706 INFO  (coreLoadExecutor-57-thread-1-processing-n:127.0.0.1:40563_) [n:127.0.0.1:40563_ c:control_collection s:shard1 r:core_node1 x:collection1] o.a.s.c.CachingDirectoryFactory return new directory for /home/jenkins/workspace/Lucene-Solr-trunk-Linux/solr/build/solr-core/test/J1/temp/solr.cloud.CollectionsAPIDistributedZkTest_5C9BBE9138FC6616-001/control-001/cores/collection1/data
   [junit4]   2> 13707 INFO  (coreLoadExecutor-57-thread-1-processing-n:127.0.0.1:40563_) [n:127.0.0.1:40563_ c:control_collection s:shard1 r:core_node1 x:collection1] o.a.s.c.SolrCore New index directory detected: old=null new=/home/jenkins/workspace/Lucene-Solr-trunk-Linux/solr/build/solr-core/test/J1/temp/solr.cloud.CollectionsAPIDistributedZkTest_5C9BBE9138FC6616-001/control-001/cores/collection1/data/index/
   [junit4]   2> 13707 WARN  (coreLoadExecutor-57-thread-1-processing-n:127.0.0.1:40563_) [n:127.0.0.1:40563_ c:control_collection s:shard1 r:core_node1 x:collection1] o.a.s.c.SolrCore [collection1] Solr index directory '/home/jenkins/workspace/Lucene-Solr-trunk-Linux/solr/build/solr-core/test/J1/temp/solr.cloud.CollectionsAPIDistributedZkTest_5C9BBE9138FC6616-001/control-001/cores/collection1/data/index' doesn't exist. Creating new index...
   [junit4]   2> 13707 INFO  (coreLoadExecutor-57-thread-1-processing-n:127.0.0.1:40563_) [n:127.0.0.1:40563_ c:control_collection s:shard1 r:core_node1 x:collection1] o.a.s.c.CachingDirectoryFactory return new directory for /home/jenkins/workspace/Lucene-Solr-trunk-Linux/solr/build/solr-core/test/J1/temp/solr.cloud.CollectionsAPIDistributedZkTest_5C9BBE9138FC6616-001/control-001/cores/collection1/data/index
   [junit4]   2> 13707 INFO  (coreLoadExecutor-57-thread-1-processing-n:127.0.0.1:40563_) [n:127.0.0.1:40563_ c:control_collection s:shard1 r:core_node1 x:collection1] o.a.s.u.RandomMergePolicy RandomMergePolicy wrapping class org.apache.lucene.index.TieredMergePolicy: [TieredMergePolicy: maxMergeAtOnce=28, maxMergeAtOnceExplicit=45, maxMergedSegmentMB=79.298828125, floorSegmentMB=2.0390625, forceMergeDeletesPctAllowed=7.432992180664152, segmentsPerTier=27.0, maxCFSSegmentSizeMB=8.796093022207999E12, noCFSRatio=0.0
   [junit4]   2> 13709 INFO  (coreLoadExecutor-57-thread-1-processing-n:127.0.0.1:40563_) [n:127.0.0.1:40563_ c:control_collection s:shard1 r:core_node1 x:collection1] o.a.s.c.SolrCore SolrDeletionPolicy.onCommit: commits: num=1
   [junit4]   2> commit{dir=MockDirectoryWrapper(NRTCachingDirectory(RAMDirectory@4049bad lockFactory=org.apache.lucene.store.SingleInstanceLockFactory@12bc756; maxCacheMB=0.5361328125 maxMergeSizeMB=0.64453125)),segFN=segments_1,generation=1}
   [junit4]   2> 13709 INFO  (coreLoadExecutor-57-thread-1-processing-n:127.0.0.1:40563_) [n:127.0.0.1:40563_ c:control_collection s:shard1 r:core_node1 x:collection1] o.a.s.c.SolrCore newest commit generation = 1
   [junit4]   2> 13709 INFO  (OldIndexDirectoryCleanupThreadForCore-collection1) [n:127.0.0.1:40563_ c:control_collection s:shard1 r:core_node1 x:collection1] o.a.s.c.SolrCore Looking for old index directories to cleanup for core collection1 in /home/jenkins/workspace/Lucene-Solr-trunk-Linux/solr/build/solr-core/test/J1/temp/solr.cloud.CollectionsAPIDistributedZkTest_5C9BBE9138FC6616-001/control-001/cores/collection1/data/
   [junit4]   2> 13709 WARN  (OldIndexDirectoryCleanupThreadForCore-collection1) [n:127.0.0.1:40563_ c:control_collection s:shard1 r:core_node1 x:collection1] o.a.s.c.DirectoryFactory /home/jenkins/workspace/Lucene-Solr-trunk-Linux/solr/build/solr-core/test/J1/temp/solr.cloud.CollectionsAPIDistributedZkTest_5C9BBE9138FC6616-001/control-001/cores/collection1/data/ does not point to a valid data directory; skipping clean-up of old index directories.
   [junit4]   2> 13715 INFO  (coreLoadExecutor-57-thread-1-processing-n:127.0.0.1:40563_) [n:127.0.0.1:40563_ c:control_collection s:shard1 r:core_node1 x:collection1] o.a.s.u.p.UpdateRequestProcessorChain creating updateRequestProcessorChain "nodistrib"
   [junit4]   2> 13725 INFO  (coreLoadExecutor-57-thread-1-processing-n:127.0.0.1:40563_) [n:127.0.0.1:40563_ c:control_collection s:shard1 r:core_node1 x:collection1] o.a.s.u.p.UpdateRequestProcessorChain creating updateRequestProcessorChain "dedupe"
   [junit4]   2> 13727 INFO  (coreLoadExecutor-57-thread-1-processing-n:127.0.0.1:40563_) [n:127.0.0.1:40563_ c:control_collection s:shard1 r:core_node1 x:collection1] o.a.s.u.p.UpdateRequestProcessorChain inserting DistributedUpdateProcessorFactory into updateRequestProcessorChain "dedupe"
   [junit4]   2> 13727 INFO  (coreLoadExecutor-57-thread-1-processing-n:127.0.0.1:40563_) [n:127.0.0.1:40563_ c:control_collection s:shard1 r:core_node1 x:collection1] o.a.s.u.p.UpdateRequestProcessorChain creating updateRequestProcessorChain "stored_sig"
   [junit4]   2> 13727 INFO  (coreLoadExecutor-57-thread-1-processing-n:127.0.0.1:40563_) [n:127.0.0.1:40563_ c:control_collection s:shard1 r:core_node1 x:collection1] o.a.s.u.p.UpdateRequestProcessorChain inserting DistributedUpdateProcessorFactory into updateRequestProcessorChain "stored_sig"
   [junit4]   2> 13727 INFO  (coreLoadExecutor-57-thread-1-processing-n:127.0.0.1:40563_) [n:127.0.0.1:40563_ c:control_collection s:shard1 r:core_node1 x:collection1] o.a.s.u.p.UpdateRequestProcessorChain creating updateRequestProcessorChain "distrib-dup-test-chain-explicit"
   [junit4]   2> 13745 INFO  (coreLoadExecutor-57-thread-1-processing-n:127.0.0.1:40563_) [n:127.0.0.1:40563_ c:control_collection s:shard1 r:core_node1 x:collection1] o.a.s.u.p.UpdateRequestProcessorChain creating updateRequestProcessorChain "distrib-dup-test-chain-implicit"
   [junit4]   2> 13745 INFO  (coreLoadExecutor-57-thread-1-processing-n:127.0.0.1:40563_) [n:127.0.0.1:40563_ c:control_collection s:shard1 r:core_node1 x:collection1] o.a.s.u.p.UpdateRequestProcessorChain inserting DistributedUpdateProcessorFactory into updateRequestProcessorChain "distrib-dup-test-chain-implicit"
   [junit4]   2> 13745 INFO  (coreLoadExecutor-57-thread-1-processing-n:127.0.0.1:40563_) [n:127.0.0.1:40563_ c:control_collection s:shard1 r:core_node1 x:collection1] o.a.s.c.SolrCore no updateRequestProcessorChain defined as default, creating implicit default
   [junit4]   2> 13745 WARN  (coreLoadExecutor-57-thread-1-processing-n:127.0.0.1:40563_) [n:127.0.0.1:40563_ c:control_collection s:shard1 r:core_node1 x:collection1] o.a.s.c.RequestHandlers INVALID paramSet a in requestHandler {type = requestHandler,name = /dump,class = DumpRequestHandler,args = {defaults={a=A,b=B}}}
   [junit4]   2> 13747 INFO  (coreLoadExecutor-57-thread-1-processing-n:127.0.0.1:40563_) [n:127.0.0.1:40563_ c:control_collection s:shard1 r:core_node1 x:collection1] o.a.s.h.l.XMLLoader xsltCacheLifetimeSeconds=60
   [junit4]   2> 13751 INFO  (coreLoadExecutor-57-thread-1-processing-n:127.0.0.1:40563_) [n:127.0.0.1:40563_ c:control_collection s:shard1 r:core_node1 x:collection1] o.a.s.h.l.XMLLoader xsltCacheLifetimeSeconds=60
   [junit4]   2> 13752 INFO  (coreLoadExecutor-57-thread-1-processing-n:127.0.0.1:40563_) [n:127.0.0.1:40563_ c:control_collection s:shard1 r:core_node1 x:collection1] o.a.s.h.l.XMLLoader xsltCacheLifetimeSeconds=60
   [junit4]   2> 13753 INFO  (coreLoadExecutor-57-thread-1-processing-n:127.0.0.1:40563_) [n:127.0.0.1:40563_ c:control_collection s:shard1 r:core_node1 x:collection1] o.a.s.h.l.XMLLoader xsltCacheLifetimeSeconds=60
   [junit4]   2> 13764 INFO  (coreLoadExecutor-57-thread-1-processing-n:127.0.0.1:40563_) [n:127.0.0.1:40563_ c:control_collection s:shard1 r:core_node1 x:collection1] o.a.s.c.RequestHandlers Registered paths: /admin/mbeans,standard,/dump,/update/csv,/update/json/docs,/admin/luke,/admin/segments,/get,/admin/system,/replication,/admin/properties,/config,/schema,/admin/plugins,/admin/logging,/update/json,/admin/threads,/admin/ping,/update,/admin/file
   [junit4]   2> 13765 INFO  (coreLoadExecutor-57-thread-1-processing-n:127.0.0.1:40563_) [n:127.0.0.1:40563_ c:control_collection s:shard1 r:core_node1 x:collection1] o.a.s.c.SolrCore Using default statsCache cache: org.apache.solr.search.stats.LocalStatsCache
   [junit4]   2> 13768 INFO  (coreLoadExecutor-57-thread-1-processing-n:127.0.0.1:40563_) [n:127.0.0.1:40563_ c:control_collection s:shard1 r:core_node1 x:collection1] o.a.s.u.UpdateHandler Using UpdateLog implementation: org.apache.solr.update.UpdateLog
   [junit4]   2> 13768 INFO  (coreLoadExecutor-57-thread-1-processing-n:127.0.0.1:40563_) [n:127.0.0.1:40563_ c:control_collection s:shard1 r:core_node1 x:collection1] o.a.s.u.UpdateLog Initializing UpdateLog: dataDir= defaultSyncLevel=FLUSH numRecordsToKeep=100 maxNumLogsToKeep=10 numVersionBuckets=65536
   [junit4]   2> 13774 INFO  (coreLoadExecutor-57-thread-1-processing-n:127.0.0.1:40563_) [n:127.0.0.1:40563_ c:control_collection s:shard1 r:core_node1 x:collection1] o.a.s.c.SolrCore Hard AutoCommit: disabled
   [junit4]   2> 13774 INFO  (coreLoadExecutor-57-thread-1-processing-n:127.0.0.1:40563_) [n:127.0.0.1:40563_ c:control_collection s:shard1 r:core_node1 x:collection1] o.a.s.c.SolrCore Soft AutoCommit: disabled
   [junit4]   2> 13776 INFO  (coreLoadExecutor-57-thread-1-processing-n:127.0.0.1:40563_) [n:127.0.0.1:40563_ c:control_collection s:shard1 r:core_node1 x:collection1] o.a.s.u.RandomMergePolicy RandomMergePolicy wrapping class org.apache.lucene.index.AlcoholicMergePolicy: [AlcoholicMergePolicy: minMergeSize=0, mergeFactor=10, maxMergeSize=1373565281, maxMergeSizeForForcedMerge=9223372036854775807, calibrateSizeByDeletes=true, maxMergeDocs=2147483647, maxCFSSegmentSizeMB=8.796093022207999E12, noCFSRatio=0.1]
   [junit4]   2> 13776 INFO  (coreLoadExecutor-57-thread-1-processing-n:127.0.0.1:40563_) [n:127.0.0.1:40563_ c:control_collection s:shard1 r:core_node1 x:collection1] o.a.s.c.SolrCore SolrDeletionPolicy.onInit: commits: num=1
   [junit4]   2> commit{dir=MockDirectoryWrapper(NRTCachingDirectory(RAMDirectory@4049bad lockFactory=org.apache.lucene.store.SingleInstanceLockFactory@12bc756; maxCacheMB=0.5361328125 maxMergeSizeMB=0.64453125)),segFN=segments_1,generation=1}
   [junit4]   2> 13777 INFO  (coreLoadExecutor-57-thread-1-processing-n:127.0.0.1:40563_) [n:127.0.0.1:40563_ c:control_collection s:shard1 r:core_node1 x:collection1] o.a.s.c.SolrCore newest commit generation = 1
   [junit4]   2> 13777 INFO  (coreLoadExecutor-57-thread-1-processing-n:127.0.0.1:40563_) [n:127.0.0.1:40563_ c:control_collection s:shard1 r:core_node1 x:collection1] o.a.s.s.SolrIndexSearcher Opening Searcher@4c571ee4[collection1] main
   [junit4]   2> 13777 INFO  (coreLoadExecutor-57-thread-1-processing-n:127.0.0.1:40563_) [n:127.0.0.1:40563_ c:control_collection s:shard1 r:core_node1 x:collection1] o.a.s.c.c.ZkStateReader Load collection config from:/collections/control_collection
   [junit4]   2> 13778 INFO  (coreLoadExecutor-57-thread-1-processing-n:127.0.0.1:40563_) [n:127.0.0.1:40563_ c:control_collection s:shard1 r:core_node1 x:collection1] o.a.s.c.c.ZkStateReader path=/collections/control_collection configName=conf1 specified config exists in ZooKeeper
   [junit4]   2> 13778 INFO  (coreLoadExecutor-57-thread-1-processing-n:127.0.0.1:40563_) [n:127.0.0.1:40563_ c:control_collection s:shard1 r:core_node1 x:collection1] o.a.s.r.ManagedResourceStorage Setting up ZooKeeper-based storage for the RestManager with znodeBase: /configs/conf1
   [junit4]   2> 13779 INFO  (coreLoadExecutor-57-thread-1-processing-n:127.0.0.1:40563_) [n:127.0.0.1:40563_ c:control_collection s:shard1 r:core_node1 x:collection1] o.a.s.r.ManagedResourceStorage Configured ZooKeeperStorageIO with znodeBase: /configs/conf1
   [junit4]   2> 13779 INFO  (coreLoadExecutor-57-thread-1-processing-n:127.0.0.1:40563_) [n:127.0.0.1:40563_ c:control_collection s:shard1 r:core_node1 x:collection1] o.a.s.r.RestManager Initializing RestManager with initArgs: {}
   [junit4]   2> 13779 INFO  (coreLoadExecutor-57-thread-1-processing-n:127.0.0.1:40563_) [n:127.0.0.1:40563_ c:control_collection s:shard1 r:core_node1 x:collection1] o.a.s.r.ManagedResourceStorage Reading _rest_managed.json using ZooKeeperStorageIO:path=/configs/conf1
   [junit4]   2> 13780 INFO  (coreLoadExecutor-57-thread-1-processing-n:127.0.0.1:40563_) [n:127.0.0.1:40563_ c:control_collection s:shard1 r:core_node1 x:collection1] o.a.s.r.ManagedResourceStorage No data found for znode /configs/conf1/_rest_managed.json
   [junit4]   2> 13780 INFO  (coreLoadExecutor-57-thread-1-processing-n:127.0.0.1:40563_) [n:127.0.0.1:40563_ c:control_collection s:shard1 r:core_node1 x:collection1] o.a.s.r.ManagedResourceStorage Loaded null at path _rest_managed.json using ZooKeeperStorageIO:path=/configs/conf1
   [junit4]   2> 13780 INFO  (coreLoadExecutor-57-thread-1-processing-n:127.0.0.1:40563_) [n:127.0.0.1:40563_ c:control_collection s:shard1 r:core_node1 x:collection1] o.a.s.r.RestManager Initializing 0 registered ManagedResources
   [junit4]   2> 13783 INFO  (coreLoadExecutor-57-thread-1-processing-n:127.0.0.1:40563_) [n:127.0.0.1:40563_ c:control_collection s:shard1 r:core_node1 x:collection1] o.a.s.h.ReplicationHandler Commits will be reserved for  10000
   [junit4]   2> 13784 INFO  (searcherExecutor-58-thread-1-processing-n:127.0.0.1:40563_ x:collection1 s:shard1 c:control_collection r:core_node1) [n:127.0.0.1:40563_ c:control_collection s:shard1 r:core_node1 x:collection1] o.a.s.c.SolrCore [collection1] Registered new searcher Searcher@4c571ee4[collection1] main{ExitableDirectoryReader(UninvertingDirectoryReader())}
   [junit4]   2> 13785 INFO  (coreLoadExecutor-57-thread-1-processing-n:127.0.0.1:40563_) [n:127.0.0.1:40563_ c:control_collection s:shard1 r:core_node1 x:collection1] o.a.s.u.UpdateLog Looking up max value of version field to seed version buckets
   [junit4]   2> 13785 INFO  (coreLoadExecutor-57-thread-1-processing-n:127.0.0.1:40563_) [n:127.0.0.1:40563_ c:control_collection s:shard1 r:core_node1 x:collection1] o.a.s.u.VersionInfo Refreshing highest value of _version_ for 65536 version buckets from index
   [junit4]   2> 13785 INFO  (coreLoadExecutor-57-thread-1-processing-n:127.0.0.1:40563_) [n:127.0.0.1:40563_ c:control_collection s:shard1 r:core_node1 x:collection1] o.a.s.u.VersionInfo No terms found for _version_, cannot seed version bucket highest value from index
   [junit4]   2> 13785 INFO  (coreLoadExecutor-57-thread-1-processing-n:127.0.0.1:40563_) [n:127.0.0.1:40563_ c:control_collection s:shard1 r:core_node1 x:collection1] o.a.s.u.UpdateLog Could not find max version in index or recent updates, using new clock 1517549785326813184
   [junit4]   2> 13789 INFO  (coreLoadExecutor-57-thread-1-processing-n:127.0.0.1:40563_) [n:127.0.0.1:40563_ c:control_collection s:shard1 r:core_node1 x:collection1] o.a.s.u.UpdateLog Took 4.0ms to seed version buckets with highest version 1517549785326813184
   [junit4]   2> 13790 INFO  (coreLoadExecutor-57-thread-1-processing-n:127.0.0.1:40563_) [n:127.0.0.1:40563_ c:control_collection s:shard1 r:core_node1 x:collection1] o.a.s.c.ZkController watch zkdir /configs/conf1
   [junit4]   2> 13791 INFO  (coreLoadExecutor-57-thread-1-processing-n:127.0.0.1:40563_) [n:127.0.0.1:40563_ c:control_collection s:shard1 r:core_node1 x:collection1] o.a.s.c.CoreContainer registering core: collection1
   [junit4]   2> 13792 INFO  (coreZkRegister-51-thread-1-processing-n:127.0.0.1:40563_ x:collection1 s:shard1 c:control_collection r:core_node1) [n:127.0.0.1:40563_ c:control_collection s:shard1 r:core_node1 x:collection1] o.a.s.c.ZkController Register replica - core:collection1 address:http://127.0.0.1:40563 collection:control_collection shard:shard1
   [junit4]   2> 13797 INFO  (coreZkRegister-51-thread-1-processing-n:127.0.0.1:40563_ x:collection1 s:shard1 c:control_collection r:core_node1) [n:127.0.0.1:40563_ c:control_collection s:shard1 r:core_node1 x:collection1] o.a.s.c.c.SolrZkClient makePath: /collections/control_collection/leader_elect/shard1/election
   [junit4]   2> 13800 INFO  (coreZkRegister-51-thread-1-processing-n:127.0.0.1:40563_ x:collection1 s:shard1 c:control_collection r:core_node1) [n:127.0.0.1:40563_ c:control_collection s:shard1 r:core_node1 x:collection1] o.a.s.c.LeaderElector Joined leadership election with path: /collections/control_collection/leader_elect/shard1/election/94846861437566982-core_node1-n_0000000000
   [junit4]   2> 13801 INFO  (coreZkRegister-51-thread-1-processing-n:127.0.0.1:40563_ x:collection1 s:shard1 c:control_collection r:core_node1) [n:127.0.0.1:40563_ c:control_collection s:shard1 r:core_node1 x:collection1] o.a.s.c.ShardLeaderElectionContext Running the leader process for shard shard1
   [junit4]   2> 13802 INFO  (coreZkRegister-51-thread-1-processing-n:127.0.0.1:40563_ x:collection1 s:shard1 c:control_collection r:core_node1) [n:127.0.0.1:40563_ c:control_collection s:shard1 r:core_node1 x:collection1] o.a.s.c.ShardLeaderElectionContext Enough replicas found to continue.
   [junit4]   2> 13802 INFO  (coreZkRegister-51-thread-1-processing-n:127.0.0.1:40563_ x:collection1 s:shard1 c:control_collection r:core_node1) [n:127.0.0.1:40563_ c:control_collection s:shard1 r:core_node1 x:collection1] o.a.s.c.ShardLeaderElectionContext I may be the new leader - try and sync
   [junit4]   2> 13803 INFO  (OverseerStateUpdate-94846861437566982-127.0.0.1:40563_-n_0000000000) [n:127.0.0.1:40563_    ] o.a.s.c.Overseer processMessage: queueSize: 1, message = {
   [junit4]   2>   "operation":"leader",
   [junit4]   2>   "shard":"shard1",
   [junit4]   2>   "collection":"control_collection"} current state version: 1
   [junit4]   2> 13803 INFO  (coreZkRegister-51-thread-1-processing-n:127.0.0.1:40563_ x:collection1 s:shard1 c:control_collection r:core_node1) [n:127.0.0.1:40563_ c:control_collection s:shard1 r:core_node1 x:collection1] o.a.s.c.SyncStrategy Sync replicas to http://127.0.0.1:40563/collection1/
   [junit4]   2> 13803 INFO  (coreZkRegister-51-thread-1-processing-n:127.0.0.1:40563_ x:collection1 s:shard1 c:control_collection r:core_node1) [n:127.0.0.1:40563_ c:control_collection s:shard1 r:core_node1 x:collection1] o.a.s.c.SyncStrategy Sync Success - now sync replicas to me
   [junit4]   2> 13803 INFO  (coreZkRegister-51-thread-1-processing-n:127.0.0.1:40563_ x:collection1 s:shard1 c:control_collection r:core_node1) [n:127.0.0.1:40563_ c:control_collection s:shard1 r:core_node1 x:collection1] o.a.s.c.SyncStrategy http://127.0.0.1:40563/collection1/ has no replicas
   [junit4]   2> 13804 INFO  (coreZkRegister-51-thread-1-processing-n:127.0.0.1:40563_ x:collection1 s:shard1 c:control_collection r:core_node1) [n:127.0.0.1:40563_ c:control_collection s:shard1 r:core_node1 x:collection1] o.a.s.c.ShardLeaderElectionContext I am the new leader: http://127.0.0.1:40563/collection1/ shard1
   [junit4]   2> 13806 INFO  (coreZkRegister-51-thread-1-processing-n:127.0.0.1:40563_ x:collection1 s:shard1 c:control_collection r:core_node1) [n:127.0.0.1:40563_ c:control_collection s:shard1 r:core_node1 x:collection1] o.a.s.c.c.SolrZkClient makePath: /collections/control_collection/leaders/shard1
   [junit4]   2> 13810 INFO  (coreZkRegister-51-thread-1-processing-n:127.0.0.1:40563_ x:collection1 s:shard1 c:control_collection r:core_node1) [n:127.0.0.1:40563_ c:control_collection s:shard1 r:core_node1 x:collection1] o.a.s.c.ShardLeaderElectionContextBase Creating leader registration node
   [junit4]   2> 13839 INFO  (OverseerStateUpdate-94846861437566982-127.0.0.1:40563_-n_0000000000) [n:127.0.0.1:40563_    ] o.a.s.c.Overseer processMessage: queueSize: 1, message = {
   [junit4]   2>   "operation":"state",
   [junit4]   2>   "state":"active",
   [junit4]   2>   "shard":"shard1",
   [junit4]   2>   "collection":"control_collection",
   [junit4]   2>   "base_url":"http://127.0.0.1:40563",
   [junit4]   2>   "node_name":"127.0.0.1:40563_",
   [junit4]   2>   "core_node_name":"core_node1",
   [junit4]   2>   "core":"collection1"} current state version: 1
   [junit4]   2> 13839 INFO  (OverseerStateUpdate-94846861437566982-127.0.0.1:40563_-n_0000000000) [n:127.0.0.1:40563_    ] o.a.s.c.o.ReplicaMutator Update state numShards=null message={
   [junit4]   2>   "operation":"state",
   [junit4]   2>   "state":"active",
   [junit4]   2>   "shard":"shard1",
   [junit4]   2>   "collection":"control_collection",
   [junit4]   2>   "base_url":"http://127.0.0.1:40563",
   [junit4]   2>   "node_name":"127.0.0.1:40563_",
   [junit4]   2>   "core_node_name":"core_node1",
   [junit4]   2>   "core":"collection1"}
   [junit4]   2> 13841 INFO  (OverseerStateUpdate-94846861437566982-127.0.0.1:40563_-n_0000000000) [n:127.0.0.1:40563_    ] o.a.s.c.Overseer processMessage: queueSize: 1, message = {
   [junit4]   2>   "operation":"leader",
   [junit4]   2>   "shard":"shard1",
   [junit4]   2>   "collection":"control_collection",
   [junit4]   2>   "base_url":"http://127.0.0.1:40563",
   [junit4]   2>   "core":"collection1"} current state version: 1
   [junit4]   2> 13943 INFO  (zkCallback-9-thread-2-processing-n:127.0.0.1:40563_) [n:127.0.0.1:40563_    ] o.a.s.c.c.ZkStateReader A cluster state change: WatchedEvent state:SyncConnected type:NodeDataChanged path:/clusterstate.json, has occurred - updating... (live nodes size: 1)
   [junit4]   2> 13991 INFO  (coreZkRegister-51-thread-1-processing-n:127.0.0.1:40563_ x:collection1 s:shard1 c:control_collection r:core_node1) [n:127.0.0.1:40563_ c:control_collection s:shard1 r:core_node1 x:collection1] o.a.s.c.ZkController We are http://127.0.0.1:40563/collection1/ and leader is http://127.0.0.1:40563/collection1/
   [junit4]   2> 13991 INFO  (coreZkRegister-51-thread-1-processing-n:127.0.0.1:40563_ x:collection1 s:shard1 c:control_collection r:core_node1) [n:127.0.0.1:40563_ c:control_collection s:shard1 r:core_node1 x:collection1] o.a.s.c.ZkController No LogReplay needed for core=collection1 baseURL=http://127.0.0.1:40563
   [junit4]   2> 13991 INFO  (coreZkRegister-51-thread-1-processing-n:127.0.0.1:40563_ x:collection1 s:shard1 c:control_collection r:core_node1) [n:127.0.0.1:40563_ c:control_collection s:shard1 r:core_node1 x:collection1] o.a.s.c.ZkController I am the leader, no recovery necessary
   [junit4]   2> 13991 INFO  (coreZkRegister-51-thread-1-processing-n:127.0.0.1:40563_ x:collection1 s:shard1 c:control_collection r:core_node1) [n:127.0.0.1:40563_ c:control_collection s:shard1 r:core_node1 x:collection1] o.a.s.c.ZkController publishing state=active
   [junit4]   2> 13991 INFO  (coreZkRegister-51-thread-1-processing-n:127.0.0.1:40563_ x:collection1 s:shard1 c:control_collection r:core_node1) [n:127.0.0.1:40563_ c:control_collection s:shard1 r:core_node1 x:collection1] o.a.s.c.ZkController numShards not found on descriptor - reading it from system property
   [junit4]   2> 13993 INFO  (OverseerStateUpdate-94846861437566982-127.0.0.1:40563_-n_0000000000) [n:127.0.0.1:40563_    ] o.a.s.c.Overseer processMessage: queueSize: 1, message = {
   [junit4]   2>   "core":"collection1",
   [junit4]   2>   "core_node_name":"core_node1",
   [junit4]   2>   "roles":null,
   [junit4]   2>   "base_url":"http://127.0.0.1:40563",
   [junit4]   2>   "node_name":"127.0.0.1:40563_",
   [junit4]   2>   "numShards":"1",
   [junit4]   2>   "state":"active",
   [junit4]   2>   "shard":"shard1",
   [junit4]   2>   "collection":"control_collection",
   [junit4]   2>   "operation":"state"} current state version: 2
   [junit4]   2> 13993 INFO  (OverseerStateUpdate-94846861437566982-127.0.0.1:40563_-n_0000000000) [n:127.0.0.1:40563_    ] o.a.s.c.o.ReplicaMutator Update state numShards=1 message={
   [junit4]   2>   "core":"collection1",
   [junit4]   2>   "core_node_name":"core_node1",
   [junit4]   2>   "roles":null,
   [junit4]   2>   "base_url":"http://127.0.0.1:40563",
   [junit4]   2>   "node_name":"127.0.0.1:40563_",
   [junit4]   2>   "numShards":"1",
   [junit4]   2>   "state":"active",
   [junit4]   2>   "shard":"shard1",
   [junit4]   2>   "collection":"control_collection",
   [junit4]   2>   "operation":"state"}
   [junit4]   2> 14077 INFO  (TEST-CollectionsAPIDistributedZkTest.test-seed#[5C9BBE9138FC6616]) [    ] o.a.s.c.c.SolrZkClient Using default ZkCredentialsProvider
   [junit4]   2> 14077 INFO  (TEST-CollectionsAPIDistributedZkTest.test-seed#[5C9BBE9138FC6616]) [    ] o.a.s.c.c.ConnectionManager Waiting for client to connect to ZooKeeper
   [junit4]   2> 14079 INFO  (zkCallback-11-thread-1) [    ] o.a.s.c.c.ConnectionManager Watcher org.apache.solr.common.cloud.ConnectionManager@24117069 name:ZooKeeperConnection Watcher:127.0.0.1:48848/solr got event WatchedEvent state:SyncConnected type:None path:null path:null type:None
   [junit4]   2> 14079 INFO  (TEST-CollectionsAPIDistributedZkTest.test-seed#[5C9BBE9138FC6616]) [    ] o.a.s.c.c.ConnectionManager Client is connected to ZooKeeper
   [junit4]   2> 14080 INFO  (TEST-CollectionsAPIDistributedZkTest.test-seed#[5C9BBE9138FC6616]) [    ] o.a.s.c.c.SolrZkClient Using default ZkACLProvider
   [junit4]   2> 14080 INFO  (TEST-CollectionsAPIDistributedZkTest.test-seed#[5C9BBE9138FC6616]) [    ] o.a.s.c.c.ZkStateReader Updating cluster state from ZooKeeper...
   [junit4]   2> 14082 INFO  (TEST-CollectionsAPIDistributedZkTest.test-seed#[5C9BBE9138FC6616]) [    ] o.a.s.c.ChaosMonkey monkey: init - expire sessions:false cause connection loss:false
   [junit4]   2> 14082 INFO  (TEST-CollectionsAPIDistributedZkTest.test-seed#[5C9BBE9138FC6616]) [    ] o.a.s.c.AbstractFullDistribZkTestBase Creating collection1 with stateFormat=2
   [junit4]   2> 14082 INFO  (TEST-CollectionsAPIDistributedZkTest.test-seed#[5C9BBE9138FC6616]) [    ] o.a.s.c.c.SolrZkClient Using default ZkCredentialsProvider
   [junit4]   2> 14083 INFO  (TEST-CollectionsAPIDistributedZkTest.test-seed#[5C9BBE9138FC6616]) [    ] o.a.s.c.c.ConnectionManager Waiting for client to connect to ZooKeeper
   [junit4]   2> 14084 INFO  (zkCallback-12-thread-1) [    ] o.a.s.c.c.ConnectionManager Watcher org.apache.solr.common.cloud.ConnectionManager@45c4d583 name:ZooKeeperConnection Watcher:127.0.0.1:48848/solr got event WatchedEvent state:SyncConnected type:None path:null path:null type:None
   [junit4]   2> 14084 INFO  (TEST-CollectionsAPIDistributedZkTest.test-seed#[5C9BBE9138FC6616]) [    ] o.a.s.c.c.ConnectionManager Client is connected to ZooKeeper
   [junit4]   2> 14084 INFO  (TEST-CollectionsAPIDistributedZkTest.test-seed#[5C9BBE9138FC6616]) [    ] o.a.s.c.c.SolrZkClient Using default ZkACLProvider
   [junit4]   2> 14087 WARN  (NIOServerCxn.Factory:0.0.0.0/0.0.0.0:0) [    ] o.a.z.s.NIOServerCnxn caught end of stream exception
   [junit4]   2> EndOfStreamException: Unable to read additional data from client sessionid 0x150f6b7cc0c0008, likely client has closed socket
   [junit4]   2> at org.apache.zookeeper.server.NIOServerCnxn.doIO(NIOServerCnxn.java:228)
   [junit4]   2> at org.apache.zookeeper.server.NIOServerCnxnFactory.run(NIOServerCnxnFactory.java:208)
   [junit4]   2> at java.lang.Thread.run(Thread.java:745)
   [junit4]   2> 14087 INFO  (OverseerStateUpdate-94846861437566982-127.0.0.1:40563_-n_0000000000) [n:127.0.0.1:40563_    ] o.a.s.c.Overseer processMessage: queueSize: 1, message = {
   [junit4]   2>   "operation":"create",
   [junit4]   2>   "name":"collection1",
   [junit4]   2>   "numShards":"2",
   [junit4]   2>   "stateFormat":"2"} current state version: 2
   [junit4]   2> 14087 INFO  (OverseerStateUpdate-94846861437566982-127.0.0.1:40563_-n_0000000000) [n:127.0.0.1:40563_    ] o.a.s.c.o.ClusterStateMutator building a new cName: collection1
   [junit4]   2> 14088 INFO  (zkCallback-9-thread-2-processing-n:127.0.0.1:40563_) [n:127.0.0.1:40563_    ] o.a.s.c.c.ZkStateReader A cluster state change: WatchedEvent state:SyncConnected type:NodeDataChanged path:/clusterstate.json, has occurred - updating... (live nodes size: 1)
   [junit4]   2> 14088 INFO  (zkCallback-11-thread-1) [    ] o.a.s.c.c.ZkStateReader A cluster state change: WatchedEvent state:SyncConnected type:NodeDataChanged path:/clusterstate.json, has occurred - updating... (live nodes size: 1)
   [junit4]   2> 14144 INFO  (TEST-CollectionsAPIDistributedZkTest.test-seed#[5C9BBE9138FC6616]) [    ] o.a.s.SolrTestCaseJ4 Writing core.properties file to /home/jenkins/workspace/Lucene-Solr-trunk-Linux/solr/build/solr-core/test/J1/temp/solr.cloud.CollectionsAPIDistributedZkTest_5C9BBE9138FC6616-001/shard-1-001/cores/collection1
   [junit4]   2> 14145 INFO  (TEST-CollectionsAPIDistributedZkTest.test-seed#[5C9BBE9138FC6616]) [    ] o.a.s.c.AbstractFullDistribZkTestBase create jetty 1 in directory /home/jenkins/workspace/Lucene-Solr-trunk-Linux/solr/build/solr-core/test/J1/temp/solr.cloud.CollectionsAPIDistributedZkTest_5C9BBE9138FC6616-001/shard-1-001
   [junit4]   2> 14146 INFO  (TEST-CollectionsAPIDistributedZkTest.test-seed#[5C9BBE9138FC6616]) [    ] o.e.j.s.Server jetty-9.2.13.v20150730
   [junit4]   2> 14151 INFO  (TEST-CollectionsAPIDistributedZkTest.test-seed#[5C9BBE9138FC6616]) [    ] o.e.j.s.h.ContextHandler Started o.e.j.s.ServletContextHandler@77e8a3bb{/,null,AVAILABLE}
   [junit4]   2> 14152 INFO  (TEST-CollectionsAPIDistributedZkTest.test-seed#[5C9BBE9138FC6616]) [    ] o.e.j.s.ServerConnector Started ServerConnect

[...truncated too long message...]

): {}, docValues:{}, sim=ClassicSimilarity, locale=sv_SE, timezone=Africa/Blantyre
   [junit4]   2> NOTE: Linux 3.19.0-31-generic amd64/Oracle Corporation 1.8.0_66 (64-bit)/cpus=12,threads=5,free=217795544,total=402653184
   [junit4]   2> NOTE: All tests run in this JVM: [SuggestComponentTest, CollectionsAPIDistributedZkTest]
   [junit4]   2> NOTE: reproduce with: ant test  -Dtestcase=CollectionsAPIDistributedZkTest -Dtests.seed=5C9BBE9138FC6616 -Dtests.multiplier=3 -Dtests.slow=true -Dtests.locale=sv_SE -Dtests.timezone=Africa/Blantyre -Dtests.asserts=true -Dtests.file.encoding=ISO-8859-1
   [junit4] ERROR   0.00s J1 | CollectionsAPIDistributedZkTest (suite) <<<
   [junit4]    > Throwable #1: com.carrotsearch.randomizedtesting.ThreadLeakError: 5 threads leaked from SUITE scope at org.apache.solr.cloud.CollectionsAPIDistributedZkTest:
   [junit4]    >    1) Thread[id=933, name=zkCallback-36-thread-3, state=TIMED_WAITING, group=TGRP-CollectionsAPIDistributedZkTest]
   [junit4]    >         at sun.misc.Unsafe.park(Native Method)
   [junit4]    >         at java.util.concurrent.locks.LockSupport.parkNanos(LockSupport.java:215)
   [junit4]    >         at java.util.concurrent.SynchronousQueue$TransferStack.awaitFulfill(SynchronousQueue.java:460)
   [junit4]    >         at java.util.concurrent.SynchronousQueue$TransferStack.transfer(SynchronousQueue.java:362)
   [junit4]    >         at java.util.concurrent.SynchronousQueue.poll(SynchronousQueue.java:941)
   [junit4]    >         at java.util.concurrent.ThreadPoolExecutor.getTask(ThreadPoolExecutor.java:1066)
   [junit4]    >         at java.util.concurrent.ThreadPoolExecutor.runWorker(ThreadPoolExecutor.java:1127)
   [junit4]    >         at java.util.concurrent.ThreadPoolExecutor$Worker.run(ThreadPoolExecutor.java:617)
   [junit4]    >         at java.lang.Thread.run(Thread.java:745)
   [junit4]    >    2) Thread[id=258, name=zkCallback-36-thread-1, state=TIMED_WAITING, group=TGRP-CollectionsAPIDistributedZkTest]
   [junit4]    >         at sun.misc.Unsafe.park(Native Method)
   [junit4]    >         at java.util.concurrent.locks.LockSupport.parkNanos(LockSupport.java:215)
   [junit4]    >         at java.util.concurrent.SynchronousQueue$TransferStack.awaitFulfill(SynchronousQueue.java:460)
   [junit4]    >         at java.util.concurrent.SynchronousQueue$TransferStack.transfer(SynchronousQueue.java:362)
   [junit4]    >         at java.util.concurrent.SynchronousQueue.poll(SynchronousQueue.java:941)
   [junit4]    >         at java.util.concurrent.ThreadPoolExecutor.getTask(ThreadPoolExecutor.java:1066)
   [junit4]    >         at java.util.concurrent.ThreadPoolExecutor.runWorker(ThreadPoolExecutor.java:1127)
   [junit4]    >         at java.util.concurrent.ThreadPoolExecutor$Worker.run(ThreadPoolExecutor.java:617)
   [junit4]    >         at java.lang.Thread.run(Thread.java:745)
   [junit4]    >    3) Thread[id=256, name=TEST-CollectionsAPIDistributedZkTest.test-seed#[5C9BBE9138FC6616]-SendThread(127.0.0.1:48848), state=TIMED_WAITING, group=TGRP-CollectionsAPIDistributedZkTest]
   [junit4]    >         at java.lang.Thread.sleep(Native Method)
   [junit4]    >         at org.apache.zookeeper.ClientCnxn$SendThread.run(ClientCnxn.java:994)
   [junit4]    >    4) Thread[id=257, name=TEST-CollectionsAPIDistributedZkTest.test-seed#[5C9BBE9138FC6616]-EventThread, state=WAITING, group=TGRP-CollectionsAPIDistributedZkTest]
   [junit4]    >         at sun.misc.Unsafe.park(Native Method)
   [junit4]    >         at java.util.concurrent.locks.LockSupport.park(LockSupport.java:175)
   [junit4]    >         at java.util.concurrent.locks.AbstractQueuedSynchronizer$ConditionObject.await(AbstractQueuedSynchronizer.java:2039)
   [junit4]    >         at java.util.concurrent.LinkedBlockingQueue.take(LinkedBlockingQueue.java:442)
   [junit4]    >         at org.apache.zookeeper.ClientCnxn$EventThread.run(ClientCnxn.java:494)
   [junit4]    >    5) Thread[id=932, name=zkCallback-36-thread-2, state=TIMED_WAITING, group=TGRP-CollectionsAPIDistributedZkTest]
   [junit4]    >         at sun.misc.Unsafe.park(Native Method)
   [junit4]    >         at java.util.concurrent.locks.LockSupport.parkNanos(LockSupport.java:215)
   [junit4]    >         at java.util.concurrent.SynchronousQueue$TransferStack.awaitFulfill(SynchronousQueue.java:460)
   [junit4]    >         at java.util.concurrent.SynchronousQueue$TransferStack.transfer(SynchronousQueue.java:362)
   [junit4]    >         at java.util.concurrent.SynchronousQueue.poll(SynchronousQueue.java:941)
   [junit4]    >         at java.util.concurrent.ThreadPoolExecutor.getTask(ThreadPoolExecutor.java:1066)
   [junit4]    >         at java.util.concurrent.ThreadPoolExecutor.runWorker(ThreadPoolExecutor.java:1127)
   [junit4]    >         at java.util.concurrent.ThreadPoolExecutor$Worker.run(ThreadPoolExecutor.java:617)
   [junit4]    >         at java.lang.Thread.run(Thread.java:745)
   [junit4]    > at __randomizedtesting.SeedInfo.seed([5C9BBE9138FC6616]:0)Throwable #2: com.carrotsearch.randomizedtesting.ThreadLeakError: There are still zombie threads that couldn't be terminated:
   [junit4]    >    1) Thread[id=933, name=zkCallback-36-thread-3, state=TIMED_WAITING, group=TGRP-CollectionsAPIDistributedZkTest]
   [junit4]    >         at sun.misc.Unsafe.park(Native Method)
   [junit4]    >         at java.util.concurrent.locks.LockSupport.parkNanos(LockSupport.java:215)
   [junit4]    >         at java.util.concurrent.SynchronousQueue$TransferStack.awaitFulfill(SynchronousQueue.java:460)
   [junit4]    >         at java.util.concurrent.SynchronousQueue$TransferStack.transfer(SynchronousQueue.java:362)
   [junit4]    >         at java.util.concurrent.SynchronousQueue.poll(SynchronousQueue.java:941)
   [junit4]    >         at java.util.concurrent.ThreadPoolExecutor.getTask(ThreadPoolExecutor.java:1066)
   [junit4]    >         at java.util.concurrent.ThreadPoolExecutor.runWorker(ThreadPoolExecutor.java:1127)
   [junit4]    >         at java.util.concurrent.ThreadPoolExecutor$Worker.run(ThreadPoolExecutor.java:617)
   [junit4]    >         at java.lang.Thread.run(Thread.java:745)
   [junit4]    >    2) Thread[id=258, name=zkCallback-36-thread-1, state=TIMED_WAITING, group=TGRP-CollectionsAPIDistributedZkTest]
   [junit4]    >         at sun.misc.Unsafe.park(Native Method)
   [junit4]    >         at java.util.concurrent.locks.LockSupport.parkNanos(LockSupport.java:215)
   [junit4]    >         at java.util.concurrent.SynchronousQueue$TransferStack.awaitFulfill(SynchronousQueue.java:460)
   [junit4]    >         at java.util.concurrent.SynchronousQueue$TransferStack.transfer(SynchronousQueue.java:362)
   [junit4]    >         at java.util.concurrent.SynchronousQueue.poll(SynchronousQueue.java:941)
   [junit4]    >         at java.util.concurrent.ThreadPoolExecutor.getTask(ThreadPoolExecutor.java:1066)
   [junit4]    >         at java.util.concurrent.ThreadPoolExecutor.runWorker(ThreadPoolExecutor.java:1127)
   [junit4]    >         at java.util.concurrent.ThreadPoolExecutor$Worker.run(ThreadPoolExecutor.java:617)
   [junit4]    >         at java.lang.Thread.run(Thread.java:745)
   [junit4]    >    3) Thread[id=256, name=TEST-CollectionsAPIDistributedZkTest.test-seed#[5C9BBE9138FC6616]-SendThread(127.0.0.1:48848), state=TIMED_WAITING, group=TGRP-CollectionsAPIDistributedZkTest]
   [junit4]    >         at java.lang.Thread.sleep(Native Method)
   [junit4]    >         at org.apache.zookeeper.ClientCnxn$SendThread.run(ClientCnxn.java:994)
   [junit4]    >    4) Thread[id=932, name=zkCallback-36-thread-2, state=TIMED_WAITING, group=TGRP-CollectionsAPIDistributedZkTest]
   [junit4]    >         at sun.misc.Unsafe.park(Native Method)
   [junit4]    >         at java.util.concurrent.locks.LockSupport.parkNanos(LockSupport.java:215)
   [junit4]    >         at java.util.concurrent.SynchronousQueue$TransferStack.awaitFulfill(SynchronousQueue.java:460)
   [junit4]    >         at java.util.concurrent.SynchronousQueue$TransferStack.transfer(SynchronousQueue.java:362)
   [junit4]    >         at java.util.concurrent.SynchronousQueue.poll(SynchronousQueue.java:941)
   [junit4]    >         at java.util.concurrent.ThreadPoolExecutor.getTask(ThreadPoolExecutor.java:1066)
   [junit4]    >         at java.util.concurrent.ThreadPoolExecutor.runWorker(ThreadPoolExecutor.java:1127)
   [junit4]    >         at java.util.concurrent.ThreadPoolExecutor$Worker.run(ThreadPoolExecutor.java:617)
   [junit4]    >         at java.lang.Thread.run(Thread.java:745)
   [junit4]    > at __randomizedtesting.SeedInfo.seed([5C9BBE9138FC6616]:0)
   [junit4] Completed [34/556] on J1 in 96.71s, 1 test, 3 errors <<< FAILURES!

[...truncated 1666 lines...]
BUILD FAILED
/home/jenkins/workspace/Lucene-Solr-trunk-Linux/build.xml:775: The following error occurred while executing this line:
/home/jenkins/workspace/Lucene-Solr-trunk-Linux/build.xml:719: The following error occurred while executing this line:
/home/jenkins/workspace/Lucene-Solr-trunk-Linux/build.xml:59: The following error occurred while executing this line:
/home/jenkins/workspace/Lucene-Solr-trunk-Linux/solr/build.xml:233: The following error occurred while executing this line:
/home/jenkins/workspace/Lucene-Solr-trunk-Linux/solr/common-build.xml:516: The following error occurred while executing this line:
/home/jenkins/workspace/Lucene-Solr-trunk-Linux/lucene/common-build.xml:1432: The following error occurred while executing this line:
/home/jenkins/workspace/Lucene-Solr-trunk-Linux/lucene/common-build.xml:987: There were test failures: 556 suites (8 ignored), 2207 tests, 2 suite-level errors, 1 error, 1433 ignored (58 assumptions) [seed: 5C9BBE9138FC6616]

Total time: 39 minutes 33 seconds
Build step 'Invoke Ant' marked build as failure
Archiving artifacts
[WARNINGS] Skipping publisher since build result is FAILURE
Recording test results
Email was triggered for: Failure - Any
Sending email for trigger: Failure - Any




---------------------------------------------------------------------
To unsubscribe, e-mail: [hidden email]
For additional commands, e-mail: [hidden email]