[JENKINS] Lucene-Solr-trunk-MacOSX (64bit/jdk1.7.0) - Build # 756 - Failure!

classic Classic list List threaded Threaded
2 messages Options
Reply | Threaded
Open this post in threaded view
|

[JENKINS] Lucene-Solr-trunk-MacOSX (64bit/jdk1.7.0) - Build # 756 - Failure!

Policeman Jenkins Server-2
Build: http://jenkins.thetaphi.de/job/Lucene-Solr-trunk-MacOSX/756/
Java: 64bit/jdk1.7.0 -XX:+UseCompressedOops -XX:+UseG1GC

No tests ran.

Build Log:
[...truncated 9924 lines...]
FATAL: hudson.remoting.RequestAbortedException: java.io.IOException: Unexpected termination of the channel
hudson.remoting.RequestAbortedException: hudson.remoting.RequestAbortedException: java.io.IOException: Unexpected termination of the channel
        at hudson.remoting.RequestAbortedException.wrapForRethrow(RequestAbortedException.java:41)
        at hudson.remoting.RequestAbortedException.wrapForRethrow(RequestAbortedException.java:34)
        at hudson.remoting.Request.call(Request.java:174)
        at hudson.remoting.Channel.call(Channel.java:714)
        at hudson.remoting.RemoteInvocationHandler.invoke(RemoteInvocationHandler.java:167)
        at com.sun.proxy.$Proxy76.join(Unknown Source)
        at hudson.Launcher$RemoteLauncher$ProcImpl.join(Launcher.java:925)
        at hudson.Launcher$ProcStarter.join(Launcher.java:360)
        at hudson.tasks.Ant.perform(Ant.java:217)
        at hudson.tasks.BuildStepMonitor$1.perform(BuildStepMonitor.java:20)
        at hudson.model.AbstractBuild$AbstractBuildExecution.perform(AbstractBuild.java:804)
        at hudson.model.Build$BuildExecution.build(Build.java:199)
        at hudson.model.Build$BuildExecution.doRun(Build.java:160)
        at hudson.model.AbstractBuild$AbstractBuildExecution.run(AbstractBuild.java:586)
        at hudson.model.Run.execute(Run.java:1603)
        at hudson.model.FreeStyleBuild.run(FreeStyleBuild.java:46)
        at hudson.model.ResourceController.execute(ResourceController.java:88)
        at hudson.model.Executor.run(Executor.java:247)
Caused by: hudson.remoting.RequestAbortedException: java.io.IOException: Unexpected termination of the channel
        at hudson.remoting.Request.abort(Request.java:299)
        at hudson.remoting.Channel.terminate(Channel.java:774)
        at hudson.remoting.SynchronousCommandTransport$ReaderThread.run(SynchronousCommandTransport.java:69)
Caused by: java.io.IOException: Unexpected termination of the channel
        at hudson.remoting.SynchronousCommandTransport$ReaderThread.run(SynchronousCommandTransport.java:50)
Caused by: java.io.EOFException
        at java.io.ObjectInputStream$BlockDataInputStream.peekByte(ObjectInputStream.java:2596)
        at java.io.ObjectInputStream.readObject0(ObjectInputStream.java:1316)
        at java.io.ObjectInputStream.readObject(ObjectInputStream.java:370)
        at hudson.remoting.Command.readFrom(Command.java:92)
        at hudson.remoting.ClassicCommandTransport.read(ClassicCommandTransport.java:71)
        at hudson.remoting.SynchronousCommandTransport$ReaderThread.run(SynchronousCommandTransport.java:48)




---------------------------------------------------------------------
To unsubscribe, e-mail: [hidden email]
For additional commands, e-mail: [hidden email]
Reply | Threaded
Open this post in threaded view
|

[JENKINS] Lucene-Solr-trunk-MacOSX (64bit/jdk1.7.0) - Build # 757 - Still Failing!

Policeman Jenkins Server-2
Build: http://jenkins.thetaphi.de/job/Lucene-Solr-trunk-MacOSX/757/
Java: 64bit/jdk1.7.0 -XX:-UseCompressedOops -XX:+UseG1GC

2 tests failed.
REGRESSION:  org.apache.solr.cloud.CollectionsAPIDistributedZkTest.testDistribSearch

Error Message:
collection already exists: awholynewcollection_1

Stack Trace:
org.apache.solr.client.solrj.impl.HttpSolrServer$RemoteSolrException: collection already exists: awholynewcollection_1
        at __randomizedtesting.SeedInfo.seed([E6B881105E69BE8B:675E0F082936DEB7]:0)
        at org.apache.solr.client.solrj.impl.HttpSolrServer.request(HttpSolrServer.java:424)
        at org.apache.solr.client.solrj.impl.HttpSolrServer.request(HttpSolrServer.java:180)
        at org.apache.solr.client.solrj.impl.LBHttpSolrServer.request(LBHttpSolrServer.java:264)
        at org.apache.solr.client.solrj.impl.CloudSolrServer.request(CloudSolrServer.java:318)
        at org.apache.solr.cloud.AbstractFullDistribZkTestBase.createCollection(AbstractFullDistribZkTestBase.java:1571)
        at org.apache.solr.cloud.AbstractFullDistribZkTestBase.createCollection(AbstractFullDistribZkTestBase.java:1585)
        at org.apache.solr.cloud.CollectionsAPIDistributedZkTest.testCollectionsAPI(CollectionsAPIDistributedZkTest.java:481)
        at org.apache.solr.cloud.CollectionsAPIDistributedZkTest.doTest(CollectionsAPIDistributedZkTest.java:152)
        at org.apache.solr.BaseDistributedSearchTestCase.testDistribSearch(BaseDistributedSearchTestCase.java:835)
        at sun.reflect.GeneratedMethodAccessor36.invoke(Unknown Source)
        at sun.reflect.DelegatingMethodAccessorImpl.invoke(DelegatingMethodAccessorImpl.java:43)
        at java.lang.reflect.Method.invoke(Method.java:606)
        at com.carrotsearch.randomizedtesting.RandomizedRunner.invoke(RandomizedRunner.java:1559)
        at com.carrotsearch.randomizedtesting.RandomizedRunner.access$600(RandomizedRunner.java:79)
        at com.carrotsearch.randomizedtesting.RandomizedRunner$6.evaluate(RandomizedRunner.java:737)
        at com.carrotsearch.randomizedtesting.RandomizedRunner$7.evaluate(RandomizedRunner.java:773)
        at com.carrotsearch.randomizedtesting.RandomizedRunner$8.evaluate(RandomizedRunner.java:787)
        at com.carrotsearch.randomizedtesting.rules.SystemPropertiesRestoreRule$1.evaluate(SystemPropertiesRestoreRule.java:53)
        at org.apache.lucene.util.TestRuleSetupTeardownChained$1.evaluate(TestRuleSetupTeardownChained.java:50)
        at org.apache.lucene.util.TestRuleFieldCacheSanity$1.evaluate(TestRuleFieldCacheSanity.java:51)
        at org.apache.lucene.util.AbstractBeforeAfterRule$1.evaluate(AbstractBeforeAfterRule.java:46)
        at com.carrotsearch.randomizedtesting.rules.SystemPropertiesInvariantRule$1.evaluate(SystemPropertiesInvariantRule.java:55)
        at org.apache.lucene.util.TestRuleThreadAndTestName$1.evaluate(TestRuleThreadAndTestName.java:49)
        at org.apache.lucene.util.TestRuleIgnoreAfterMaxFailures$1.evaluate(TestRuleIgnoreAfterMaxFailures.java:70)
        at org.apache.lucene.util.TestRuleMarkFailure$1.evaluate(TestRuleMarkFailure.java:48)
        at com.carrotsearch.randomizedtesting.rules.StatementAdapter.evaluate(StatementAdapter.java:36)
        at com.carrotsearch.randomizedtesting.ThreadLeakControl$StatementRunner.run(ThreadLeakControl.java:358)
        at com.carrotsearch.randomizedtesting.ThreadLeakControl.forkTimeoutingTask(ThreadLeakControl.java:782)
        at com.carrotsearch.randomizedtesting.ThreadLeakControl$3.evaluate(ThreadLeakControl.java:442)
        at com.carrotsearch.randomizedtesting.RandomizedRunner.runSingleTest(RandomizedRunner.java:746)
        at com.carrotsearch.randomizedtesting.RandomizedRunner$3.evaluate(RandomizedRunner.java:648)
        at com.carrotsearch.randomizedtesting.RandomizedRunner$4.evaluate(RandomizedRunner.java:682)
        at com.carrotsearch.randomizedtesting.RandomizedRunner$5.evaluate(RandomizedRunner.java:693)
        at com.carrotsearch.randomizedtesting.rules.StatementAdapter.evaluate(StatementAdapter.java:36)
        at com.carrotsearch.randomizedtesting.rules.SystemPropertiesRestoreRule$1.evaluate(SystemPropertiesRestoreRule.java:53)
        at org.apache.lucene.util.AbstractBeforeAfterRule$1.evaluate(AbstractBeforeAfterRule.java:46)
        at org.apache.lucene.util.TestRuleStoreClassName$1.evaluate(TestRuleStoreClassName.java:42)
        at com.carrotsearch.randomizedtesting.rules.SystemPropertiesInvariantRule$1.evaluate(SystemPropertiesInvariantRule.java:55)
        at com.carrotsearch.randomizedtesting.rules.NoShadowingOrOverridesOnMethodsRule$1.evaluate(NoShadowingOrOverridesOnMethodsRule.java:39)
        at com.carrotsearch.randomizedtesting.rules.NoShadowingOrOverridesOnMethodsRule$1.evaluate(NoShadowingOrOverridesOnMethodsRule.java:39)
        at com.carrotsearch.randomizedtesting.rules.StatementAdapter.evaluate(StatementAdapter.java:36)
        at org.apache.lucene.util.TestRuleAssertionsRequired$1.evaluate(TestRuleAssertionsRequired.java:43)
        at org.apache.lucene.util.TestRuleMarkFailure$1.evaluate(TestRuleMarkFailure.java:48)
        at org.apache.lucene.util.TestRuleIgnoreAfterMaxFailures$1.evaluate(TestRuleIgnoreAfterMaxFailures.java:70)
        at org.apache.lucene.util.TestRuleIgnoreTestSuites$1.evaluate(TestRuleIgnoreTestSuites.java:55)
        at com.carrotsearch.randomizedtesting.rules.StatementAdapter.evaluate(StatementAdapter.java:36)
        at com.carrotsearch.randomizedtesting.ThreadLeakControl$StatementRunner.run(ThreadLeakControl.java:358)
        at java.lang.Thread.run(Thread.java:724)


REGRESSION:  org.apache.solr.core.OpenCloseCoreStressTest.test30SecondsOld

Error Message:
Core 00000_core bad! expected:<392> but was:<0>

Stack Trace:
java.lang.AssertionError: Core 00000_core bad! expected:<392> but was:<0>
        at __randomizedtesting.SeedInfo.seed([E6B881105E69BE8B:CA890B4EC28993E8]:0)
        at org.junit.Assert.fail(Assert.java:93)
        at org.junit.Assert.failNotEquals(Assert.java:647)
        at org.junit.Assert.assertEquals(Assert.java:128)
        at org.junit.Assert.assertEquals(Assert.java:472)
        at org.apache.solr.core.OpenCloseCoreStressTest.checkResults(OpenCloseCoreStressTest.java:307)
        at org.apache.solr.core.OpenCloseCoreStressTest.doStress(OpenCloseCoreStressTest.java:201)
        at org.apache.solr.core.OpenCloseCoreStressTest.test30SecondsOld(OpenCloseCoreStressTest.java:115)
        at sun.reflect.NativeMethodAccessorImpl.invoke0(Native Method)
        at sun.reflect.NativeMethodAccessorImpl.invoke(NativeMethodAccessorImpl.java:57)
        at sun.reflect.DelegatingMethodAccessorImpl.invoke(DelegatingMethodAccessorImpl.java:43)
        at java.lang.reflect.Method.invoke(Method.java:606)
        at com.carrotsearch.randomizedtesting.RandomizedRunner.invoke(RandomizedRunner.java:1559)
        at com.carrotsearch.randomizedtesting.RandomizedRunner.access$600(RandomizedRunner.java:79)
        at com.carrotsearch.randomizedtesting.RandomizedRunner$6.evaluate(RandomizedRunner.java:737)
        at com.carrotsearch.randomizedtesting.RandomizedRunner$7.evaluate(RandomizedRunner.java:773)
        at com.carrotsearch.randomizedtesting.RandomizedRunner$8.evaluate(RandomizedRunner.java:787)
        at com.carrotsearch.randomizedtesting.rules.SystemPropertiesRestoreRule$1.evaluate(SystemPropertiesRestoreRule.java:53)
        at org.apache.lucene.util.TestRuleSetupTeardownChained$1.evaluate(TestRuleSetupTeardownChained.java:50)
        at org.apache.lucene.util.TestRuleFieldCacheSanity$1.evaluate(TestRuleFieldCacheSanity.java:51)
        at org.apache.lucene.util.AbstractBeforeAfterRule$1.evaluate(AbstractBeforeAfterRule.java:46)
        at com.carrotsearch.randomizedtesting.rules.SystemPropertiesInvariantRule$1.evaluate(SystemPropertiesInvariantRule.java:55)
        at org.apache.lucene.util.TestRuleThreadAndTestName$1.evaluate(TestRuleThreadAndTestName.java:49)
        at org.apache.lucene.util.TestRuleIgnoreAfterMaxFailures$1.evaluate(TestRuleIgnoreAfterMaxFailures.java:70)
        at org.apache.lucene.util.TestRuleMarkFailure$1.evaluate(TestRuleMarkFailure.java:48)
        at com.carrotsearch.randomizedtesting.rules.StatementAdapter.evaluate(StatementAdapter.java:36)
        at com.carrotsearch.randomizedtesting.ThreadLeakControl$StatementRunner.run(ThreadLeakControl.java:358)
        at com.carrotsearch.randomizedtesting.ThreadLeakControl.forkTimeoutingTask(ThreadLeakControl.java:782)
        at com.carrotsearch.randomizedtesting.ThreadLeakControl$3.evaluate(ThreadLeakControl.java:442)
        at com.carrotsearch.randomizedtesting.RandomizedRunner.runSingleTest(RandomizedRunner.java:746)
        at com.carrotsearch.randomizedtesting.RandomizedRunner$3.evaluate(RandomizedRunner.java:648)
        at com.carrotsearch.randomizedtesting.RandomizedRunner$4.evaluate(RandomizedRunner.java:682)
        at com.carrotsearch.randomizedtesting.RandomizedRunner$5.evaluate(RandomizedRunner.java:693)
        at com.carrotsearch.randomizedtesting.rules.StatementAdapter.evaluate(StatementAdapter.java:36)
        at com.carrotsearch.randomizedtesting.rules.SystemPropertiesRestoreRule$1.evaluate(SystemPropertiesRestoreRule.java:53)
        at org.apache.lucene.util.AbstractBeforeAfterRule$1.evaluate(AbstractBeforeAfterRule.java:46)
        at org.apache.lucene.util.TestRuleStoreClassName$1.evaluate(TestRuleStoreClassName.java:42)
        at com.carrotsearch.randomizedtesting.rules.SystemPropertiesInvariantRule$1.evaluate(SystemPropertiesInvariantRule.java:55)
        at com.carrotsearch.randomizedtesting.rules.NoShadowingOrOverridesOnMethodsRule$1.evaluate(NoShadowingOrOverridesOnMethodsRule.java:39)
        at com.carrotsearch.randomizedtesting.rules.NoShadowingOrOverridesOnMethodsRule$1.evaluate(NoShadowingOrOverridesOnMethodsRule.java:39)
        at com.carrotsearch.randomizedtesting.rules.StatementAdapter.evaluate(StatementAdapter.java:36)
        at org.apache.lucene.util.TestRuleAssertionsRequired$1.evaluate(TestRuleAssertionsRequired.java:43)
        at org.apache.lucene.util.TestRuleMarkFailure$1.evaluate(TestRuleMarkFailure.java:48)
        at org.apache.lucene.util.TestRuleIgnoreAfterMaxFailures$1.evaluate(TestRuleIgnoreAfterMaxFailures.java:70)
        at org.apache.lucene.util.TestRuleIgnoreTestSuites$1.evaluate(TestRuleIgnoreTestSuites.java:55)
        at com.carrotsearch.randomizedtesting.rules.StatementAdapter.evaluate(StatementAdapter.java:36)
        at com.carrotsearch.randomizedtesting.ThreadLeakControl$StatementRunner.run(ThreadLeakControl.java:358)
        at java.lang.Thread.run(Thread.java:724)




Build Log:
[...truncated 17642 lines...]
   [junit4] Suite: org.apache.solr.core.OpenCloseCoreStressTest
   [junit4]   2> log4j:WARN No such property [conversionPattern] in org.apache.solr.util.SolrLogLayout.
   [junit4]   2> 3978 T11 oas.SolrTestCaseJ4.setUp ###Starting test30SecondsNew
   [junit4]   2> 5285 T11 oejs.Server.doStart jetty-8.1.10.v20130312
   [junit4]   2> 5879 T11 oejs.AbstractConnector.doStart Started SelectChannelConnector@127.0.0.1:49216
   [junit4]   2> 6020 T11 oass.SolrDispatchFilter.init SolrDispatchFilter.init()
   [junit4]   2> 6186 T11 oasc.SolrResourceLoader.locateSolrHome JNDI not configured for solr (NoInitialContextEx)
   [junit4]   2> 6187 T11 oasc.SolrResourceLoader.locateSolrHome using system property solr.solr.home: /Users/jenkins/workspace/Lucene-Solr-trunk-MacOSX/solr/build/solr-core/test/J0/./OpenCloseCoreStressTest_
   [junit4]   2> 6189 T11 oasc.SolrResourceLoader.<init> new SolrResourceLoader for directory: '/Users/jenkins/workspace/Lucene-Solr-trunk-MacOSX/solr/build/solr-core/test/J0/./OpenCloseCoreStressTest_/'
   [junit4]   2> 6916 T11 oasc.ConfigSolr.fromFile Loading container configuration from /Users/jenkins/workspace/Lucene-Solr-trunk-MacOSX/solr/build/solr-core/test/J0/./OpenCloseCoreStressTest_/solr.xml
   [junit4]   2> 7782 T11 oasc.ConfigSolrXml.<init> Config-defined core root directory:
   [junit4]   2> 7815 T11 oasc.CoreContainer.<init> New CoreContainer 120171709
   [junit4]   2> 7816 T11 oasc.CoreContainer.load Loading cores into CoreContainer [instanceDir=/Users/jenkins/workspace/Lucene-Solr-trunk-MacOSX/solr/build/solr-core/test/J0/./OpenCloseCoreStressTest_/]
   [junit4]   2> 7998 T11 oashc.HttpShardHandlerFactory.getParameter Setting socketTimeout to: 120000
   [junit4]   2> 8000 T11 oashc.HttpShardHandlerFactory.getParameter Setting urlScheme to: http://
   [junit4]   2> 8001 T11 oashc.HttpShardHandlerFactory.getParameter Setting connTimeout to: 15000
   [junit4]   2> 8002 T11 oashc.HttpShardHandlerFactory.getParameter Setting maxConnectionsPerHost to: 20
   [junit4]   2> 8003 T11 oashc.HttpShardHandlerFactory.getParameter Setting corePoolSize to: 0
   [junit4]   2> 8007 T11 oashc.HttpShardHandlerFactory.getParameter Setting maximumPoolSize to: 2147483647
   [junit4]   2> 8008 T11 oashc.HttpShardHandlerFactory.getParameter Setting maxThreadIdleTime to: 5
   [junit4]   2> 8010 T11 oashc.HttpShardHandlerFactory.getParameter Setting sizeOfQueue to: -1
   [junit4]   2> 8011 T11 oashc.HttpShardHandlerFactory.getParameter Setting fairnessPolicy to: false
   [junit4]   2> 8085 T11 oascsi.HttpClientUtil.createClient Creating new http client, config:maxConnectionsPerHost=20&maxConnections=10000&socketTimeout=120000&connTimeout=15000&retry=false
   [junit4]   2> 9244 T11 oasc.CorePropertiesLocator.discover Looking for core definitions underneath /Users/jenkins/workspace/Lucene-Solr-trunk-MacOSX/solr/build/solr-core/test/J0/./OpenCloseCoreStressTest_
   [junit4]   2> 9453 T11 oasc.CorePropertiesLocator.discoverUnder Found core 00000_core in /Users/jenkins/workspace/Lucene-Solr-trunk-MacOSX/solr/build/solr-core/test/J0/./OpenCloseCoreStressTest_/00000_core/
   [junit4]   2> 9456 T11 oasc.CorePropertiesLocator.discoverUnder Found core 00001_core in /Users/jenkins/workspace/Lucene-Solr-trunk-MacOSX/solr/build/solr-core/test/J0/./OpenCloseCoreStressTest_/00001_core/
   [junit4]   2> 9458 T11 oasc.CorePropertiesLocator.discoverUnder Found core 00002_core in /Users/jenkins/workspace/Lucene-Solr-trunk-MacOSX/solr/build/solr-core/test/J0/./OpenCloseCoreStressTest_/00002_core/
   [junit4]   2> 9461 T11 oasc.CorePropertiesLocator.discoverUnder Found core 00003_core in /Users/jenkins/workspace/Lucene-Solr-trunk-MacOSX/solr/build/solr-core/test/J0/./OpenCloseCoreStressTest_/00003_core/
   [junit4]   2> 9464 T11 oasc.CorePropertiesLocator.discoverUnder Found core 00004_core in /Users/jenkins/workspace/Lucene-Solr-trunk-MacOSX/solr/build/solr-core/test/J0/./OpenCloseCoreStressTest_/00004_core/
   [junit4]   2> 9467 T11 oasc.CorePropertiesLocator.discoverUnder Found core 00005_core in /Users/jenkins/workspace/Lucene-Solr-trunk-MacOSX/solr/build/solr-core/test/J0/./OpenCloseCoreStressTest_/00005_core/
   [junit4]   2> 9470 T11 oasc.CorePropertiesLocator.discoverUnder Found core 00006_core in /Users/jenkins/workspace/Lucene-Solr-trunk-MacOSX/solr/build/solr-core/test/J0/./OpenCloseCoreStressTest_/00006_core/
   [junit4]   2> 9472 T11 oasc.CorePropertiesLocator.discoverUnder Found core 00007_core in /Users/jenkins/workspace/Lucene-Solr-trunk-MacOSX/solr/build/solr-core/test/J0/./OpenCloseCoreStressTest_/00007_core/
   [junit4]   2> 9475 T11 oasc.CorePropertiesLocator.discoverUnder Found core 00008_core in /Users/jenkins/workspace/Lucene-Solr-trunk-MacOSX/solr/build/solr-core/test/J0/./OpenCloseCoreStressTest_/00008_core/
   [junit4]   2> 9478 T11 oasc.CorePropertiesLocator.discoverUnder Found core 00009_core in /Users/jenkins/workspace/Lucene-Solr-trunk-MacOSX/solr/build/solr-core/test/J0/./OpenCloseCoreStressTest_/00009_core/
   [junit4]   2> 9484 T11 oasc.CorePropertiesLocator.discoverUnder Found core 00010_core in /Users/jenkins/workspace/Lucene-Solr-trunk-MacOSX/solr/build/solr-core/test/J0/./OpenCloseCoreStressTest_/00010_core/
   [junit4]   2> 9486 T11 oasc.CorePropertiesLocator.discoverUnder Found core 00011_core in /Users/jenkins/workspace/Lucene-Solr-trunk-MacOSX/solr/build/solr-core/test/J0/./OpenCloseCoreStressTest_/00011_core/
   [junit4]   2> 9488 T11 oasc.CorePropertiesLocator.discoverUnder Found core 00012_core in /Users/jenkins/workspace/Lucene-Solr-trunk-MacOSX/solr/build/solr-core/test/J0/./OpenCloseCoreStressTest_/00012_core/
   [junit4]   2> 9493 T11 oasc.CorePropertiesLocator.discoverUnder Found core 00013_core in /Users/jenkins/workspace/Lucene-Solr-trunk-MacOSX/solr/build/solr-core/test/J0/./OpenCloseCoreStressTest_/00013_core/
   [junit4]   2> 9497 T11 oasc.CorePropertiesLocator.discoverUnder Found core 00014_core in /Users/jenkins/workspace/Lucene-Solr-trunk-MacOSX/solr/build/solr-core/test/J0/./OpenCloseCoreStressTest_/00014_core/
   [junit4]   2> 9514 T11 oasc.CorePropertiesLocator.discoverUnder Found core 00015_core in /Users/jenkins/workspace/Lucene-Solr-trunk-MacOSX/solr/build/solr-core/test/J0/./OpenCloseCoreStressTest_/00015_core/
   [junit4]   2> 9517 T11 oasc.CorePropertiesLocator.discoverUnder Found core 00016_core in /Users/jenkins/workspace/Lucene-Solr-trunk-MacOSX/solr/build/solr-core/test/J0/./OpenCloseCoreStressTest_/00016_core/
   [junit4]   2> 9525 T11 oasc.CorePropertiesLocator.discoverUnder Found core 00017_core in /Users/jenkins/workspace/Lucene-Solr-trunk-MacOSX/solr/build/solr-core/test/J0/./OpenCloseCoreStressTest_/00017_core/
   [junit4]   2> 9529 T11 oasc.CorePropertiesLocator.discoverUnder Found core 00018_core in /Users/jenkins/workspace/Lucene-Solr-trunk-MacOSX/solr/build/solr-core/test/J0/./OpenCloseCoreStressTest_/00018_core/
   [junit4]   2> 9531 T11 oasc.CorePropertiesLocator.discoverUnder Found core 00019_core in /Users/jenkins/workspace/Lucene-Solr-trunk-MacOSX/solr/build/solr-core/test/J0/./OpenCloseCoreStressTest_/00019_core/
   [junit4]   2> 9532 T11 oasc.CorePropertiesLocator.discover Found 20 core definitions
   [junit4]   2> 9544 T11 oass.SolrDispatchFilter.init user.dir=/Users/jenkins/workspace/Lucene-Solr-trunk-MacOSX/solr/build/solr-core/test/J0
   [junit4]   2> 9545 T11 oass.SolrDispatchFilter.init SolrDispatchFilter.init() done
   [junit4]   2> 9631 T11 oascsi.HttpClientUtil.createClient Creating new http client, config:maxConnections=128&maxConnectionsPerHost=32&followRedirects=false
   [junit4]   2> 9668 T11 oascsi.HttpClientUtil.createClient Creating new http client, config:maxConnections=128&maxConnectionsPerHost=32&followRedirects=false
   [junit4]   2> 9687 T11 oascsi.HttpClientUtil.createClient Creating new http client, config:maxConnections=128&maxConnectionsPerHost=32&followRedirects=false
   [junit4]   2> 9706 T11 oascsi.HttpClientUtil.createClient Creating new http client, config:maxConnections=128&maxConnectionsPerHost=32&followRedirects=false
   [junit4]   2> 9724 T11 oascsi.HttpClientUtil.createClient Creating new http client, config:maxConnections=128&maxConnectionsPerHost=32&followRedirects=false
   [junit4]   2> 9745 T11 oascsi.HttpClientUtil.createClient Creating new http client, config:maxConnections=128&maxConnectionsPerHost=32&followRedirects=false
   [junit4]   2> 9764 T11 oascsi.HttpClientUtil.createClient Creating new http client, config:maxConnections=128&maxConnectionsPerHost=32&followRedirects=false
   [junit4]   2> 9783 T11 oascsi.HttpClientUtil.createClient Creating new http client, config:maxConnections=128&maxConnectionsPerHost=32&followRedirects=false
   [junit4]   2> 9803 T11 oascsi.HttpClientUtil.createClient Creating new http client, config:maxConnections=128&maxConnectionsPerHost=32&followRedirects=false
   [junit4]   2> 9821 T11 oascsi.HttpClientUtil.createClient Creating new http client, config:maxConnections=128&maxConnectionsPerHost=32&followRedirects=false
   [junit4]   2> 9841 T11 oascsi.HttpClientUtil.createClient Creating new http client, config:maxConnections=128&maxConnectionsPerHost=32&followRedirects=false
   [junit4]   2> 9859 T11 oascsi.HttpClientUtil.createClient Creating new http client, config:maxConnections=128&maxConnectionsPerHost=32&followRedirects=false
   [junit4]   2> 9877 T11 oascsi.HttpClientUtil.createClient Creating new http client, config:maxConnections=128&maxConnectionsPerHost=32&followRedirects=false
   [junit4]   2> 9895 T11 oascsi.HttpClientUtil.createClient Creating new http client, config:maxConnections=128&maxConnectionsPerHost=32&followRedirects=false
   [junit4]   2> 9918 T11 oascsi.HttpClientUtil.createClient Creating new http client, config:maxConnections=128&maxConnectionsPerHost=32&followRedirects=false
   [junit4]   2> 9938 T11 oascsi.HttpClientUtil.createClient Creating new http client, config:maxConnections=128&maxConnectionsPerHost=32&followRedirects=false
   [junit4]   2> 9956 T11 oascsi.HttpClientUtil.createClient Creating new http client, config:maxConnections=128&maxConnectionsPerHost=32&followRedirects=false
   [junit4]   2> 9974 T11 oascsi.HttpClientUtil.createClient Creating new http client, config:maxConnections=128&maxConnectionsPerHost=32&followRedirects=false
   [junit4]   2> 9991 T11 oascsi.HttpClientUtil.createClient Creating new http client, config:maxConnections=128&maxConnectionsPerHost=32&followRedirects=false
   [junit4]   2> 10009 T11 oascsi.HttpClientUtil.createClient Creating new http client, config:maxConnections=128&maxConnectionsPerHost=32&followRedirects=false
   [junit4]   2> 10034 T11 oascsi.HttpClientUtil.createClient Creating new http client, config:maxConnections=128&maxConnectionsPerHost=32&followRedirects=false
   [junit4]   2> 10049 T11 oascsi.HttpClientUtil.createClient Creating new http client, config:maxConnections=128&maxConnectionsPerHost=32&followRedirects=false
   [junit4]   2> 10067 T11 oascsi.HttpClientUtil.createClient Creating new http client, config:maxConnections=128&maxConnectionsPerHost=32&followRedirects=false
   [junit4]   2> 10088 T11 oascsi.HttpClientUtil.createClient Creating new http client, config:maxConnections=128&maxConnectionsPerHost=32&followRedirects=false
   [junit4]   2> 10111 T11 oascsi.HttpClientUtil.createClient Creating new http client, config:maxConnections=128&maxConnectionsPerHost=32&followRedirects=false
   [junit4]   2> 10131 T11 oascsi.HttpClientUtil.createClient Creating new http client, config:maxConnections=128&maxConnectionsPerHost=32&followRedirects=false
   [junit4]   2> 10149 T11 oascsi.HttpClientUtil.createClient Creating new http client, config:maxConnections=128&maxConnectionsPerHost=32&followRedirects=false
   [junit4]   2> 10168 T11 oascsi.HttpClientUtil.createClient Creating new http client, config:maxConnections=128&maxConnectionsPerHost=32&followRedirects=false
   [junit4]   2> 10187 T11 oascsi.HttpClientUtil.createClient Creating new http client, config:maxConnections=128&maxConnectionsPerHost=32&followRedirects=false
   [junit4]   2> 10206 T11 oascsi.HttpClientUtil.createClient Creating new http client, config:maxConnections=128&maxConnectionsPerHost=32&followRedirects=false
   [junit4]   2> 10226 T11 oasc.OpenCloseCoreStressTest.doStress Starting indexing and querying
   [junit4]   2> 10231 T11 oasc.OpenCloseCoreStressTest.doStress
   [junit4]   2>
   [junit4]   2>
   [junit4]   2>
   [junit4]   2>
   [junit4]   2> Starting a 30 second cycle, seconds left: 30. Seconds run so far: 0.
   [junit4]   2> 10245 T39 oasc.OneQuery.run Starting query thread: 39
   [junit4]   2> 10255 T50 oasc.OneQuery.run Starting query thread: 50
   [junit4]   2> 10242 T38 oasc.OneIndexer.run Starting indexing thread: 38
   [junit4]   2> 10242 T37 oasc.OneIndexer.run Starting indexing thread: 37
   [junit4]   2> 10241 T36 oasc.OneIndexer.run Starting indexing thread: 36
   [junit4]   2> 10241 T35 oasc.OneIndexer.run Starting indexing thread: 35
   [junit4]   2> 10240 T34 oasc.OneIndexer.run Starting indexing thread: 34
   [junit4]   2> 10240 T33 oasc.OneIndexer.run Starting indexing thread: 33
   [junit4]   2> 10239 T32 oasc.OneIndexer.run Starting indexing thread: 32
   [junit4]   2> 10238 T31 oasc.OneIndexer.run Starting indexing thread: 31
   [junit4]   2> 10238 T30 oasc.OneIndexer.run Starting indexing thread: 30
   [junit4]   2> 10237 T29 oasc.OneIndexer.run Starting indexing thread: 29
   [junit4]   2> 10237 T28 oasc.OneIndexer.run Starting indexing thread: 28
   [junit4]   2> 10236 T27 oasc.OneIndexer.run Starting indexing thread: 27
   [junit4]   2> 10236 T26 oasc.OneIndexer.run Starting indexing thread: 26
   [junit4]   2> 10235 T25 oasc.OneIndexer.run Starting indexing thread: 25
   [junit4]   2> 10235 T24 oasc.OneIndexer.run Starting indexing thread: 24
   [junit4]   2> 10253 T49 oasc.OneQuery.run Starting query thread: 49
   [junit4]   2> 10252 T48 oasc.OneQuery.run Starting query thread: 48
   [junit4]   2> 10252 T47 oasc.OneQuery.run Starting query thread: 47
   [junit4]   2> 10251 T46 oasc.OneQuery.run Starting query thread: 46
   [junit4]   2> 10250 T45 oasc.OneQuery.run Starting query thread: 45
   [junit4]   2> 10249 T44 oasc.OneQuery.run Starting query thread: 44
   [junit4]   2> 10249 T43 oasc.OneQuery.run Starting query thread: 43
   [junit4]   2> 10248 T42 oasc.OneQuery.run Starting query thread: 42
   [junit4]   2> 10247 T41 oasc.OneQuery.run Starting query thread: 41
   [junit4]   2> 10246 T40 oasc.OneQuery.run Starting query thread: 40
   [junit4]   2> 10257 T51 oasc.OneQuery.run Starting query thread: 51
   [junit4]   2> 10297 T52 oasc.OneQuery.run Starting query thread: 52
   [junit4]   2> 10299 T53 oasc.OneQuery.run Starting query thread: 53
   [junit4]   2> 12174 T70 oasc.CoreContainer.create Creating SolrCore '00002_core' using instanceDir: /Users/jenkins/workspace/Lucene-Solr-trunk-MacOSX/solr/build/solr-core/test/J0/./OpenCloseCoreStressTest_/00002_core
   [junit4]   2> 12183 T22 oasc.CoreContainer.create Creating SolrCore '00005_core' using instanceDir: /Users/jenkins/workspace/Lucene-Solr-trunk-MacOSX/solr/build/solr-core/test/J0/./OpenCloseCoreStressTest_/00005_core
   [junit4]   2> 12181 T68 oasc.CoreContainer.create Creating SolrCore '00008_core' using instanceDir: /Users/jenkins/workspace/Lucene-Solr-trunk-MacOSX/solr/build/solr-core/test/J0/./OpenCloseCoreStressTest_/00008_core
   [junit4]   2> 12188 T71 oasc.CoreContainer.create Creating SolrCore '00018_core' using instanceDir: /Users/jenkins/workspace/Lucene-Solr-trunk-MacOSX/solr/build/solr-core/test/J0/./OpenCloseCoreStressTest_/00018_core
   [junit4]   2> 12174 T75 oasc.CoreContainer.create Creating SolrCore '00013_core' using instanceDir: /Users/jenkins/workspace/Lucene-Solr-trunk-MacOSX/solr/build/solr-core/test/J0/./OpenCloseCoreStressTest_/00013_core
   [junit4]   2> 12196 T21 oasc.CoreContainer.create Creating SolrCore '00012_core' using instanceDir: /Users/jenkins/workspace/Lucene-Solr-trunk-MacOSX/solr/build/solr-core/test/J0/./OpenCloseCoreStressTest_/00012_core
   [junit4]   2> 12198 T21 oasc.SolrResourceLoader.<init> new SolrResourceLoader for directory: '/Users/jenkins/workspace/Lucene-Solr-trunk-MacOSX/solr/build/solr-core/test/J0/./OpenCloseCoreStressTest_/00012_core/'
   [junit4]   2> 12180 T58 oasc.CoreContainer.create Creating SolrCore '00003_core' using instanceDir: /Users/jenkins/workspace/Lucene-Solr-trunk-MacOSX/solr/build/solr-core/test/J0/./OpenCloseCoreStressTest_/00003_core
   [junit4]   2> 12207 T58 oasc.SolrResourceLoader.<init> new SolrResourceLoader for directory: '/Users/jenkins/workspace/Lucene-Solr-trunk-MacOSX/solr/build/solr-core/test/J0/./OpenCloseCoreStressTest_/00003_core/'
   [junit4]   2> 12191 T71 oasc.SolrResourceLoader.<init> new SolrResourceLoader for directory: '/Users/jenkins/workspace/Lucene-Solr-trunk-MacOSX/solr/build/solr-core/test/J0/./OpenCloseCoreStressTest_/00018_core/'
   [junit4]   2> 12188 T68 oasc.SolrResourceLoader.<init> new SolrResourceLoader for directory: '/Users/jenkins/workspace/Lucene-Solr-trunk-MacOSX/solr/build/solr-core/test/J0/./OpenCloseCoreStressTest_/00008_core/'
   [junit4]   2> 12185 T22 oasc.SolrResourceLoader.<init> new SolrResourceLoader for directory: '/Users/jenkins/workspace/Lucene-Solr-trunk-MacOSX/solr/build/solr-core/test/J0/./OpenCloseCoreStressTest_/00005_core/'
   [junit4]   2> 12183 T70 oasc.SolrResourceLoader.<init> new SolrResourceLoader for directory: '/Users/jenkins/workspace/Lucene-Solr-trunk-MacOSX/solr/build/solr-core/test/J0/./OpenCloseCoreStressTest_/00002_core/'
   [junit4]   2> 12196 T57 oasc.CoreContainer.create Creating SolrCore '00016_core' using instanceDir: /Users/jenkins/workspace/Lucene-Solr-trunk-MacOSX/solr/build/solr-core/test/J0/./OpenCloseCoreStressTest_/00016_core
   [junit4]   2> 12220 T57 oasc.SolrResourceLoader.<init> new SolrResourceLoader for directory: '/Users/jenkins/workspace/Lucene-Solr-trunk-MacOSX/solr/build/solr-core/test/J0/./OpenCloseCoreStressTest_/00016_core/'
   [junit4]   2> 12196 T73 oasc.CoreContainer.create Creating SolrCore '00014_core' using instanceDir: /Users/jenkins/workspace/Lucene-Solr-trunk-MacOSX/solr/build/solr-core/test/J0/./OpenCloseCoreStressTest_/00014_core
   [junit4]   2> 12223 T73 oasc.SolrResourceLoader.<init> new SolrResourceLoader for directory: '/Users/jenkins/workspace/Lucene-Solr-trunk-MacOSX/solr/build/solr-core/test/J0/./OpenCloseCoreStressTest_/00014_core/'
   [junit4]   2> 12196 T65 oasc.CoreContainer.create Creating SolrCore '00001_core' using instanceDir: /Users/jenkins/workspace/Lucene-Solr-trunk-MacOSX/solr/build/solr-core/test/J0/./OpenCloseCoreStressTest_/00001_core
   [junit4]   2> 12196 T64 oasc.CoreContainer.create Creating SolrCore '00009_core' using instanceDir: /Users/jenkins/workspace/Lucene-Solr-trunk-MacOSX/solr/build/solr-core/test/J0/./OpenCloseCoreStressTest_/00009_core
   [junit4]   2> 12227 T64 oasc.SolrResourceLoader.<init> new SolrResourceLoader for directory: '/Users/jenkins/workspace/Lucene-Solr-trunk-MacOSX/solr/build/solr-core/test/J0/./OpenCloseCoreStressTest_/00009_core/'
   [junit4]   2> 12196 T75 oasc.SolrResourceLoader.<init> new SolrResourceLoader for directory: '/Users/jenkins/workspace/Lucene-Solr-trunk-MacOSX/solr/build/solr-core/test/J0/./OpenCloseCoreStressTest_/00013_core/'
   [junit4]   2> 12194 T17 oasc.CoreContainer.create Creating SolrCore '00017_core' using instanceDir: /Users/jenkins/workspace/Lucene-Solr-trunk-MacOSX/solr/build/solr-core/test/J0/./OpenCloseCoreStressTest_/00017_core
   [junit4]   2> 12244 T17 oasc.SolrResourceLoader.<init> new SolrResourceLoader for directory: '/Users/jenkins/workspace/Lucene-Solr-trunk-MacOSX/solr/build/solr-core/test/J0/./OpenCloseCoreStressTest_/00017_core/'
   [junit4]   2> 12193 T69 oasc.CoreContainer.create Creating SolrCore '00019_core' using instanceDir: /Users/jenkins/workspace/Lucene-Solr-trunk-MacOSX/solr/build/solr-core/test/J0/./OpenCloseCoreStressTest_/00019_core
   [junit4]   2> 12253 T69 oasc.SolrResourceLoader.<init> new SolrResourceLoader for directory: '/Users/jenkins/workspace/Lucene-Solr-trunk-MacOSX/solr/build/solr-core/test/J0/./OpenCloseCoreStressTest_/00019_core/'
   [junit4]   2> 12193 T59 oasc.CoreContainer.create Creating SolrCore '00000_core' using instanceDir: /Users/jenkins/workspace/Lucene-Solr-trunk-MacOSX/solr/build/solr-core/test/J0/./OpenCloseCoreStressTest_/00000_core
   [junit4]   2> 12255 T59 oasc.SolrResourceLoader.<init> new SolrResourceLoader for directory: '/Users/jenkins/workspace/Lucene-Solr-trunk-MacOSX/solr/build/solr-core/test/J0/./OpenCloseCoreStressTest_/00000_core/'
   [junit4]   2> 12193 T77 oasc.CoreContainer.create Creating SolrCore '00004_core' using instanceDir: /Users/jenkins/workspace/Lucene-Solr-trunk-MacOSX/solr/build/solr-core/test/J0/./OpenCloseCoreStressTest_/00004_core
   [junit4]   2> 12193 T18 oasc.CoreContainer.create Creating SolrCore '00007_core' using instanceDir: /Users/jenkins/workspace/Lucene-Solr-trunk-MacOSX/solr/build/solr-core/test/J0/./OpenCloseCoreStressTest_/00007_core
   [junit4]   2> 12259 T18 oasc.SolrResourceLoader.<init> new SolrResourceLoader for directory: '/Users/jenkins/workspace/Lucene-Solr-trunk-MacOSX/solr/build/solr-core/test/J0/./OpenCloseCoreStressTest_/00007_core/'
   [junit4]   2> 12257 T77 oasc.SolrResourceLoader.<init> new SolrResourceLoader for directory: '/Users/jenkins/workspace/Lucene-Solr-trunk-MacOSX/solr/build/solr-core/test/J0/./OpenCloseCoreStressTest_/00004_core/'
   [junit4]   2> 12226 T65 oasc.SolrResourceLoader.<init> new SolrResourceLoader for directory: '/Users/jenkins/workspace/Lucene-Solr-trunk-MacOSX/solr/build/solr-core/test/J0/./OpenCloseCoreStressTest_/00001_core/'
   [junit4]   2> 14049 T77 oasc.SolrConfig.<init> Using Lucene MatchVersion: LUCENE_41
   [junit4]   2> 14077 T64 oasc.SolrConfig.<init> Using Lucene MatchVersion: LUCENE_41
   [junit4]   2> 14169 T75 oasc.SolrConfig.<init> Using Lucene MatchVersion: LUCENE_41
   [junit4]   2> 14196 T68 oasc.SolrConfig.<init> Using Lucene MatchVersion: LUCENE_41
   [junit4]   2> 14216 T65 oasc.SolrConfig.<init> Using Lucene MatchVersion: LUCENE_41
   [junit4]   2> 14246 T70 oasc.SolrConfig.<init> Using Lucene MatchVersion: LUCENE_41
   [junit4]   2> 14262 T69 oasc.SolrConfig.<init> Using Lucene MatchVersion: LUCENE_41
   [junit4]   2> 14277 T57 oasc.SolrConfig.<init> Using Lucene MatchVersion: LUCENE_41
   [junit4]   2> 14327 T18 oasc.SolrConfig.<init> Using Lucene MatchVersion: LUCENE_41
   [junit4]   2> 14400 T59 oasc.SolrConfig.<init> Using Lucene MatchVersion: LUCENE_41
   [junit4]   2> 14408 T21 oasc.SolrConfig.<init> Using Lucene MatchVersion: LUCENE_41
   [junit4]   2> 14490 T22 oasc.SolrConfig.<init> Using Lucene MatchVersion: LUCENE_41
   [junit4]   2> 14564 T17 oasc.SolrConfig.<init> Using Lucene MatchVersion: LUCENE_41
   [junit4]   2> 14613 T73 oasc.SolrConfig.<init> Using Lucene MatchVersion: LUCENE_41
   [junit4]   2> 14838 T71 oasc.SolrConfig.<init> Using Lucene MatchVersion: LUCENE_41
   [junit4]   2> 14999 T58 oasc.SolrConfig.<init> Using Lucene MatchVersion: LUCENE_41
   [junit4]   2> 16204 T22 oasc.SolrConfig.<init> Loaded SolrConfig: solrconfig-minimal.xml
   [junit4]   2> 16221 T68 oasc.SolrConfig.<init> Loaded SolrConfig: solrconfig-minimal.xml
   [junit4]   2> 16263 T77 oasc.SolrConfig.<init> Loaded SolrConfig: solrconfig-minimal.xml
   [junit4]   2> 16315 T64 oasc.SolrConfig.<init> Loaded SolrConfig: solrconfig-minimal.xml
   [junit4]   2> 16319 T70 oasc.SolrConfig.<init> Loaded SolrConfig: solrconfig-minimal.xml
   [junit4]   2> 16444 T18 oasc.SolrConfig.<init> Loaded SolrConfig: solrconfig-minimal.xml
   [junit4]   2> 16466 T17 oasc.SolrConfig.<init> Loaded SolrConfig: solrconfig-minimal.xml
   [junit4]   2> 16485 T22 oass.IndexSchema.readSchema Reading Solr Schema from schema-tiny.xml
   [junit4]   2> 16508 T17 oass.IndexSchema.readSchema Reading Solr Schema from schema-tiny.xml
   [junit4]   2> 16526 T18 oass.IndexSchema.readSchema Reading Solr Schema from schema-tiny.xml
   [junit4]   2> 16527 T68 oass.IndexSchema.readSchema Reading Solr Schema from schema-tiny.xml
   [junit4]   2> 16537 T77 oass.IndexSchema.readSchema Reading Solr Schema from schema-tiny.xml
   [junit4]   2> 16547 T64 oass.IndexSchema.readSchema Reading Solr Schema from schema-tiny.xml
   [junit4]   2> 16552 T70 oass.IndexSchema.readSchema Reading Solr Schema from schema-tiny.xml
   [junit4]   2> 16580 T69 oasc.SolrConfig.<init> Loaded SolrConfig: solrconfig-minimal.xml
   [junit4]   2> 16630 T69 oass.IndexSchema.readSchema Reading Solr Schema from schema-tiny.xml
   [junit4]   2> 16697 T65 oasc.SolrConfig.<init> Loaded SolrConfig: solrconfig-minimal.xml
   [junit4]   2> 16699 T65 oass.IndexSchema.readSchema Reading Solr Schema from schema-tiny.xml
   [junit4]   2> 16710 T75 oasc.SolrConfig.<init> Loaded SolrConfig: solrconfig-minimal.xml
   [junit4]   2> 16712 T75 oass.IndexSchema.readSchema Reading Solr Schema from schema-tiny.xml
   [junit4]   2> 16825 T22 oass.IndexSchema.readSchema [null] Schema name=tiny
   [junit4]   2> 16829 T57 oasc.SolrConfig.<init> Loaded SolrConfig: solrconfig-minimal.xml
   [junit4]   2> 16831 T57 oass.IndexSchema.readSchema Reading Solr Schema from schema-tiny.xml
   [junit4]   2> 16840 T68 oass.IndexSchema.readSchema [null] Schema name=tiny
   [junit4]   2> 16850 T77 oass.IndexSchema.readSchema [null] Schema name=tiny
   [junit4]   2> 16858 T71 oasc.SolrConfig.<init> Loaded SolrConfig: solrconfig-minimal.xml
   [junit4]   2> 16860 T71 oass.IndexSchema.readSchema Reading Solr Schema from schema-tiny.xml
   [junit4]   2> 16876 T65 oass.IndexSchema.readSchema [null] Schema name=tiny
   [junit4]   2> 16893 T69 oass.IndexSchema.readSchema [null] Schema name=tiny
   [junit4]   2> 16901 T70 oass.IndexSchema.readSchema [null] Schema name=tiny
   [junit4]   2> 16917 T17 oass.IndexSchema.readSchema [null] Schema name=tiny
   [junit4]   2> 16923 T21 oasc.SolrConfig.<init> Loaded SolrConfig: solrconfig-minimal.xml
   [junit4]   2> 16924 T21 oass.IndexSchema.readSchema Reading Solr Schema from schema-tiny.xml
   [junit4]   2> 16926 T64 oass.IndexSchema.readSchema [null] Schema name=tiny
   [junit4]   2> 16929 T59 oasc.SolrConfig.<init> Loaded SolrConfig: solrconfig-minimal.xml
   [junit4]   2> 16930 T59 oass.IndexSchema.readSchema Reading Solr Schema from schema-tiny.xml
   [junit4]   2> 16940 T18 oass.IndexSchema.readSchema [null] Schema name=tiny
   [junit4]   2> 16944 T57 oass.IndexSchema.readSchema [null] Schema name=tiny
   [junit4]   2> 17001 T71 oass.IndexSchema.readSchema [null] Schema name=tiny
   [junit4]   2> 17021 T75 oass.IndexSchema.readSchema [null] Schema name=tiny
   [junit4]   2> 17006 T59 oass.IndexSchema.readSchema [null] Schema name=tiny
   [junit4]   2> 17055 T21 oass.IndexSchema.readSchema [null] Schema name=tiny
   [junit4]   2> 17070 T58 oasc.SolrConfig.<init> Loaded SolrConfig: solrconfig-minimal.xml
   [junit4]   2> 17071 T58 oass.IndexSchema.readSchema Reading Solr Schema from schema-tiny.xml
   [junit4]   2> 17134 T58 oass.IndexSchema.readSchema [null] Schema name=tiny
   [junit4]   2> 17144 T73 oasc.SolrConfig.<init> Loaded SolrConfig: solrconfig-minimal.xml
   [junit4]   2> 17146 T73 oass.IndexSchema.readSchema Reading Solr Schema from schema-tiny.xml
   [junit4]   2> 17169 T73 oass.IndexSchema.readSchema [null] Schema name=tiny
   [junit4]   2> 18236 T75 oass.IndexSchema.readSchema unique key field: id
   [junit4]   2> 18239 T73 oass.IndexSchema.readSchema unique key field: id
   [junit4]   2> 18244 T21 oass.IndexSchema.readSchema unique key field: id
   [junit4]   2> 18253 T70 oass.IndexSchema.readSchema unique key field: id
   [junit4]   2> 18270 T64 oass.IndexSchema.readSchema unique key field: id
   [junit4]   2> 18321 T71 oass.IndexSchema.readSchema unique key field: id
   [junit4]   2> 18327 T65 oass.IndexSchema.readSchema unique key field: id
   [junit4]   2> 18349 T17 oass.IndexSchema.readSchema unique key field: id
   [junit4]   2> 18353 T22 oass.IndexSchema.readSchema unique key field: id
   [junit4]   2> 18360 T18 oass.IndexSchema.readSchema unique key field: id
   [junit4]   2> 18362 T68 oass.IndexSchema.readSchema unique key field: id
   [junit4]   2> 18282 T59 oass.IndexSchema.readSchema unique key field: id
   [junit4]   2> 18275 T69 oass.IndexSchema.readSchema unique key field: id
   [junit4]   2> 18351 T77 oass.IndexSchema.readSchema unique key field: id
   [junit4]   2> 18385 T58 oass.IndexSchema.readSchema unique key field: id
   [junit4]   2> 18393 T57 oass.IndexSchema.readSchema unique key field: id
   [junit4]   2> 18848 T21 oasc.SolrCore.initDirectoryFactory org.apache.solr.core.MockFSDirectoryFactory
   [junit4]   2> 18856 T77 oasc.SolrCore.initDirectoryFactory org.apache.solr.core.MockFSDirectoryFactory
   [junit4]   2> 18848 T17 oasc.SolrCore.initDirectoryFactory org.apache.solr.core.MockFSDirectoryFactory
   [junit4]   2> 18848 T71 oasc.SolrCore.initDirectoryFactory org.apache.solr.core.MockFSDirectoryFactory
   [junit4]   2> 18848 T69 oasc.SolrCore.initDirectoryFactory org.apache.solr.core.MockFSDirectoryFactory
   [junit4]   2> 18864 T58 oasc.SolrCore.initDirectoryFactory org.apache.solr.core.MockFSDirectoryFactory
   [junit4]   2> 18865 T57 oasc.SolrCore.initDirectoryFactory org.apache.solr.core.MockFSDirectoryFactory
   [junit4]   2> 18866 T59 oasc.SolrCore.initDirectoryFactory org.apache.solr.core.MockFSDirectoryFactory
   [junit4]   2> 18867 T22 oasc.SolrCore.initDirectoryFactory org.apache.solr.core.MockFSDirectoryFactory
   [junit4]   2> 18868 T73 oasc.SolrCore.initDirectoryFactory org.apache.solr.core.MockFSDirectoryFactory
   [junit4]   2> 18870 T68 oasc.SolrCore.initDirectoryFactory org.apache.solr.core.MockFSDirectoryFactory
   [junit4]   2> 18871 T18 oasc.SolrCore.initDirectoryFactory org.apache.solr.core.MockFSDirectoryFactory
   [junit4]   2> 18872 T75 oasc.SolrCore.initDirectoryFactory org.apache.solr.core.MockFSDirectoryFactory
   [junit4]   2> 18875 T64 oasc.SolrCore.initDirectoryFactory org.apache.solr.core.MockFSDirectoryFactory
   [junit4]   2> 18848 T70 oasc.SolrCore.initDirectoryFactory org.apache.solr.core.MockFSDirectoryFactory
   [junit4]   2> 18876 T65 oasc.SolrCore.initDirectoryFactory org.apache.solr.core.MockFSDirectoryFactory
   [junit4]   2> 18922 T64 oasc.SolrCore.<init> [00009_core] Opening new SolrCore at /Users/jenkins/workspace/Lucene-Solr-trunk-MacOSX/solr/build/solr-core/test/J0/./OpenCloseCoreStressTest_/00009_core/, dataDir=/Users/jenkins/workspace/Lucene-Solr-trunk-MacOSX/solr/build/solr-core/test/J0/OpenCloseCoreStressTest_/00009_core/data/
   [junit4]   2> 18922 T22 oasc.SolrCore.<init> [00005_core] Opening new SolrCore at /Users/jenkins/workspace/Lucene-Solr-trunk-MacOSX/solr/build/solr-core/test/J0/./OpenCloseCoreStressTest_/00005_core/, dataDir=/Users/jenkins/workspace/Lucene-Solr-trunk-MacOSX/solr/build/solr-core/test/J0/OpenCloseCoreStressTest_/00005_core/data/
   [junit4]   2> 18922 T57 oasc.SolrCore.<init> [00016_core] Opening new SolrCore at /Users/jenkins/workspace/Lucene-Solr-trunk-MacOSX/solr/build/solr-core/test/J0/./OpenCloseCoreStressTest_/00016_core/, dataDir=/Users/jenkins/workspace/Lucene-Solr-trunk-MacOSX/solr/build/solr-core/test/J0/OpenCloseCoreStressTest_/00016_core/data/
   [junit4]   2> 18928 T73 oasc.SolrCore.<init> [00014_core] Opening new SolrCore at /Users/jenkins/workspace/Lucene-Solr-trunk-MacOSX/solr/build/solr-core/test/J0/./OpenCloseCoreStressTest_/00014_core/, dataDir=/Users/jenkins/workspace/Lucene-Solr-trunk-MacOSX/solr/build/solr-core/test/J0/OpenCloseCoreStressTest_/00014_core/data/
   [junit4]   2> 18929 T17 oasc.SolrCore.<init> [00017_core] Opening new SolrCore at /Users/jenkins/workspace/Lucene-Solr-trunk-MacOSX/solr/build/solr-core/test/J0/./OpenCloseCoreStressTest_/00017_core/, dataDir=/Users/jenkins/workspace/Lucene-Solr-trunk-MacOSX/solr/build/solr-core/test/J0/OpenCloseCoreStressTest_/00017_core/data/
   [junit4]   2> 18930 T69 oasc.SolrCore.<init> [00019_core] Opening new SolrCore at /Users/jenkins/workspace/Lucene-Solr-trunk-MacOSX/solr/build/solr-core/test/J0/./OpenCloseCoreStressTest_/00019_core/, dataDir=/Users/jenkins/workspace/Lucene-Solr-trunk-MacOSX/solr/build/solr-core/test/J0/OpenCloseCoreStressTest_/00019_core/data/
   [junit4]   2> 18932 T65 oasc.SolrCore.<init> [00001_core] Opening new SolrCore at /Users/jenkins/workspace/Lucene-Solr-trunk-MacOSX/solr/build/solr-core/test/J0/./OpenCloseCoreStressTest_/00001_core/, dataDir=/Users/jenkins/workspace/Lucene-Solr-trunk-MacOSX/solr/build/solr-core/test/J0/OpenCloseCoreStressTest_/00001_core/data/
   [junit4]   2> 18930 T71 oasc.SolrCore.<init> [00018_core] Opening new SolrCore at /Users/jenkins/workspace/Lucene-Solr-trunk-MacOSX/solr/build/solr-core/test/J0/./OpenCloseCoreStressTest_/00018_core/, dataDir=/Users/jenkins/workspace/Lucene-Solr-trunk-MacOSX/solr/build/solr-core/test/J0/OpenCloseCoreStressTest_/00018_core/data/
   [junit4]   2> 18931 T58 oasc.SolrCore.<init> [00003_core] Opening new SolrCore at /Users/jenkins/workspace/Lucene-Solr-trunk-MacOSX/solr/build/solr-core/test/J0/./OpenCloseCoreStressTest_/00003_core/, dataDir=/Users/jenkins/workspace/Lucene-Solr-trunk-MacOSX/solr/build/solr-core/test/J0/OpenCloseCoreStressTest_/00003_core/data/
   [junit4]   2> 18935 T70 oasc.SolrCore.<init> [00002_core] Opening new SolrCore at /Users/jenkins/workspace/Lucene-Solr-trunk-MacOSX/solr/build/solr-core/test/J0/./OpenCloseCoreStressTest_/00002_core/, dataDir=/Users/jenkins/workspace/Lucene-Solr-trunk-MacOSX/solr/build/solr-core/test/J0/OpenCloseCoreStressTest_/00002_core/data/
   [junit4]   2> 18935 T21 oasc.SolrCore.<init> [00012_core] Opening new SolrCore at /Users/jenkins/workspace/Lucene-Solr-trunk-MacOSX/solr/build/solr-core/test/J0/./OpenCloseCoreStressTest_/00012_core/, dataDir=/Users/jenkins/workspace/Lucene-Solr-trunk-MacOSX/solr/build/solr-core/test/J0/OpenCloseCoreStressTest_/00012_core/data/
   [junit4]   2> 18933 T75 oasc.SolrCore.<init> [00013_core] Opening new SolrCore at /Users/jenkins/workspace/Lucene-Solr-trunk-MacOSX/solr/build/solr-core/test/J0/./OpenCloseCoreStressTest_/00013_core/, dataDir=/Users/jenkins/workspace/Lucene-Solr-trunk-MacOSX/solr/build/solr-core/test/J0/OpenCloseCoreStressTest_/00013_core/data/
   [junit4]   2> 18949 T75 oasc.JmxMonitoredMap.<init> No JMX servers found, not exposing Solr information with JMX.
   [junit4]   2> 18959 T17 oasc.JmxMonitoredMap.<init> No JMX servers found, not exposing Solr information with JMX.
   [junit4]   2> 18933 T77 oasc.SolrCore.<init> [00004_core] Opening new SolrCore at /Users/jenkins/workspace/Lucene-Solr-trunk-MacOSX/solr/build/solr-core/test/J0/./OpenCloseCoreStressTest_/00004_core/, dataDir=/Users/jenkins/workspace/Lucene-Solr-trunk-MacOSX/solr/build/solr-core/test/J0/OpenCloseCoreStressTest_/00004_core/data/
   [junit4]   2> 18932 T18 oasc.SolrCore.<init> [00007_core] Opening new SolrCore at /Users/jenkins/workspace/Lucene-Solr-trunk-MacOSX/solr/build/solr-core/test/J0/./OpenCloseCoreStressTest_/00007_core/, dataDir=/Users/jenkins/workspace/Lucene-Solr-trunk-MacOSX/solr/build/solr-core/test/J0/OpenCloseCoreStressTest_/00007_core/data/
   [junit4]   2> 18932 T68 oasc.SolrCore.<init> [00008_core] Opening new SolrCore at /Users/jenkins/workspace/Lucene-Solr-trunk-MacOSX/solr/build/solr-core/test/J0/./OpenCloseCoreStressTest_/00008_core/, dataDir=/Users/jenkins/workspace/Lucene-Solr-trunk-MacOSX/solr/build/solr-core/test/J0/OpenCloseCoreStressTest_/00008_core/data/
   [junit4]   2> 18985 T18 oasc.JmxMonitoredMap.<init> No JMX servers found, not exposing Solr information with JMX.
   [junit4]   2> 18984 T77 oasc.JmxMonitoredMap.<init> No JMX servers found, not exposing Solr information with JMX.
   [junit4]   2> 18961 T58 oasc.JmxMonitoredMap.<init> No JMX servers found, not exposing Solr information with JMX.
   [junit4]   2> 18961 T21 oasc.JmxMonitoredMap.<init> No JMX servers found, not exposing Solr information with JMX.
   [junit4]   2> 18961 T64 oasc.JmxMonitoredMap.<init> No JMX servers found, not exposing Solr information with JMX.
   [junit4]   2> 18960 T71 oasc.JmxMonitoredMap.<init> No JMX servers found, not exposing Solr information with JMX.
   [junit4]   2> 18960 T65 oasc.JmxMonitoredMap.<init> No JMX servers found, not exposing Solr information with JMX.
   [junit4]   2> 18960 T69 oasc.JmxMonitoredMap.<init> No JMX servers found, not exposing Solr information with JMX.
   [junit4]   2> 18960 T73 oasc.JmxMonitoredMap.<init> No JMX servers found, not exposing Solr information with JMX.
   [junit4]   2> 18960 T22 oasc.JmxMonitoredMap.<init> No JMX servers found, not exposing Solr information with JMX.
   [junit4]   2> 18959 T57 oasc.JmxMonitoredMap.<init> No JMX servers found, not exposing Solr information with JMX.
   [junit4]   2> 18949 T70 oasc.JmxMonitoredMap.<init> No JMX servers found, not exposing Solr information with JMX.
   [junit4]   2> 18936 T59 oasc.SolrCore.<init> [00000_core] Opening new SolrCore at /Users/jenkins/workspace/Lucene-Solr-trunk-MacOSX/solr/build/solr-core/test/J0/./OpenCloseCoreStressTest_/00000_core/, dataDir=/Users/jenkins/workspace/Lucene-Solr-trunk-MacOSX/solr/build/solr-core/test/J0/OpenCloseCoreStressTest_/00000_core/data/
   [junit4]   2> 18985 T68 oasc.JmxMonitoredMap.<init> No JMX servers found, not exposing Solr information with JMX.
   [junit4]   2> 19093 T59 oasc.JmxMonitoredMap.<init> No JMX servers found, not exposing Solr information with JMX.
   [junit4]   2> 19189 T73 oasc.CachingDirectoryFactory.get return new directory for /Users/jenkins/workspace/Lucene-Solr-trunk-MacOSX/solr/build/solr-core/test/J0/OpenCloseCoreStressTest_/00014_core/data
   [junit4]   2> 19191 T59 oasc.CachingDirectoryFactory.get return new directory for /Users/jenkins/workspace/Lucene-Solr-trunk-MacOSX/solr/build/solr-core/test/J0/OpenCloseCoreStressTest_/00000_core/data
   [junit4]   2> 19190 T71 oasc.CachingDirectoryFactory.get return new directory for /Users/jenkins/workspace/Lucene-Solr-trunk-MacOSX/solr/build/solr-core/test/J0/OpenCloseCoreStressTest_/00018_core/data
   [junit4]   2> 19193 T21 oasc.CachingDirectoryFactory.get return new directory for /Users/jenkins/workspace/Lucene-Solr-trunk-MacOSX/solr/build/solr-core/test/J0/OpenCloseCoreStressTest_/00012_core/data
   [junit4]   2> 19194 T59 oasc.SolrCore.getNewIndexDir New index directory detected: old=null new=/Users/jenkins/workspace/Lucene-Solr-trunk-MacOSX/solr/build/solr-core/test/J0/OpenCloseCoreStressTest_/00000_core/data/index/
   [junit4]   2> 19194 T21 oasc.SolrCore.getNewIndexDir New index directory detected: old=null new=/Users/jenkins/workspace/Lucene-Solr-trunk-MacOSX/solr/build/solr-core/test/J0/OpenCloseCoreStressTest_/00012_core/data/index/
   [junit4]   2> 19195 T59 oasc.SolrCore.initIndex WARN [00000_core] Solr index directory '/Users/jenkins/workspace/Lucene-Solr-trunk-MacOSX/solr/build/solr-core/test/J0/OpenCloseCoreStressTest_/00000_core/data/index' doesn't exist. Creating new index...
   [junit4]   2> 19190 T58 oasc.CachingDirectoryFactory.get return new directory for /Users/jenkins/workspace/Lucene-Solr-trunk-MacOSX/solr/build/solr-core/test/J0/OpenCloseCoreStressTest_/00003_core/data
   [junit4]   2> 19197 T58 oasc.SolrCore.getNewIndexDir New index directory detected: old=null new=/Users/jenkins/workspace/Lucene-Solr-trunk-MacOSX/solr/build/solr-core/test/J0/OpenCloseCoreStressTest_/00003_core/data/index/
   [junit4]   2> 19199 T58 oasc.SolrCore.initIndex WARN [00003_core] Solr index directory '/Users/jenkins/workspace/Lucene-Solr-trunk-MacOSX/solr/build/solr-core/test/J0/OpenCloseCoreStressTest_/00003_core/data/index' doesn't exist. Creating new index...
   [junit4]   2> 19190 T18 oasc.CachingDirectoryFactory.get return new directory for /Users/jenkins/workspace/Lucene-Solr-trunk-MacOSX/solr/build/solr-core/test/J0/OpenCloseCoreStressTest_/00007_core/data
   [junit4]   2> 19196 T21 oasc.SolrCore.initIndex WARN [00012_core] Solr index directory '/Users/jenkins/workspace/Lucene-Solr-trunk-MacOSX/solr/build/solr-core/test/J0/OpenCloseCoreStressTest_/00012_core/data/index' doesn't exist. Creating new index...
   [junit4]   2> 19194 T71 oasc.SolrCore.getNewIndexDir New index directory detected: old=null new=/Users/jenkins/workspace/Lucene-Solr-trunk-MacOSX/solr/build/solr-core/test/J0/OpenCloseCoreStressTest_/00018_core/data/index/
   [junit4]   2> 19204 T71 oasc.SolrCore.initIndex WARN [00018_core] Solr index directory '/Users/jenkins/workspace/Lucene-Solr-trunk-MacOSX/solr/build/solr-core/test/J0/OpenCloseCoreStressTest_/00018_core/data/index' doesn't exist. Creating new index...
   [junit4]   2> 19206 T18 oasc.SolrCore.getNewIndexDir New index directory detected: old=null new=/Users/jenkins/workspace/Lucene-Solr-trunk-MacOSX/solr/build/solr-core/test/J0/OpenCloseCoreStressTest_/00007_core/data/index/
   [junit4]   2> 19207 T18 oasc.SolrCore.initIndex WARN [00007_core] Solr index directory '/Users/jenkins/workspace/Lucene-Solr-trunk-MacOSX/solr/build/solr-core/test/J0/OpenCloseCoreStressTest_/00007_core/data/index' doesn't exist. Creating new index...
   [junit4]   2> 19193 T64 oasc.CachingDirectoryFactory.get return new directory for /Users/jenkins/workspace/Lucene-Solr-trunk-MacOSX/solr/build/solr-core/test/J0/OpenCloseCoreStressTest_/00009_core/data
   [junit4]   2> 19193 T65 oasc.CachingDirectoryFactory.get return new directory for /Users/jenkins/workspace/Lucene-Solr-trunk-MacOSX/solr/build/solr-core/test/J0/OpenCloseCoreStressTest_/00001_core/data
   [junit4]   2> 19193 T57 oasc.CachingDirectoryFactory.get return new directory for /Users/jenkins/workspace/Lucene-Solr-trunk-MacOSX/solr/build/solr-core/test/J0/OpenCloseCoreStressTest_/00016_core/data
   [junit4]   2> 19211 T64 oasc.SolrCore.getNewIndexDir New index directory detected: old=null new=/Users/jenkins/workspace/Lucene-Solr-trunk-MacOSX/solr/build/solr-core/test/J0/OpenCloseCoreStressTest_/00009_core/data/index/
   [junit4]   2> 19213 T64 oasc.SolrCore.initIndex WARN [00009_core] Solr index directory '/Users/jenkins/workspace/Lucene-Solr-trunk-MacOSX/solr/build/solr-core/test/J0/OpenCloseCoreStressTest_/00009_core/data/index' doesn't exist. Creating new index...
   [junit4]   2> 19214 T57 oasc.SolrCore.getNewIndexDir New index directory detected: old=null new=/Users/jenkins/workspace/Lucene-Solr-trunk-MacOSX/solr/build/solr-core/test/J0/OpenCloseCoreStressTest_/00016_core/data/index/
   [junit4]   2> 19216 T57 oasc.SolrCore.initIndex WARN [00016_core] Solr index directory '/Users/jenkins/workspace/Lucene-Solr-trunk-MacOSX/solr/build/solr-core/test/J0/OpenCloseCoreStressTest_/00016_core/data/index' doesn't exist. Creating new index...
   [junit4]   2> 19192 T22 oasc.CachingDirectoryFactory.get return new directory for /Users/jenkins/workspace/Lucene-Solr-trunk-MacOSX/solr/build/solr-core/test/J0/OpenCloseCoreStressTest_/00005_core/data
   [junit4]   2> 19192 T17 oasc.CachingDirectoryFactory.get return new directory for /Users/jenkins/workspace/Lucene-Solr-trunk-MacOSX/solr/build/solr-core/test/J0/OpenCloseCoreStressTest_/00017_core/data
   [junit4]   2> 19192 T69 oasc.CachingDirectoryFactory.get return new directory for /Users/jenkins/workspace/Lucene-Solr-trunk-MacOSX/solr/build/solr-core/test/J0/OpenCloseCoreStressTest_/00019_core/data
   [junit4]   2> 19192 T70 oasc.CachingDirectoryFactory.get return new directory for /Users/jenkins/workspace/Lucene-Solr-trunk-MacOSX/solr/build/solr-core/test/J0/OpenCloseCoreStressTest_/00002_core/data
   [junit4]   2> 19221 T17 oasc.SolrCore.getNewIndexDir New index directory detected: old=null new=/Users/jenkins/workspace/Lucene-Solr-trunk-MacOSX/solr/build/solr-core/test/J0/OpenCloseCoreStressTest_/00017_core/data/index/
   [junit4]   2> 19192 T68 oasc.CachingDirectoryFactory.get return new directory for /Users/jenkins/workspace/Lucene-Solr-trunk-MacOSX/solr/build/solr-core/test/J0/OpenCloseCoreStressTest_/00008_core/data
   [junit4]   2> 19192 T77 oasc.CachingDirectoryFactory.get return new directory for /Users/jenkins/workspace/Lucene-Solr-trunk-MacOSX/solr/build/solr-core/test/J0/OpenCloseCoreStressTest_/00004_core/data
   [junit4]   2> 19191 T73 oasc.SolrCore.getNewIndexDir New index directory detected: old=null new=/Users/jenkins/workspace/Lucene-Solr-trunk-MacOSX/solr/build/solr-core/test/J0/OpenCloseCoreStressTest_/00014_core/data/index/
   [junit4]   2> 19225 T73 oasc.SolrCore.initIndex WARN [00014_core] Solr index directory '/Users/jenkins/workspace/Lucene-Solr-trunk-MacOSX/solr/build/solr-core/test/J0/OpenCloseCoreStressTest_/00014_core/data/index' doesn't exist. Creating new index...
   [junit4]   2> 19226 T68 oasc.SolrCore.getNewIndexDir New index directory detected: old=null new=/Users/jenkins/workspace/Lucene-Solr-trunk-MacOSX/solr/build/solr-core/test/J0/OpenCloseCoreStressTest_/00008_core/data/index/
   [junit4]   2> 19227 T68 oasc.SolrCore.initIndex WARN [00008_core] Solr index directory '/Users/jenkins/workspace/Lucene-Solr-trunk-MacOSX/solr/build/solr-core/test/J0/OpenCloseCoreStressTest_/00008_core/data/index' doesn't exist. Creating new index...
   [junit4]   2> 19228 T57 oasc.CachingDirectoryFactory.get return new directory for /Users/jenkins/workspace/Lucene-Solr-trunk-MacOSX/solr/build/solr-core/test/J0/OpenCloseCoreStressTest_/00016_core/data/index
   [junit4]   2> 19189 T75 oasc.CachingDirectoryFactory.get return new directory for /Users/jenkins/workspace/Lucene-Solr-trunk-MacOSX/solr/build/solr-core/test/J0/OpenCloseCoreStressTest_/00013_core/data
   [junit4]   2> 19231 T70 oasc.SolrCore.getNewIndexDir New index directory detected: old=null new=/Users/jenkins/workspace/Lucene-Solr-trunk-MacOSX/solr/build/solr-core/test/J0/OpenCloseCoreStressTest_/00002_core/data/index/
   [junit4]   2> 19232 T57 oasu.RandomMergePolicy.<init> RandomMergePolicy wrapping class org.apache.lucene.index.TieredMergePolicy: [TieredMergePolicy: maxMergeAtOnce=36, maxMergeAtOnceExplicit=42, maxMergedSegmentMB=92.3056640625, floorSegmentMB=2.072265625, forceMergeDeletesPctAllowed=2.2700212450342883, segmentsPerTier=28.0, maxCFSSegmentSizeMB=8.796093022207999E12, noCFSRatio=0.12376985396688199
   [junit4]   2> 19234 T77 oasc.SolrCore.getNewIndexDir New index directory detected: old=null new=/Users/jenkins/workspace/Lucene-Solr-trunk-MacOSX/solr/build/solr-core/test/J0/OpenCloseCoreStressTest_/00004_core/data/index/
   [junit4]   2> 19236 T77 oasc.SolrCore.initIndex WARN [00004_core] Solr index directory '/Users/jenkins/workspace/Lucene-Solr-trunk-MacOSX/solr/build/solr-core/test/J0/OpenCloseCoreStressTest_/00004_core/data/index' doesn't exist. Creating new index...
   [junit4]   2> 19237 T59 oasc.CachingDirectoryFactory.get return new directory for /Users/jenkins/workspace/Lucene-Solr-trunk-MacOSX/solr/build/solr-core/test/J0/OpenCloseCoreStressTest_/00000_core/data/index
   [junit4]   2> 19238 T64 oasc.CachingDirectoryFactory.get return new directory for /Users/jenkins/workspace/Lucene-Solr-trunk-MacOSX/solr/build/solr-core/test/J0/OpenCloseCoreStressTest_/00009_core/data/index
   [junit4]   2> 19225 T69 oasc.SolrCore.getNewIndexDir New index directory detected: old=null new=/Users/jenkins/workspace/Lucene-Solr-trunk-MacOSX/solr/build/solr-core/test/J0/OpenCloseCoreStressTest_/00019_core/data/index/
   [junit4]   2> 19243 T69 oasc.SolrCore.initIndex WARN [00019_core] Solr index directory '/Users/jenkins/workspace/Lucene-Solr-trunk-MacOSX/solr/build/solr-core/test/J0/OpenCloseCoreStressTest_/00019_core/data/index' doesn't exist. Creating new index...
   [junit4]   2> 19223 T17 oasc.SolrCore.initIndex WARN [00017_core] Solr index directory '/Users/jenkins/workspace/Lucene-Solr-trunk-MacOSX/solr/build/solr-core/test/J0/OpenCloseCoreStressTest_/00017_core/data/index' doesn't exist. Creating new index...
   [junit4]   2> 19245 T64 oasu.RandomMergePolicy.<init> RandomMergePolicy wrapping class org.apache.lucene.index.TieredMergePolicy: [TieredMergePolicy: maxMergeAtOnce=36, maxMergeAtOnceExplicit=42, maxMergedSegmentMB=92.3056640625, floorSegmentMB=2.072265625, forceMergeDeletesPctAllowed=2.2700212450342883, segmentsPerTier=28.0, maxCFSSegmentSizeMB=8.796093022207999E12, noCFSRatio=0.12376985396688199
   [junit4]   2> 19221 T65 oasc.SolrCore.getNewIndexDir New index directory detected: old=null new=/Users/jenkins/workspace/Lucene-Solr-trunk-MacOSX/solr/build/solr-core/test/J0/OpenCloseCoreStressTest_/00001_core/data/index/
   [junit4]   2> 19220 T22 oasc.SolrCore.getNewIndexDir New index directory detected: old=null new=/Users/jenkins/workspace/Lucene-Solr-trunk-MacOSX/solr/build/solr-core/test/J0/OpenCloseCoreStressTest_/00005_core/data/index/
   [junit4]   2> 19255 T22 oasc.SolrCore.initIndex WARN [00005_core] Solr index directory '/Users/jenkins/workspace/Lucene-Solr-trunk-MacOSX/solr/build/solr-core/test/J0/OpenCloseCoreStressTest_/00005_core/data/index' doesn't exist. Creating new index...
   [junit4]   2> 19257 T65 oasc.SolrCore.initIndex WARN [00001_core] Solr index directory '/Users/jenkins/workspace/Lucene-Solr-trunk-MacOSX/solr/build/solr-core/test/J0/OpenCloseCoreStressTest_/00001_core/data/index' doesn't exist. Creating new index...
   [junit4]   2> 19259 T75 oasc.SolrCore.getNewIndexDir New index directory detected: old=null new=/Users/jenkins/workspace/Lucene-Solr-trunk-MacOSX/solr/build/solr-core/test/J0/OpenCloseCoreStressTest_/00013_core/data/index/
   [junit4]   2> 19260 T75 oasc.SolrCore.initIndex WARN [00013_core] Solr index directory '/Users/jenkins/workspace/Lucene-Solr-trunk-MacOSX/solr/build/solr-core/test/J0/OpenCloseCoreStressTest_/00013_core/data/index' doesn't exist. Creating new index...
   [junit4]   2> 19247 T77 oasc.CachingDirectoryFactory.get return new directory for /Users/jenkins/workspace/Lucene-Solr-trunk-MacOSX/solr/build/solr-core/test/J0/OpenCloseCoreStressTest_/00004_core/data/index
   [junit4]   2> 19262 T77 oasu.RandomMergePolicy.<init> RandomMergePolicy wrapping class org.apache.lucene.index.TieredMergePolicy: [TieredMergePolicy: maxMergeAtOnce=36, maxMergeAtOnceExplicit=42, maxMergedSegmentMB=92.3056640625, floorSegmentMB=2.072265625, forceMergeDeletesPctAllowed=2.2700212450342883, segmentsPerTier=28.0, maxCFSSegmentSizeMB=8.796093022207999E12, noCFSRatio=0.12376985396688199
   [junit4]   2> 19247 T21 oasc.CachingDirectoryFactory.get return new directory for /Users/jenkins/workspace/Lucene-Solr-trunk-MacOSX/solr/build/solr-core/test/J0/OpenCloseCoreStressTest_/00012_core/data/index
   [junit4]   2> 19275 T21 oasu.RandomMergePolicy.<init> RandomMergePolicy wrapping class org.apache.lucene.index.TieredMergePolicy: [TieredMergePolicy: maxMergeAtOnce=36, maxMergeAtOnceExplicit=42, maxMergedSegmentMB=92.3056640625, floorSegmentMB=2.072265625, forceMergeDeletesPctAllowed=2.2700212450342883, segmentsPerTier=28.0, maxCFSSegmentSizeMB=8.796093022207999E12, noCFSRatio=0.12376985396688199
   [junit4]   2> 19247 T17 oasc.CachingDirectoryFactory.get return new directory for /Users/jenkins/workspace/Lucene-Solr-trunk-MacOSX/solr/build/solr-core/test/J0/OpenCloseCoreStressTest_/00017_core/data/index
   [junit4]   2> 19277 T17 oasu.RandomMergePolicy.<init> RandomMergePolicy wrapping class org.apache.lucene.index.TieredMergePolicy: [TieredMergePolicy: maxMergeAtOnce=36, maxMergeAtOnceExplicit=42, maxMergedSegmentMB=92.3056640625, floorSegmentMB=2.072265625, forceMergeDeletesPctAllowed=2.2700212450342883, segmentsPerTier=28.0, maxCFSSegmentSizeMB=8.796093022207999E12, noCFSRatio=0.12376985396688199
   [junit4]   2> 19247 T69 oasc.CachingDirectoryFactory.get return new directory for /Users/jenkins/workspace/Lucene-Solr-trunk-MacOSX/solr/build/solr-core/test/J0/OpenCloseCoreStressTest_/00019_core/data/index
   [junit4]   2> 19279 T69 oasu.RandomMergePolicy.<init> RandomMergePolicy wrapping class org.apache.lucene.index.TieredMergePolicy: [TieredMergePolicy: maxMergeAtOnce=36, maxMergeAtOnceExplicit=42, maxMergedSegmentMB=92.3056640625, floorSegmentMB=2.072265625, forceMergeDeletesPctAllowed=2.2700212450342883, segmentsPerTier=28.0, maxCFSSegmentSizeMB=8.796093022207999E12, noCFSRatio=0.12376985396688199
   [junit4]   2> 19241 T71 oasc.CachingDirectoryFactory.get return new directory for /Users/jenkins/workspace/Lucene-Solr-trunk-MacOSX/solr/build/solr-core/test/J0/OpenCloseCoreStressTest_/00018_core/data/index
   [junit4]   2> 19284 T71 oasu.RandomMergePolicy.<init> RandomMergePolicy wrapping class org.apache.lucene.index.TieredMergePolicy: [TieredMergePolicy: maxMergeAtOnce=36, maxMergeAtOnceExplicit=42, maxMergedSegmentMB=92.3056640625, floorSegmentMB=2.072265625, forceMergeDeletesPctAllowed=2.2700212450342883, segmentsPerTier=28.0, maxCFSSegmentSizeMB=8.796093022207999E12, noCFSRatio=0.12376985396688199
   [junit4]   2> 19241 T68 oasc.CachingDirectoryFactory.get return new directory for /Users/jenkins/workspace/Lucene-Solr-trunk-MacOSX/solr/build/solr-core/test/J0/OpenCloseCoreStressTest_/00008_core/data/index
   [junit4]   2> 19238 T59 oasu.RandomMergePolicy.<init> RandomMergePolicy wrapping class org.apache.lucene.index.TieredMergePolicy: [TieredMergePolicy: maxMergeAtOnce=36, maxMergeAtOnceExplicit=42, maxMergedSegmentMB=92.3056640625, floorSegmentMB=2.072265625, forceMergeDeletesPctAllowed=2.2700212450342883, segmentsPerTier=28.0, maxCFSSegmentSizeMB=8.796093022207999E12, noCFSRatio=0.12376985396688199
   [junit4]   2> 19287 T68 oasu.RandomMergePolicy.<init> RandomMergePolicy wrapping class org.apache.lucene.index.TieredMergePolicy: [TieredMergePolicy: maxMergeAtOnce=36, maxMergeAtOnceExplicit=42, maxMergedSegmentMB=92.3056640625, floorSegmentMB=2.072265625, forceMergeDeletesPctAllowed=2.2700212450342883, segmentsPerTier=28.0, maxCFSSegmentSizeMB=8.796093022207999E12, noCFSRatio=0.12376985396688199
   [junit4]   2> 19239 T73 oasc.CachingDirectoryFactory.get return new directory for /Users/jenkins/workspace/Lucene-Solr-trunk-MacOSX/solr/build/solr-core/test/J0/OpenCloseCoreStressTest_/00014_core/data/index
   [junit4]   2> 19289 T73 oasu.RandomMergePolicy.<init> RandomMergePolicy wrapping class org.apache.lucene.index.TieredMergePolicy: [TieredMergePolicy: maxMergeAtOnce=36, maxMergeAtOnceExplicit=42, maxMergedSegmentMB=92.3056640625, floorSegmentMB=2.072265625, forceMergeDeletesPctAllowed=2.2700212450342883, segmentsPerTier=28.0, maxCFSSegmentSizeMB=8.796093022207999E12, noCFSRatio=0.12376985396688199
   [junit4]   2> 19238 T58 oasc.CachingDirectoryFactory.get return new directory for /Users/jenkins/workspace/Lucene-Solr-trunk-MacOSX/solr/build/solr-core/test/J0/OpenCloseCoreStressTest_/00003_core/data/index
   [junit4]   2> 19293 T58 oasu.RandomMergePolicy.<init> RandomMergePolicy wrapping class org.apache.lucene.index.TieredMergePolicy: [TieredMergePolicy: maxMergeAtOnce=36, maxMergeAtOnceExplicit=42, maxMergedSegmentMB=92.3056640625, floorSegmentMB=2.072265625, forceMergeDeletesPctAllowed=2.2700212450342883, segmentsPerTier=28.0, maxCFSSegmentSizeMB=8.796093022207999E12, noCFSRatio=0.12376985396688199
   [junit4]   2> 19233 T70 oasc.SolrCore.initIndex WARN [00002_core] Solr index directory '/Users/jenkins/workspace/Lucene-Solr-trunk-MacOSX/solr/build/solr-core/test/J0/OpenCloseCoreStressTest_/00002_core/data/index' doesn't exist. Creating new index...
   [junit4]   2> 19263 T18 oasc.CachingDirectoryFactory.get return new directory for /Users/jenkins/workspace/Lucene-Solr-trunk-MacOSX/solr/build/solr-core/test/J0/OpenCloseCoreStressTest_/00007_core/data/index
   [junit4]   2> 19297 T18 oasu.RandomMergePolicy.<init> RandomMergePolicy wrapping class org.apache.lucene.index.TieredMergePolicy: [TieredMergePolicy: maxMergeAtOnce=36, maxMergeAtOnceExplicit=42, maxMergedSegmentMB=92.3056640625, floorSegmentMB=2.072265625, forceMergeDeletesPctAllowed=2.2700212450342883, segmentsPerTier=28.0, maxCFSSegmentSizeMB=8.796093022207999E12, noCFSRatio=0.12376985396688199
   [junit4]   2> 19262 T75 oasc.CachingDirectoryFactory.get return new directory for /Users/jenkins/workspace/Lucene-Solr-trunk-MacOSX/solr/build/solr-core/test/J0/OpenCloseCoreStressTest_/00013_core/data/index
   [junit4]   2> 19310 T75 oasu.RandomMergePolicy.<init> RandomMergePolicy wrapping class org.apache.lucene.index.TieredMergePolicy: [TieredMergePolicy: maxMergeAtOnce=36, maxMergeAtOnceExplicit=42, maxMergedSegmentMB=92.3056640625, floorSegmentMB=2.072265625, forceMergeDeletesPctAllowed=2.2700212450342883, segmentsPerTier=28.0, maxCFSSegmentSizeMB=8.796093022207999E12, noCFSRatio=0.12376985396688199
   [junit4]   2> 19262 T65 oasc.CachingDirectoryFactory.get return new directory for /Users/jenkins/workspace/Lucene-Solr-trunk-MacOSX/solr/build/solr-core/test/J0/OpenCloseCoreStressTest_/00001_core/data/index
   [junit4]   2> 19261 T22 oasc.CachingDirectoryFactory.get return new directory for /Users/jenkins/workspace/Lucene-Solr-trunk-MacOSX/solr/build/solr-core/test/J0/OpenCloseCoreStressTest_/00005_core/data/index
   [junit4]   2> 19318 T22 oasu.RandomMergePolicy.<init> RandomMergePolicy wrapping class org.apache.lucene.index.TieredMergePolicy: [TieredMergePolicy: maxMergeAtOnce=36, maxMergeAtOnceExplicit=42, maxMergedSegmentMB=92.3056640625, floorSegmentMB=2.072265625, forceMergeDeletesPctAllowed=2.2700212450342883, segmentsPerTier=28.0, maxCFSSegmentSizeMB=8.796093022207999E12, noCFSRatio=0.12376985396688199
   [junit4]   2> 19320 T65 oasu.RandomMergePolicy.<init> RandomMergePolicy wrapping class org.apache.lucene.index.TieredMergePolicy: [TieredMergePolicy: maxMergeAtOnce=36, maxMergeAtOnceExplicit=42, maxMergedSegmentMB=92.3056640625, floorSegmentMB=2.072265625, forceMergeDeletesPctAllowed=2.2700212450342883, segmentsPerTier=28.0, maxCFSSegmentSizeMB=8.796093022207999E12, noCFSRatio=0.12376985396688199
   [junit4]   2> 19371 T70 oasc.CachingDirectoryFactory.get return new directory for /Users/jenkins/workspace/Lucene-Solr-trunk-MacOSX/solr/build/solr-core/test/J0/OpenCloseCoreStressTest_/00002_core/data/index
   [junit4]   2> 19373 T70 oasu.RandomMergePolicy.<init> RandomMergePolicy wrapping class org.apache.lucene.index.TieredMergePolicy: [TieredMergePolicy: maxMergeAtOnce=36, maxMergeAtOnceExplicit=42, maxMergedSegmentMB=92.3056640625, floorSegmentMB=2.072265625, forceMergeDeletesPctAllowed=2.2700212450342883, segmentsPerTier=28.0, maxCFSSegmentSizeMB=8.796093022207999E12, noCFSRatio=0.12376985396688199
   [junit4]   2> 19599 T75 oasc.SolrDeletionPolicy.onCommit SolrDeletionPolicy.onCommit: commits: num=1
   [junit4]   2> commit{dir=MockDirWrapper(org.apache.lucene.store.NIOFSDirectory@/Users/jenkins/workspace/Lucene-Solr-trunk-MacOSX/solr/build/solr-core/test/J0/OpenCloseCoreStressTest_/00013_core/data/index lockFactory=org.apache.lucene.store.SingleInstanceLockFactory@6675b940),segFN=segments_1,generation=1}
   [junit4]   2> 19603 T73 oasc.SolrDeletionPolicy.onCommit SolrDeletionPolicy.onCommit: commits: num=1
   [junit4]   2> commit{dir=MockDirWrapper(org.apache.lucene.store.NIOFSDirectory@/Users/jenkins/workspace/Lucene-Solr-trunk-MacOSX/solr/build/solr-core/test/J0/OpenCloseCoreStressTest_/00014_core/data/index lockFactory=org.apache.lucene.store.SingleInstanceLockFactory@3ad54d4d),segFN=segments_1,generation=1}
   [junit4]   2> 19604 T69 oasc.SolrDeletionPolicy.onCommit SolrDeletionPolicy.onCommit: commits: num=1
   [junit4]   2> commit{dir=MockDirWrapper(org.apache.lucene.store.NIOFSDirectory@/Users/jenkins/workspace/Lucene-Solr-trunk-MacOSX/solr/build/solr-core/test/J0/OpenCloseCoreStressTest_/00019_core/data/index lockFactory=org.apache.lucene.store.SingleInstanceLockFactory@5b0b28df),segFN=segments_1,generation=1}
   [junit4]   2> 19605 T59 oasc.SolrDeletionPolicy.onCommit SolrDeletionPolicy.onCommit: commits: num=1
   [junit4]   2> commit{dir=MockDirWrapper(org.apache.lucene.store.NIOFSDirectory@/Users/jenkins/workspace/Lucene-Solr-trunk-MacOSX/solr/build/solr-core/test/J0/OpenCloseCoreStressTest_/00000_core/data/index lockFactory=org.apache.lucene.store.SingleInstanceLockFactory@39a8772b),segFN=segments_1,generation=1}
   [junit4]   2> 19606 T22 oasc.SolrDeletionPolicy.onCommit SolrDeletionPolicy.onCommit: commits: num=1
   [junit4]   2> commit{dir=MockDirWrapper(org.apache.lucene.store.NIOFSDirectory@/Users/jenkins/workspace/Lucene-Solr-trunk-MacOSX/solr/build/solr-core/test/J0/OpenCloseCoreStressTest_/00005_core/data/index lockFactory=org.apache.lucene.store.SingleInstanceLockFactory@751274c0),segFN=segments_1,generation=1}
   [junit4]   2> 19606 T22 oasc.SolrDeletionPolicy.updateCommits newest commit generation = 1
   [junit4]   2> 19603 T18 oasc.SolrDeletionPolicy.onCommit SolrDeletionPolicy.onCommit: commits: num=1
   [junit4]   2> commit{dir=MockDirWrapper(org.apache.lucene.store.NIOFSDirectory@/Users/jenkins/workspace/Lucene-Solr-trunk-MacOSX/solr/build/solr-core/test/J0/OpenCloseCoreStressTest_/00007_core/data/index lockFactory=org.apache.lucene.store.SingleInstanceLockFactory@7d3da8a5),segFN=segments_1,generation=1}
   [junit4]   2> 19608 T18 oasc.SolrDeletionPolicy.updateCommits newest commit generation = 1
   [junit4]   2> 19603 T17 oasc.SolrDeletionPolicy.onCommit SolrDeletionPolicy.onCommit: commits: num=1
   [junit4]   2> commit{dir=MockDirWrapper(org.apache.lucene.store.NIOFSDirectory@/Users/jenkins/workspace/Lucene-Solr-trunk-MacOSX/solr/build/solr-core/test/J0/OpenCloseCoreStressTest_/00017_core/data/index lockFactory=org.apache.lucene.store.SingleInstanceLockFactory@2c6c58db),segFN=segments_1,generation=1}
   [junit4]   2> 19610 T17 oasc.SolrDeletionPolicy.updateCommits newest commit generation = 1
   [junit4]   2> 19603 T77 oasc.SolrDeletionPolicy.onCommit SolrDeletionPolicy.onCommit: commits: num=1
   [junit4]   2> commit{dir=MockDirWrapper(org.apache.lucene.store.NIOFSDirectory@/Users/jenkins/workspace/Lucene-Solr-trunk-MacOSX/solr/build/solr-core/test/J0/OpenCloseCoreStressTest_/00004_core/data/index lockFactory=org.apache.lucene.store.SingleInstanceLockFactory@9c61868),segFN=segments_1,generation=1}
   [junit4]   2> 19612 T77 oasc.SolrDeletionPolicy.updateCommits newest commit generation = 1
   [junit4]   2> 19612 T21 oasc.SolrDeletionPolicy.onCommit SolrDeletionPolicy.onCommit: commits: num=1
   [junit4]   2> commit{dir=MockDirWrapper(org.apache.lucene.store.NIOFSDirectory@/Users/jenkins/workspace/Lucene-Solr-trunk-MacOSX/solr/build/solr-core/test/J0/OpenCloseCoreStressTest_/00012_core/data/index lockFactory=org.apache.lucene.store.SingleInstanceLockFactory@da4791a),segFN=segments_1,generation=1}
   [junit4]   2> 19613 T21 oasc.SolrDeletionPolicy.updateCommits newest commit generation = 1
   [junit4]   2> 19611 T71 oasc.SolrDeletionPolicy.onCommit SolrDeletionPolicy.onCommit: commits: num=1
   [junit4]   2> commit{dir=MockDirWrapper(org.apache.lucene.store.NIOFSDirectory@/Users/jenkins/workspace/Lucene-Solr-trunk-MacOSX/solr/build/solr-core/test/J0/OpenCloseCoreStressTest_/00018_core/data/index lockFactory=org.apache.lucene.store.SingleInstanceLockFactory@53f21ba0),segFN=segments_1,generation=1}
   [junit4]   2> 19615 T71 oasc.SolrDeletionPolicy.updateCommits newest commit generation = 1
   [junit4]   2> 19610 T57 oasc.SolrDeletionPolicy.onCommit SolrDeletionPolicy.onCommit: commits: num=1
   [junit4]   2> commit{dir=MockDirWrapper(org.apache.lucene.store.NIOFSDirectory@/Users/jenkins/workspace/Lucene-Solr-trunk-MacOSX/solr/build/solr-core/test/J0/OpenCloseCoreStressTest_/00016_core/data/index lockFactory=org.apache.lucene.store.SingleInstanceLockFactory@cb9a81c),segFN=segments_1,generation=1}
   [junit4]   2> 19622 T57 oasc.SolrDeletionPolicy.updateCommits newest commit generation = 1
   [junit4]   2> 19606 T73 oasc.SolrDeletionPolicy.updateCommits newest commit generation = 1
   [junit4]   2> 19606 T65 oasc.SolrDeletionPolicy.onCommit SolrDeletionPolicy.onCommit: commits: num=1
   [junit4]   2> commit{dir=MockDirWrapper(org.apache.lucene.store.NIOFSDirectory@/Users/jenkins/workspace/Lucene-Solr-trunk-MacOSX/solr/build/solr-core/test/J0/OpenCloseCoreStressTest_/00001_core/data/index lockFactory=org.apache.lucene.store.SingleInstanceLockFactory@eaf254c),segFN=segments_1,generation=1}
   [junit4]   2> 19636 T65 oasc.SolrDeletionPolicy.updateCommits newest commit generation = 1
   [junit4]   2> 19606 T69 oasc.SolrDeletionPolicy.updateCommits newest commit generation = 1
   [junit4]   2> 19606 T59 oasc.SolrDeletionPolicy.updateCommits newest commit generation = 1
   [junit4]   2> 19605 T70 oasc.SolrDeletionPolicy.onCommit SolrDeletionPolicy.onCommit: commits: num=1
   [junit4]   2> commit{dir=MockDirWrapper(org.apache.lucene.store.NIOFSDirectory@/Users/jenkins/workspace/Lucene-Solr-trunk-MacOSX/solr/build/solr-core/test/J0/OpenCloseCoreStressTest_/00002_core/data/index lockFactory=org.apache.lucene.store.SingleInstanceLockFactory@b2bfd8a),segFN=segments_1,generation=1}
   [junit4]   2> 19652 T70 oasc.SolrDeletionPolicy.updateCommits newest commit generation = 1
   [junit4]   2> 19605 T75 oasc.SolrDeletionPolicy.updateCommits newest commit generation = 1
   [junit4]   2> 19612 T68 oasc.SolrDeletionPolicy.onCommit SolrDeletionPolicy.onCommit: commits: num=1
   [junit4]   2> commit{dir=MockDirWrapper(org.apache.lucene.store.NIOFSDirectory@/Users/jenkins/workspace/Lucene-Solr-trunk-MacOSX/solr/build/solr-core/test/J0/OpenCloseCoreStressTest_/00008_core/data/index lockFactory=org.apache.lucene.store.SingleInstanceLockFactory@5196f4d7),segFN=segments_1,generation=1}
   [junit4]   2> 19672 T68 oasc.SolrDeletionPolicy.updateCommits newest commit generation = 1
   [junit4]   2> 19612 T58 oasc.SolrDeletionPolicy.onCommit SolrDeletionPolicy.onCommit: commits: num=1
   [junit4]   2> commit{dir=MockDirWrapper(org.apache.lucene.store.NIOFSDirectory@/Users/jenkins/workspace/Lucene-Solr-trunk-MacOSX/solr/build/solr-core/test/J0/OpenCloseCoreStressTest_/00003_core/data/index lockFactory=org.apache.lucene.store.SingleInstanceLockFactory@3f90482),segFN=segments_1,generation=1}
   [junit4]   2> 19675 T58 oasc.SolrDeletionPolicy.updateCommits newest commit generation = 1
   [junit4]   2> 19612 T64 oasc.SolrDeletionPolicy.onCommit SolrDeletionPolicy.onCommit: commits: num=1
   [junit4]   2> commit{dir=MockDirWrapper(org.apache.lucene.store.NIOFSDirectory@/Users/jenkins/workspace/Lucene-Solr-trunk-MacOSX/solr/build/solr-core/test/J0/OpenCloseCoreStressTest_/00009_core/data/index lockFactory=org.apache.lucene.store.SingleInstanceLockFactory@3bf3d06e),segFN=segments_1,generation=1}
   [junit4]   2> 19676 T64 oasc.SolrDeletionPolicy.updateCommits newest commit generation = 1
   [junit4]   2> 19685 T18 oasc.SolrCore.initWriters created json: solr.JSONResponseWriter
   [junit4]   2> 19687 T57 oasc.SolrCore.initWriters created json: solr.JSONResponseWriter
   [junit4]   2> 19689 T69 oasc.SolrCore.initWriters created json: solr.JSONResponseWriter
   [junit4]   2> 19690 T68 oasc.SolrCore.initWriters created json: solr.JSONResponseWriter
   [junit4]   2> 19692 T21 oasc.SolrCore.initWriters created json: solr.JSONResponseWriter
   [junit4]   2> 19694 T71 oasc.SolrCore.initWriters created json: solr.JSONResponseWriter
   [junit4]   2> 19711 T64 oasc.SolrCore.initWriters created json: solr.JSONResponseWriter
   [junit4]   2> 19717 T65 oasc.SolrCore.initWriters created json: solr.JSONResponseWriter
   [junit4]   2> 19718 T58 oasc.SolrCore.initWriters created json: solr.JSONResponseWriter
   [junit4]   2> 19721 T70 oasc.SolrCore.initWriters created json: solr.JSONResponseWriter
   [junit4]   2> 19722 T59 oasc.SolrCore.initWriters created json: solr.JSONResponseWriter
   [junit4]   2> 19724 T17 oasc.SolrCore.initWriters created json: solr.JSONResponseWriter
   [junit4]   2> 19726 T77 oasc.SolrCore.initWriters created json: solr.JSONResponseWriter
   [junit4]   2> 19728 T22 oasc.SolrCore.initWriters created json: solr.JSONResponseWriter
   [junit4]   2> 19729 T75 oasc.SolrCore.initWriters created json: solr.JSONResponseWriter
   [junit4]   2> 19732 T73 oasc.SolrCore.initWriters created json: solr.JSONResponseWriter
   [junit4]   2> 20870 T68 oasc.SolrCore.loadUpdateProcessorChains no updateRequestProcessorChain defined as default, creating implicit default
   [junit4]   2> 20871 T71 oasc.SolrCore.loadUpdateProcessorChains no updateRequestProcessorChain defined as default, creating implicit default
   [junit4]   2> 20873 T18 oasc.SolrCore.loadUpdateProcessorChains no updateRequestProcessorChain defined as default, creating implicit default
   [junit4]   2> 20871 T21 oasc.SolrCore.loadUpdateProcessorChains no updateRequestProcessorChain defined as default, creating implicit default
   [junit4]   2> 20870 T58 oasc.SolrCore.loadUpdateProcessorChains no updateRequestProcessorChain defined as default, creating implicit default
   [junit4]   2> 20877 T17 oasc.SolrCore.loadUpdateProcessorChains no updateRequestProcessorChain defined as default, creating implicit default
   [junit4]   2> 20878 T75 oasc.SolrCore.loadUpdateProcessorChains no updateRequestProcessorChain defined as default, creating implicit default
   [junit4]   2> 20880 T57 oasc.SolrCore.loadUpdateProcessorChains no updateRequestProcessorChain defined as default, creating implicit default
   [junit4]   2> 20882 T64 oasc.SolrCore.loadUpdateProcessorChains no updateRequestProcessorChain defined as default, creating implicit default
   [junit4]   2> 20870 T73 oasc.SolrCore.loadUpdateProcessorChains no updateRequestProcessorChain defined as default, creating implicit default
   [junit4]   2> 20879 T22 oasc.SolrCore.loadUpdateProcessorChains no updateRequestProcessorChain defined as default, creating implicit default
   [junit4]   2> 20878 T77 oasc.SolrCore.loadUpdateProcessorChains no updateRequestProcessorChain defined as default, creating implicit default
   [junit4]   2> 20878 T59 oasc.SolrCore.loadUpdateProcessorChains no updateRequestProcessorChain defined as default, creating implicit default
   [junit4]   2> 20878 T65 oasc.SolrCore.loadUpdateProcessorChains no updateRequestProcessorChain defined as default, creating implicit default
   [junit4]   2> 20877 T70 oasc.SolrCore.loadUpdateProcessorChains no updateRequestProcessorChain defined as default, creating implicit default
   [junit4]   2> 20877 T69 oasc.SolrCore.loadUpdateProcessorChains no updateRequestProcessorChain defined as default, creating implicit default
   [junit4]   2> 20974 T57 oasc.RequestHandlers.initHandlersFromConfig created /admin/: solr.admin.AdminHandlers
   [junit4]   2> 20998 T73 oasc.RequestHandlers.initHandlersFromConfig created /admin/: solr.admin.AdminHandlers
   [junit4]   2> 21000 T18 oasc.RequestHandlers.initHandlersFromConfig created /admin/: solr.admin.AdminHandlers
   [junit4]   2> 20978 T75 oasc.RequestHandlers.initHandlersFromConfig created /admin/: solr.admin.AdminHandlers
   [junit4]   2> 20975 T68 oasc.RequestHandlers.initHandlersFromConfig created /admin/: solr.admin.AdminHandlers
   [junit4]   2> 20977 T65 oasc.RequestHandlers.initHandlersFromConfig created /admin/: solr.admin.AdminHandlers
   [junit4]   2> 20985 T59 oasc.RequestHandlers.initHandlersFromConfig created /admin/: solr.admin.AdminHandlers
   [junit4]   2> 20978 T77 oasc.RequestHandlers.initHandlersFromConfig created /admin/: solr.admin.AdminHandlers
   [junit4]   2> 20986 T22 oasc.RequestHandlers.initHandlersFromConfig created /admin/: solr.admin.AdminHandlers
   [junit4]   2> 20977 T21 oasc.RequestHandlers.initHandlersFromConfig created /admin/: solr.admin.AdminHandlers
   [junit4]   2> 20988 T17 oasc.RequestHandlers.initHandlersFromConfig created /admin/: solr.admin.AdminHandlers
   [junit4]   2> 20990 T71 oasc.RequestHandlers.initHandlersFromConfig created /admin/: solr.admin.AdminHandlers
   [junit4]   2> 21009 T69 oasc.RequestHandlers.initHandlersFromConfig created /admin/: solr.admin.AdminHandlers
   [junit4]   2> 20985 T70 oasc.RequestHandlers.initHandlersFromConfig created /admin/: solr.admin.AdminHandlers
   [junit4]   2> 20974 T64 oasc.RequestHandlers.initHandlersFromConfig created /admin/: solr.admin.AdminHandlers
   [junit4]   2> 21004 T58 oasc.RequestHandlers.initHandlersFromConfig created /admin/: solr.admin.AdminHandlers
   [junit4]   2> 21157 T65 oasc.RequestHandlers.initHandlersFromConfig created /select: solr.SearchHandler
   [junit4]   2> 21158 T64 oasc.RequestHandlers.initHandlersFromConfig created /select: solr.SearchHandler
   [junit4]   2> 21160 T71 oasc.RequestHandlers.initHandlersFromConfig created /select: solr.SearchHandler
   [junit4]   2> 21161 T22 oasc.RequestHandlers.initHandlersFromConfig created /select: solr.SearchHandler
   [junit4]   2> 21163 T18 oasc.RequestHandlers.initHandlersFromConfig created /select: solr.SearchHandler
   [junit4]   2> 21158 T21 oasc.RequestHandlers.initHandlersFromConfig created /select: solr.SearchHandler
   [junit4]   2> 21158 T70 oasc.RequestHandlers.initHandlersFromConfig created /select: solr.SearchHandler
   [junit4]   2> 21173 T17 oasc.RequestHandlers.initHandlersFromConfig created /select: solr.SearchHandler
   [junit4]   2> 21175 T69 oasc.RequestHandlers.initHandlersFromConfig created /select: solr.SearchHandler
   [junit4]   2> 21158 T57 oasc.RequestHandlers.initHandlersFromConfig created /select: solr.SearchHandler
   [junit4]   2> 21184 T77 oasc.RequestHandlers.initHandlersFromConfig created /select: solr.SearchHandler
   [junit4]   2> 21191 T75 oasc.RequestHandlers.initHandlersFromConfig created /select: solr.SearchHandler
   [junit4]   2> 21217 T58 oasc.RequestHandlers.initHandlersFromConfig created /select: solr.SearchHandler
   [junit4]   2> 21217 T18 oasc.RequestHandlers.initHandlersFromConfig created /update: solr.UpdateRequestHandler
   [junit4]   2> 21219 T73 oasc.RequestHandlers.initHandlersFromConfig created /select: solr.SearchHandler
   [junit4]   2> 21219 T73 oasc.RequestHandlers.initHandlersFromConfig created /update: solr.UpdateRequestHandler
   [junit4]   2> 21221 T70 oasc.RequestHandlers.initHandlersFromConfig created /update: solr.UpdateRequestHandler
   [junit4]   2> 21222 T69 oasc.RequestHandlers.initHandlersFromConfig created /update: solr.UpdateRequestHandler
   [junit4]   2> 21223 T17 oasc.RequestHandlers.initHandlersFromConfig created /update: solr.UpdateRequestHandler
   [junit4]   2> 21224 T64 oasc.RequestHandlers.initHandlersFromConfig created /update: solr.UpdateRequestHandler
   [junit4]   2> 21225 T77 oasc.RequestHandlers.initHandlersFromConfig created /update: solr.UpdateRequestHandler
   [junit4]   2> 21227 T22 oasc.RequestHandlers.initHandlersFromConfig created /update: solr.UpdateRequestHandler
   [junit4]   2> 21217 T65 oasc.RequestHandlers.initHandlersFromConfig created /update: solr.UpdateRequestHandler
   [junit4]   2> 21226 T21 oasc.RequestHandlers.initHandlersFromConfig created /update: solr.UpdateRequestHandler
   [junit4]   2> 21224 T71 oasc.RequestHandlers.initHandlersFromConfig created /update: solr.UpdateRequestHandler
   [junit4]   2> 21218 T68 oasc.RequestHandlers.initHandlersFromConfig created /select: solr.SearchHandler
   [junit4]   2> 21232 T68 oasc.RequestHandlers.initHandlersFromConfig created /update: solr.UpdateRequestHandler
   [junit4]   2> 21218 T59 oasc.RequestHandlers.initHandlersFromConfig created /select: solr.SearchHandler
   [junit4]   2> 21234 T59 oasc.RequestHandlers.initHandlersFromConfig created /update: solr.UpdateRequestHandler
   [junit4]   2> 21218 T58 oasc.RequestHandlers.initHandlersFromConfig created /update: solr.UpdateRequestHandler
   [junit4]   2> 21232 T57 oasc.RequestHandlers.initHandlersFromConfig created /update: solr.UpdateRequestHandler
   [junit4]   2> 21231 T75 oasc.RequestHandlers.initHandlersFromConfig created /update: solr.UpdateRequestHandler
   [junit4]   2> 21488 T71 oashl.XMLLoader.init xsltCacheLifetimeSeconds=60
   [junit4]   2> 21490 T68 oashl.XMLLoader.init xsltCacheLifetimeSeconds=60
   [junit4]   2> 21491 T69 oashl.XMLLoader.init xsltCacheLifetimeSeconds=60
   [junit4]   2> 21492 T17 oashl.XMLLoader.init xsltCacheLifetimeSeconds=60
   [junit4]   2> 21494 T73 oashl.XMLLoader.init xsltCacheLifetimeSeconds=60
   [junit4]   2> 21497 T75 oashl.XMLLoader.init xsltCacheLifetimeSeconds=60
   [junit4]   2> 21497 T21 oashl.XMLLoader.init xsltCacheLifetimeSeconds=60
   [junit4]   2> 21503 T59 oashl.XMLLoader.init xsltCacheLifetimeSeconds=60
   [junit4]   2> 21504 T64 oashl.XMLLoader.init xsltCacheLifetimeSeconds=60
   [junit4]   2> 21506 T18 oashl.XMLLoader.init xsltCacheLifetimeSeconds=60
   [junit4]   2> 21507 T22 oashl.XMLLoader.init xsltCacheLifetimeSeconds=60
   [junit4]   2> 21508 T65 oashl.XMLLoader.init xsltCacheLifetimeSeconds=60
   [junit4]   2> 21507 T58 oashl.XMLLoader.init xsltCacheLifetimeSeconds=60
   [junit4]   2> 21510 T77 oashl.XMLLoader.init xsltCacheLifetimeSeconds=60
   [junit4]   2> 21509 T70 oashl.XMLLoader.init xsltCacheLifetimeSeconds=60
   [junit4]   2> 21515 T57 oashl.XMLLoader.init xsltCacheLifetimeSeconds=60
   [junit4]   2> 21762 T22 oasu.CommitTracker.<init> Hard AutoCommit: disabled
   [junit4]   2> 21764 T22 oasu.CommitTracker.<init> Soft AutoCommit: disabled
   [junit4]   2> 21767 T75 oasu.CommitTracker.<init> Hard AutoCommit: disabled
   [junit4]   2> 21768 T75 oasu.CommitTracker.<init> Soft AutoCommit: disabled
   [junit4]   2> 21769 T70 oasu.CommitTracker.<init> Hard AutoCommit: disabled
   [junit4]   2> 21770 T68 oasu.CommitTracker.<init> Hard AutoCommit: disabled
   [junit4]   2> 21771 T68 oasu.CommitTracker.<init> Soft AutoCommit: disabled
   [junit4]   2> 21774 T21 oasu.CommitTracker.<init> Hard AutoCommit: disabled
   [junit4]   2> 21775 T21 oasu.CommitTracker.<init> Soft AutoCommit: disabled
   [junit4]   2> 21777 T69 oasu.CommitTracker.<init> Hard AutoCommit: disabled
   [junit4]   2> 21778 T69 oasu.CommitTracker.<init> Soft AutoCommit: disabled
   [junit4]   2> 21779 T22 oasu.RandomMergePolicy.<init> RandomMergePolicy wrapping class org.apache.lucene.index.LogByteSizeMergePolicy: [LogByteSizeMergePolicy: minMergeSize=1677721, mergeFactor=27, maxMergeSize=2147483648, maxMergeSizeForForcedMerge=9223372036854775807, calibrateSizeByDeletes=true, maxMergeDocs=2147483647, maxCFSSegmentSizeMB=8.796093022207999E12, noCFSRatio=0.6892488767384475]
   [junit4]   2> 21767 T71 oasu.CommitTracker.<init> Hard AutoCommit: disabled
   [junit4]   2> 21780 T75 oasu.RandomMergePolicy.<init> RandomMergePolicy wrapping class org.apache.lucene.index.LogByteSizeMergePolicy: [LogByteSizeMergePolicy: minMergeSize=1677721, mergeFactor=27, maxMergeSize=2147483648, maxMergeSizeForForcedMerge=9223372036854775807, calibrateSizeByDeletes=true, maxMergeDocs=2147483647, maxCFSSegmentSizeMB=8.796093022207999E12, noCFSRatio=0.6892488767384475]
   [junit4]   2> 21780 T73 oasu.CommitTracker.<init> Hard AutoCommit: disabled
   [junit4]   2> 21785 T73 oasu.CommitTracker.<init> Soft AutoCommit: disabled
   [junit4]   2> 21778 T18 oasu.CommitTracker.<init> Hard AutoCommit: disabled
   [junit4]   2> 21788 T18 oasu.CommitTracker.<init> Soft AutoCommit: disabled
   [junit4]   2> 21790 T69 oasu.RandomMergePolicy.<init> RandomMergePolicy wrapping class org.apache.lucene.index.LogByteSizeMergePolicy: [LogByteSizeMergePolicy: minMergeSize=1677721, mergeFactor=27, maxMergeSize=2147483648, maxMergeSizeForForcedMerge=9223372036854775807, calibrateSizeByDeletes=true, maxMergeDocs=2147483647, maxCFSSegmentSizeMB=8.796093022207999E12, noCFSRatio=0.6892488767384475]
   [junit4]   2> 21777 T59 oasu.CommitTracker.<init> Hard AutoCommit: disabled
   [junit4]   2> 21792 T59 oasu.CommitTracker.<init> Soft AutoCommit: disabled
   [junit4]   2> 21777 T77 oasu.CommitTracker.<init> Hard AutoCommit: disabled
   [junit4]   2> 21796 T77 oasu.CommitTracker.<init> Soft AutoCommit: disabled
   [junit4]   2> 21770 T70 oasu.CommitTracker.<init> Soft AutoCommit: disabled
   [junit4]   2> 21799 T18 oasu.RandomMergePolicy.<init> RandomMergePolicy wrapping class org.apache.lucene.index.LogByteSizeMergePolicy: [LogByteSizeMergePolicy: minMergeSize=1677721, mergeFactor=27, maxMergeSize=2147483648, maxMergeSizeForForcedMerge=9223372036854775807, calibrateSizeByDeletes=true, max

[...truncated too long message...]

ed 0 - closing IndexWriter
   [junit4]   2> 2389979 T5850 oasu.DefaultSolrCoreState.closeIndexWriter closing IndexWriter with IndexWriterCloser
   [junit4]   2> 2389981 T5850 oasc.SolrCore.closeSearcher [awholynewcollection_1_shard5_replica2] Closing main searcher on request.
   [junit4]   2> 2389982 T5850 oasc.CachingDirectoryFactory.close Closing MockDirectoryFactory - 2 directories currently being tracked
   [junit4]   2> 2389983 T5850 oasc.CachingDirectoryFactory.closeCacheValue looking to close ../../../../../../../../../Users/jenkins/workspace/Lucene-Solr-trunk-MacOSX/solr/build/solr-core/test/J0/./org.apache.solr.cloud.CollectionsAPIDistributedZkTest-jetty4-1377190385239/awholynewcollection_1_shard5_replica2/data [CachedDir<<refCount=0;path=../../../../../../../../../Users/jenkins/workspace/Lucene-Solr-trunk-MacOSX/solr/build/solr-core/test/J0/./org.apache.solr.cloud.CollectionsAPIDistributedZkTest-jetty4-1377190385239/awholynewcollection_1_shard5_replica2/data;done=false>>]
   [junit4]   2> 2389984 T5850 oasc.CachingDirectoryFactory.close Closing directory: ../../../../../../../../../Users/jenkins/workspace/Lucene-Solr-trunk-MacOSX/solr/build/solr-core/test/J0/./org.apache.solr.cloud.CollectionsAPIDistributedZkTest-jetty4-1377190385239/awholynewcollection_1_shard5_replica2/data
   [junit4]   2> 2389985 T5850 oasc.CachingDirectoryFactory.closeCacheValue looking to close ../../../../../../../../../Users/jenkins/workspace/Lucene-Solr-trunk-MacOSX/solr/build/solr-core/test/J0/./org.apache.solr.cloud.CollectionsAPIDistributedZkTest-jetty4-1377190385239/awholynewcollection_1_shard5_replica2/data/index [CachedDir<<refCount=0;path=../../../../../../../../../Users/jenkins/workspace/Lucene-Solr-trunk-MacOSX/solr/build/solr-core/test/J0/./org.apache.solr.cloud.CollectionsAPIDistributedZkTest-jetty4-1377190385239/awholynewcollection_1_shard5_replica2/data/index;done=false>>]
   [junit4]   2> 2389987 T5850 oasc.CachingDirectoryFactory.close Closing directory: ../../../../../../../../../Users/jenkins/workspace/Lucene-Solr-trunk-MacOSX/solr/build/solr-core/test/J0/./org.apache.solr.cloud.CollectionsAPIDistributedZkTest-jetty4-1377190385239/awholynewcollection_1_shard5_replica2/data/index
   [junit4]   2> 2389992 T5932 oascc.ZkStateReader$2.process A cluster state change: WatchedEvent state:SyncConnected type:NodeChildrenChanged path:/live_nodes, has occurred - updating... (live nodes size: 1)
   [junit4]   2> 2389993 T5932 oascc.ZkStateReader$2.process WARN ZooKeeper watch triggered, but Solr cannot talk to ZK
   [junit4]   2> 2389993 T5932 oascc.ZkStateReader$3.process WARN ZooKeeper watch triggered, but Solr cannot talk to ZK
   [junit4]   2> 2390007 T5850 oejsh.ContextHandler.doStop stopped o.e.j.s.ServletContextHandler{/zsl/uh,null}
   [junit4]   2> 2390073 T5850 oas.SolrTestCaseJ4.tearDown ###Ending testDistribSearch
   [junit4]   2> 2390078 T5850 oasc.ZkTestServer.send4LetterWord connecting to 127.0.0.1:51234 51234
   [junit4]   1> client port:0.0.0.0/0.0.0.0:0
   [junit4]   2> NOTE: reproduce with: ant test  -Dtestcase=CollectionsAPIDistributedZkTest -Dtests.method=testDistribSearch -Dtests.seed=E6B881105E69BE8B -Dtests.slow=true -Dtests.locale=sq_AL -Dtests.timezone=America/Mendoza -Dtests.file.encoding=UTF-8
   [junit4] ERROR    113s | CollectionsAPIDistributedZkTest.testDistribSearch <<<
   [junit4]    > Throwable #1: org.apache.solr.client.solrj.impl.HttpSolrServer$RemoteSolrException: collection already exists: awholynewcollection_1
   [junit4]    > at __randomizedtesting.SeedInfo.seed([E6B881105E69BE8B:675E0F082936DEB7]:0)
   [junit4]    > at org.apache.solr.client.solrj.impl.HttpSolrServer.request(HttpSolrServer.java:424)
   [junit4]    > at org.apache.solr.client.solrj.impl.HttpSolrServer.request(HttpSolrServer.java:180)
   [junit4]    > at org.apache.solr.client.solrj.impl.LBHttpSolrServer.request(LBHttpSolrServer.java:264)
   [junit4]    > at org.apache.solr.client.solrj.impl.CloudSolrServer.request(CloudSolrServer.java:318)
   [junit4]    > at org.apache.solr.cloud.AbstractFullDistribZkTestBase.createCollection(AbstractFullDistribZkTestBase.java:1571)
   [junit4]    > at org.apache.solr.cloud.AbstractFullDistribZkTestBase.createCollection(AbstractFullDistribZkTestBase.java:1585)
   [junit4]    > at org.apache.solr.cloud.CollectionsAPIDistributedZkTest.testCollectionsAPI(CollectionsAPIDistributedZkTest.java:481)
   [junit4]    > at org.apache.solr.cloud.CollectionsAPIDistributedZkTest.doTest(CollectionsAPIDistributedZkTest.java:152)
   [junit4]    > at org.apache.solr.BaseDistributedSearchTestCase.testDistribSearch(BaseDistributedSearchTestCase.java:835)
   [junit4]    > at java.lang.Thread.run(Thread.java:724)
   [junit4]   2> 2390208 T5850 oas.SolrTestCaseJ4.deleteCore ###deleteCore
   [junit4]   2> 112642 T5849 ccr.ThreadLeakControl.checkThreadLeaks WARNING Will linger awaiting termination of 1 leaked thread(s).
   [junit4]   2> NOTE: test params are: codec=CheapBastard, sim=DefaultSimilarity, locale=sq_AL, timezone=America/Mendoza
   [junit4]   2> NOTE: Mac OS X 10.8.4 x86_64/Oracle Corporation 1.7.0_25 (64-bit)/cpus=2,threads=2,free=292902480,total=536870912
   [junit4]   2> NOTE: All tests run in this JVM: [OpenCloseCoreStressTest, CurrencyFieldOpenExchangeTest, HdfsBasicDistributedZk2Test, TestWriterPerf, SortByFunctionTest, RequestHandlersTest, SimplePostToolTest, DistributedTermsComponentTest, CSVRequestHandlerTest, TestSweetSpotSimilarityFactory, TestLMDirichletSimilarityFactory, HdfsDirectoryTest, DisMaxRequestHandlerTest, MoreLikeThisHandlerTest, TestInfoStreamLogging, TestSchemaNameResource, PrimUtilsTest, BasicFunctionalityTest, ZkControllerTest, TestImplicitCoreProperties, HighlighterConfigTest, SynonymTokenizerTest, LeaderElectionTest, TestFastOutputStream, FileUtilsTest, TestSchemaVersionResource, TestTrie, ShardSplitTest, TestRecoveryHdfs, TestCopyFieldCollectionResource, TestStressRecovery, ParsingFieldUpdateProcessorsTest, SolrCoreTest, CacheHeaderTest, SolrCmdDistributorTest, QueryParsingTest, QueryResultKeyTest, TestLRUCache, ChaosMonkeyNothingIsSafeTest, PreAnalyzedFieldTest, PeerSyncTest, SpellingQueryConverterTest, RecoveryZkTest, TestFaceting, TestJmxMonitoredMap, ClusterStateTest, TestSolrIndexConfig, TestDynamicFieldResource, OverseerTest, TestNumberUtils, SyncSliceTest, LegacyHTMLStripCharFilterTest, TestUpdate, TestLMJelinekMercerSimilarityFactory, PreAnalyzedUpdateProcessorTest, UpdateRequestProcessorFactoryTest, DateMathParserTest, DOMUtilTest, TestMultiCoreConfBootstrap, HdfsBasicDistributedZkTest, RegexBoostProcessorTest, InfoHandlerTest, BadCopyFieldTest, SearchHandlerTest, PluginInfoTest, SampleTest, TestDefaultSearchFieldResource, CoreAdminHandlerTest, BasicDistributedZkTest, PolyFieldTest, TestReplicationHandler, CachingDirectoryFactoryTest, TestFuzzyAnalyzedSuggestions, TestReload, TestMaxScoreQueryParser, UUIDFieldTest, OpenExchangeRatesOrgProviderTest, BJQParserTest, DebugComponentTest, ShardRoutingCustomTest, TestSolrQueryParser, TestCodecSupport, TestQueryUtils, DistanceFunctionTest, AddSchemaFieldsUpdateProcessorFactoryTest, EchoParamsTest, StatsComponentTest, TestGroupingSearch, DocValuesMultiTest, TestPerFieldSimilarity, TestSolrDeletionPolicy2, NoCacheHeaderTest, TestDocumentBuilder, TestFastLRUCache, HdfsCollectionsAPIDistributedZkTest, FileBasedSpellCheckerTest, TestSolrDeletionPolicy1, HdfsLockFactoryTest, TestLuceneMatchVersion, HdfsSyncSliceTest, TestQueryTypes, DirectSolrSpellCheckerTest, AlternateDirectoryTest, TestXIncludeConfig, TestRemoteStreaming, BasicZkTest, SliceStateUpdateTest, TestNRTOpen, MultiTermTest, TestRTGBase, BlockDirectoryTest, TestCollationField, SpellCheckComponentTest, IndexSchemaTest, SolrXmlInZkTest, TestQuerySenderNoQuery, TestRangeQuery, TestDistributedSearch, TestSearchPerf, TestCSVLoader, TestExtendedDismaxParser, TestUniqueKeyFieldResource, TestFastWriter, CustomCollectionTest, TestQuerySenderListener, ShowFileRequestHandlerTest, ResourceLoaderTest, TestHashPartitioner, TestMergePolicyConfig, TestSolrXmlPersistence, StressHdfsTest, UniqFieldsUpdateProcessorFactoryTest, DirectUpdateHandlerTest, TestDistributedGrouping, TestPostingsSolrHighlighter, HardAutoCommitTest, AutoCommitTest, ZkCLITest, AliasIntegrationTest, TestRecovery, LoggingHandlerTest, ClusterStateUpdateTest, IndexBasedSpellCheckerTest, TestLazyCores, TestSolrXMLSerializer, DeleteShardTest, DistributedSpellCheckComponentTest, TestBadConfig, TestSuggestSpellingConverter, TestSolrCoreProperties, IndexSchemaRuntimeFieldTest, OverseerCollectionProcessorTest, ChaosMonkeySafeLeaderTest, BasicDistributedZk2Test, UnloadDistributedZkTest, CollectionsAPIDistributedZkTest]
   [junit4] Completed in 113.44s, 1 test, 1 error <<< FAILURES!

[...truncated 486 lines...]
BUILD FAILED
/Users/jenkins/workspace/Lucene-Solr-trunk-MacOSX/build.xml:389: The following error occurred while executing this line:
/Users/jenkins/workspace/Lucene-Solr-trunk-MacOSX/build.xml:369: The following error occurred while executing this line:
/Users/jenkins/workspace/Lucene-Solr-trunk-MacOSX/build.xml:39: The following error occurred while executing this line:
/Users/jenkins/workspace/Lucene-Solr-trunk-MacOSX/solr/build.xml:181: The following error occurred while executing this line:
/Users/jenkins/workspace/Lucene-Solr-trunk-MacOSX/solr/common-build.xml:450: The following error occurred while executing this line:
/Users/jenkins/workspace/Lucene-Solr-trunk-MacOSX/lucene/common-build.xml:1230: The following error occurred while executing this line:
/Users/jenkins/workspace/Lucene-Solr-trunk-MacOSX/lucene/common-build.xml:873: There were test failures: 323 suites, 1403 tests, 1 error, 1 failure, 40 ignored (5 assumptions)

Total time: 100 minutes 41 seconds
Build step 'Invoke Ant' marked build as failure
Description set: Java: 64bit/jdk1.7.0 -XX:-UseCompressedOops -XX:+UseG1GC
Archiving artifacts
Recording test results
Email was triggered for: Failure
Sending email for trigger: Failure




---------------------------------------------------------------------
To unsubscribe, e-mail: [hidden email]
For additional commands, e-mail: [hidden email]