[JENKINS] Lucene-Solr-trunk-Windows (64bit/jdk1.7.0_07) - Build # 1369 - Failure!

classic Classic list List threaded Threaded
7 messages Options
Reply | Threaded
Open this post in threaded view
|

[JENKINS] Lucene-Solr-trunk-Windows (64bit/jdk1.7.0_07) - Build # 1369 - Failure!

Policeman Jenkins Server
Build: http://jenkins.sd-datasolutions.de/job/Lucene-Solr-trunk-Windows/1369/
Java: 64bit/jdk1.7.0_07 -XX:+UseParallelGC

1 tests failed.
FAILED:  junit.framework.TestSuite.org.apache.solr.handler.XmlUpdateRequestHandlerTest

Error Message:
Clean up static fields (in @AfterClass?), your test seems to hang on to approximately 10,608,816 bytes (threshold is 10,485,760). Field reference sizes (counted individually):   - 10,871,672 bytes, protected static org.apache.solr.handler.UpdateRequestHandler org.apache.solr.handler.XmlUpdateRequestHandlerTest.handler   - 3,792 bytes, private static javax.xml.stream.XMLInputFactory org.apache.solr.handler.XmlUpdateRequestHandlerTest.inputFactory   - 280 bytes, public static org.junit.rules.TestRule org.apache.solr.SolrTestCaseJ4.solrClassRules   - 232 bytes, protected static java.lang.String org.apache.solr.SolrTestCaseJ4.testSolrHome   - 128 bytes, private static java.lang.String org.apache.solr.SolrTestCaseJ4.factoryProp   - 64 bytes, private static java.lang.String org.apache.solr.SolrTestCaseJ4.coreName

Stack Trace:
junit.framework.AssertionFailedError: Clean up static fields (in @AfterClass?), your test seems to hang on to approximately 10,608,816 bytes (threshold is 10,485,760). Field reference sizes (counted individually):
  - 10,871,672 bytes, protected static org.apache.solr.handler.UpdateRequestHandler org.apache.solr.handler.XmlUpdateRequestHandlerTest.handler
  - 3,792 bytes, private static javax.xml.stream.XMLInputFactory org.apache.solr.handler.XmlUpdateRequestHandlerTest.inputFactory
  - 280 bytes, public static org.junit.rules.TestRule org.apache.solr.SolrTestCaseJ4.solrClassRules
  - 232 bytes, protected static java.lang.String org.apache.solr.SolrTestCaseJ4.testSolrHome
  - 128 bytes, private static java.lang.String org.apache.solr.SolrTestCaseJ4.factoryProp
  - 64 bytes, private static java.lang.String org.apache.solr.SolrTestCaseJ4.coreName
        at __randomizedtesting.SeedInfo.seed([48988F00C809D85F]:0)
        at com.carrotsearch.randomizedtesting.rules.StaticFieldsInvariantRule$1.afterAlways(StaticFieldsInvariantRule.java:127)
        at com.carrotsearch.randomizedtesting.rules.StatementAdapter.evaluate(StatementAdapter.java:43)
        at org.apache.lucene.util.TestRuleAssertionsRequired$1.evaluate(TestRuleAssertionsRequired.java:43)
        at org.apache.lucene.util.TestRuleMarkFailure$1.evaluate(TestRuleMarkFailure.java:48)
        at org.apache.lucene.util.TestRuleIgnoreAfterMaxFailures$1.evaluate(TestRuleIgnoreAfterMaxFailures.java:70)
        at org.apache.lucene.util.TestRuleIgnoreTestSuites$1.evaluate(TestRuleIgnoreTestSuites.java:55)
        at com.carrotsearch.randomizedtesting.rules.StatementAdapter.evaluate(StatementAdapter.java:36)
        at com.carrotsearch.randomizedtesting.ThreadLeakControl$StatementRunner.run(ThreadLeakControl.java:358)
        at java.lang.Thread.run(Thread.java:722)




Build Log:
[...truncated 8900 lines...]
[junit4:junit4] Suite: org.apache.solr.handler.XmlUpdateRequestHandlerTest
[junit4:junit4]   2> 2 T3480 oas.SolrTestCaseJ4.initCore ####initCore
[junit4:junit4]   2> Creating dataDir: C:\Users\JenkinsSlave\workspace\Lucene-Solr-trunk-Windows\solr\build\solr-core\test\J0\.\solrtest-XmlUpdateRequestHandlerTest-1351608733112
[junit4:junit4]   2> 6 T3480 oasc.SolrResourceLoader.<init> new SolrResourceLoader for directory: 'C:\Users\JenkinsSlave\workspace\Lucene-Solr-trunk-Windows\solr\build\solr-core\test-files\solr\collection1\'
[junit4:junit4]   2> 9 T3480 oasc.SolrResourceLoader.replaceClassLoader Adding 'file:/C:/Users/JenkinsSlave/workspace/Lucene-Solr-trunk-Windows/solr/build/solr-core/test-files/solr/collection1/lib/classes/' to classloader
[junit4:junit4]   2> 10 T3480 oasc.SolrResourceLoader.replaceClassLoader Adding 'file:/C:/Users/JenkinsSlave/workspace/Lucene-Solr-trunk-Windows/solr/build/solr-core/test-files/solr/collection1/lib/README' to classloader
[junit4:junit4]   2> 85 T3480 oasc.SolrConfig.<init> Using Lucene MatchVersion: LUCENE_50
[junit4:junit4]   2> 146 T3480 oasc.SolrConfig.<init> Loaded SolrConfig: solrconfig.xml
[junit4:junit4]   2> 147 T3480 oass.IndexSchema.readSchema Reading Solr Schema
[junit4:junit4]   2> 153 T3480 oass.IndexSchema.readSchema Schema name=test
[junit4:junit4]   2> 756 T3480 oass.OpenExchangeRatesOrgProvider.init Initialized with rates=open-exchange-rates.json, refreshInterval=1440.
[junit4:junit4]   2> 763 T3480 oass.IndexSchema.readSchema default search field in schema is text
[junit4:junit4]   2> 768 T3480 oass.IndexSchema.readSchema unique key field: id
[junit4:junit4]   2> 773 T3480 oass.FileExchangeRateProvider.reload Reloading exchange rates from file currency.xml
[junit4:junit4]   2> 777 T3480 oass.FileExchangeRateProvider.reload Reloading exchange rates from file currency.xml
[junit4:junit4]   2> 780 T3480 oass.OpenExchangeRatesOrgProvider.reload Reloading exchange rates from open-exchange-rates.json
[junit4:junit4]   2> 781 T3480 oass.OpenExchangeRatesOrgProvider.reload Reloading exchange rates from open-exchange-rates.json
[junit4:junit4]   2> 781 T3480 oasc.SolrResourceLoader.locateSolrHome JNDI not configured for solr (NoInitialContextEx)
[junit4:junit4]   2> 782 T3480 oasc.SolrResourceLoader.locateSolrHome using system property solr.solr.home: C:\Users\JenkinsSlave\workspace\Lucene-Solr-trunk-Windows\solr\build\solr-core\test-files\solr
[junit4:junit4]   2> 782 T3480 oasc.SolrResourceLoader.<init> new SolrResourceLoader for directory: 'C:\Users\JenkinsSlave\workspace\Lucene-Solr-trunk-Windows\solr\build\solr-core\test-files\solr\'
[junit4:junit4]   2> 790 T3480 oasc.CoreContainer.<init> New CoreContainer 1635082524
[junit4:junit4]   2> 791 T3480 oasc.SolrCore.<init> [collection1] Opening new SolrCore at C:\Users\JenkinsSlave\workspace\Lucene-Solr-trunk-Windows\solr\build\solr-core\test-files\solr\collection1\, dataDir=C:\Users\JenkinsSlave\workspace\Lucene-Solr-trunk-Windows\solr\build\solr-core\test\J0\.\solrtest-XmlUpdateRequestHandlerTest-1351608733112\
[junit4:junit4]   2> 791 T3480 oasc.JmxMonitoredMap.<init> JMX monitoring is enabled. Adding Solr mbeans to JMX Server: com.sun.jmx.mbeanserver.JmxMBeanServer@7fa60b26
[junit4:junit4]   2> 791 T3480 oasc.SolrCore.initDirectoryFactory org.apache.solr.core.MockDirectoryFactory
[junit4:junit4]   2> 795 T3480 oasc.CachingDirectoryFactory.injectLockFactory WARNING No lockType configured for MockDirWrapper(org.apache.lucene.store.NIOFSDirectory@C:\Users\JenkinsSlave\workspace\Lucene-Solr-trunk-Windows\solr\build\solr-core\test\J0\index4985349863tmp lockFactory=org.apache.lucene.store.NativeFSLockFactory@51ba8c9e) assuming 'simple'
[junit4:junit4]   2> 797 T3480 oasc.CachingDirectoryFactory.get return new directory for C:\Users\JenkinsSlave\workspace\Lucene-Solr-trunk-Windows\solr\build\solr-core\test\J0\.\solrtest-XmlUpdateRequestHandlerTest-1351608733112 forceNew:false
[junit4:junit4]   2> 798 T3480 oasc.CachingDirectoryFactory.close Releasing directory:C:\Users\JenkinsSlave\workspace\Lucene-Solr-trunk-Windows\solr\build\solr-core\test\J0\.\solrtest-XmlUpdateRequestHandlerTest-1351608733112
[junit4:junit4]   2> 798 T3480 oasc.SolrCore.getNewIndexDir New index directory detected: old=null new=C:\Users\JenkinsSlave\workspace\Lucene-Solr-trunk-Windows\solr\build\solr-core\test\J0\.\solrtest-XmlUpdateRequestHandlerTest-1351608733112\index/
[junit4:junit4]   2> 799 T3480 oasc.SolrCore.initIndex WARNING [collection1] Solr index directory 'C:\Users\JenkinsSlave\workspace\Lucene-Solr-trunk-Windows\solr\build\solr-core\test\J0\.\solrtest-XmlUpdateRequestHandlerTest-1351608733112\index' doesn't exist. Creating new index...
[junit4:junit4]   2> 800 T3480 oasc.CachingDirectoryFactory.get return new directory for C:\Users\JenkinsSlave\workspace\Lucene-Solr-trunk-Windows\solr\build\solr-core\test\J0\.\solrtest-XmlUpdateRequestHandlerTest-1351608733112\index forceNew:false
[junit4:junit4]   2> 802 T3480 oasc.SolrDeletionPolicy.onCommit SolrDeletionPolicy.onCommit: commits:num=1
[junit4:junit4]   2> commit{dir=BaseDirectoryWrapper(org.apache.lucene.store.RAMDirectory@2b4e47d7 lockFactory=org.apache.lucene.store.NativeFSLockFactory@4649b33),segFN=segments_1,generation=1,filenames=[segments_1]
[junit4:junit4]   2> 802 T3480 oasc.SolrDeletionPolicy.updateCommits newest commit = 1[segments_1]
[junit4:junit4]   2> 804 T3480 oasc.CachingDirectoryFactory.close Releasing directory:C:\Users\JenkinsSlave\workspace\Lucene-Solr-trunk-Windows\solr\build\solr-core\test\J0\.\solrtest-XmlUpdateRequestHandlerTest-1351608733112\index
[junit4:junit4]   2> 804 T3480 oasc.SolrCore.initWriters created xml: solr.XMLResponseWriter
[junit4:junit4]   2> 805 T3480 oasup.UpdateRequestProcessorChain.init inserting DistributedUpdateProcessorFactory into updateRequestProcessorChain "dedupe"
[junit4:junit4]   2> 805 T3480 oasup.UpdateRequestProcessorChain.init inserting DistributedUpdateProcessorFactory into updateRequestProcessorChain "dedupe-allfields"
[junit4:junit4]   2> 805 T3480 oasup.UpdateRequestProcessorChain.init inserting DistributedUpdateProcessorFactory into updateRequestProcessorChain "stored_sig"
[junit4:junit4]   2> 805 T3480 oasup.UpdateRequestProcessorChain.init inserting DistributedUpdateProcessorFactory into updateRequestProcessorChain "uniq-fields"
[junit4:junit4]   2> 808 T3480 oasup.UpdateRequestProcessorChain.init inserting DistributedUpdateProcessorFactory into updateRequestProcessorChain "distrib-dup-test-chain-implicit"
[junit4:junit4]   2> 808 T3480 oasc.RequestHandlers.initHandlersFromConfig adding lazy requestHandler: solr.ReplicationHandler
[junit4:junit4]   2> 808 T3480 oasc.RequestHandlers.initHandlersFromConfig created /replication: solr.ReplicationHandler
[junit4:junit4]   2> 809 T3480 oasc.RequestHandlers.initHandlersFromConfig created standard: solr.StandardRequestHandler
[junit4:junit4]   2> 809 T3480 oasc.RequestHandlers.initHandlersFromConfig created /get: solr.RealTimeGetHandler
[junit4:junit4]   2> 810 T3480 oasc.RequestHandlers.initHandlersFromConfig created dismax: solr.SearchHandler
[junit4:junit4]   2> 810 T3480 oasc.RequestHandlers.initHandlersFromConfig created mock: org.apache.solr.core.MockQuerySenderListenerReqHandler
[junit4:junit4]   2> 811 T3480 oasc.RequestHandlers.initHandlersFromConfig created /admin/: org.apache.solr.handler.admin.AdminHandlers
[junit4:junit4]   2> 811 T3480 oasc.RequestHandlers.initHandlersFromConfig created defaults: solr.StandardRequestHandler
[junit4:junit4]   2> 811 T3480 oasc.RequestHandlers.initHandlersFromConfig adding lazy requestHandler: solr.StandardRequestHandler
[junit4:junit4]   2> 811 T3480 oasc.RequestHandlers.initHandlersFromConfig created lazy: solr.StandardRequestHandler
[junit4:junit4]   2> 813 T3480 oasc.RequestHandlers.initHandlersFromConfig created /update: solr.UpdateRequestHandler
[junit4:junit4]   2> 814 T3480 oasc.RequestHandlers.initHandlersFromConfig created /terms: org.apache.solr.handler.component.SearchHandler
[junit4:junit4]   2> 815 T3480 oasc.RequestHandlers.initHandlersFromConfig created spellCheckCompRH: org.apache.solr.handler.component.SearchHandler
[junit4:junit4]   2> 815 T3480 oasc.RequestHandlers.initHandlersFromConfig created spellCheckCompRH_Direct: org.apache.solr.handler.component.SearchHandler
[junit4:junit4]   2> 816 T3480 oasc.RequestHandlers.initHandlersFromConfig created spellCheckWithWordbreak: org.apache.solr.handler.component.SearchHandler
[junit4:junit4]   2> 817 T3480 oasc.RequestHandlers.initHandlersFromConfig created spellCheckWithWordbreak_Direct: org.apache.solr.handler.component.SearchHandler
[junit4:junit4]   2> 819 T3480 oasc.RequestHandlers.initHandlersFromConfig created spellCheckCompRH1: org.apache.solr.handler.component.SearchHandler
[junit4:junit4]   2> 820 T3480 oasc.RequestHandlers.initHandlersFromConfig created tvrh: org.apache.solr.handler.component.SearchHandler
[junit4:junit4]   2> 820 T3480 oasc.RequestHandlers.initHandlersFromConfig created /mlt: solr.MoreLikeThisHandler
[junit4:junit4]   2> 821 T3480 oasc.RequestHandlers.initHandlersFromConfig created /debug/dump: solr.DumpRequestHandler
[junit4:junit4]   2> 831 T3480 oashl.XMLLoader.init xsltCacheLifetimeSeconds=60
[junit4:junit4]   2> 836 T3480 oasc.SolrCore.initDeprecatedSupport WARNING solrconfig.xml uses deprecated <admin/gettableFiles>, Please update your config to use the ShowFileRequestHandler.
[junit4:junit4]   2> 839 T3480 oasc.SolrCore.initDeprecatedSupport WARNING adding ShowFileRequestHandler with hidden files: [THROW.ERROR.ON.ADD.UPDATEPROCESSOR.JS, SOLRCONFIG-HIGHLIGHT.XML, SCHEMA-REQUIRED-FIELDS.XML, TRIVIAL.UPDATEPROCESSOR1.JS, BAD-SCHEMA-DUP-DYNAMICFIELD.XML, SCHEMA-MINIMAL.XML, SCHEMA-REPLICATION2.XML, SOLRCONFIG-CACHING.XML, SOLRCONFIG-REPEATER.XML, CURRENCY.XML, BAD-SCHEMA-NONTEXT-ANALYZER.XML, SOLRCONFIG-MERGEPOLICY.XML, SOLRCONFIG-TLOG.XML, SOLRCONFIG-MASTER.XML, BAD-SCHEMA-UNIQUEKEY-MULTIVALUED.XML, SCHEMA11.XML, SOLRCONFIG-BASIC.XML, DA_COMPOUNDDICTIONARY.TXT, MISSLEADING.EXTENSION.UPDATEPROCESSOR.JS.TXT, SCHEMA-COPYFIELD-TEST.XML, SOLRCONFIG-SLAVE.XML, SOLRCONFIG-PROPINJECT-INDEXDEFAULT.XML, ELEVATE.XML, TRIVIAL.UPDATEPROCESSOR0.JS, BAD-SOLRCONFIG-BOGUS-SCRIPTENGINE-NAME.XML, SCHEMA-CHARFILTERS.XML, SCHEMA-IB.XML, SOLRCONFIG-QUERYSENDER.XML, SOLRCONFIG-SNIPPET-PROCESSOR.XML, DA_UTF8.XML, SCHEMA-REPLICATION1.XML, CONDITIONAL.UPDATEPROCESSOR.JS, MISSING.FUNCTIONS.UPDATEPROCESSOR.JS, HYPHENATION.DTD, SOLRCONFIG-ENABLEPLUGIN.XML, STEMDICT.TXT, SCHEMA-PHRASESUGGEST.XML, HUNSPELL-TEST.AFF, SCHEMA-SNIPPET-TYPE.XML, STOPTYPES-1.TXT, STOPWORDSWRONGENCODING.TXT, SCHEMA-NUMERIC.XML, SOLRCONFIG-TRANSFORMERS.XML, SOLRCONFIG-PROPINJECT.XML, BAD-SCHEMA-NOT-INDEXED-BUT-TF.XML, SOLRCONFIG-SIMPLELOCK.XML, WDFTYPES.TXT, STOPTYPES-2.TXT, SCHEMA-REVERSED.XML, BAD-SCHEMA-CURRENCY-FT-MULTIVALUED.XML, SOLRCONFIG-SPELLCHECKCOMPONENT.XML, SOLRCONFIG-PHRASESUGGEST.XML, BAD-SCHEMA-CURRENCY-MULTIVALUED.XML, SCHEMA-DFR.XML, BAD-SCHEMA-NOT-INDEXED-BUT-POS.XML, KEEP-1.TXT, OPEN-EXCHANGE-RATES.JSON, SCHEMA-SPATIAL.XML, STOPWITHBOM.TXT, SOLRCONFIG-SPELLCHECKER.XML, SCHEMA-BINARYFIELD.XML, SOLRCONFIG-UPDATE-PROCESSOR-CHAINS.XML, BAD-SCHEMA-OMIT-TF-BUT-NOT-POS.XML, BAD-SCHEMA-DUP-FIELDTYPE.XML, SCHEMA-XINCLUDE.XML, SOLRCONFIG-MASTER1.XML, SYNONYMS.TXT, BAD-SCHEMA-CURRENCY-DYNAMIC-MULTIVALUED.XML, SCHEMA.XML, SCHEMA_CODEC.XML, SOLRCONFIG-SOLR-749.XML, SOLRCONFIG-MASTER1-KEEPONEBACKUP.XML, STOP-2.TXT, SOLRCONFIG-FUNCTIONQUERY.XML, SOLRCONFIG-TERMINDEX.XML, SCHEMA-LMDIRICHLET.XML, SOLRCONFIG-ELEVATE.XML, STOPWORDS.TXT, SCHEMA-FOLDING.XML, SCHEMA-STOP-KEEP.XML, BAD-SCHEMA-NOT-INDEXED-BUT-NORMS.XML, SOLRCONFIG-SOLCOREPROPERTIES.XML, STOP-1.TXT, SOLRCONFIG-MASTER2.XML, SCHEMA-SPELLCHECKER.XML, SOLRCONFIG-RESPONSE-LOG-COMPONENT.XML, SOLRCONFIG-LAZYWRITER.XML, SCHEMA-LUCENEMATCHVERSION.XML, FRENCHARTICLES.TXT, BAD-MP-SOLRCONFIG.XML, SCHEMA15.XML, SOLRCONFIG-REQHANDLER.INCL, SCHEMASURROUND.XML, SOLRCONFIG-MASTER3.XML, HUNSPELL-TEST.DIC, SOLRCONFIG-XINCLUDE.XML, BAD-SCHEMA-CODEC-GLOBAL-VS-FT-MISMATCH.XML, SOLRCONFIG-SLAVE1.XML, SOLRCONFIG-DELPOLICY1.XML, SCHEMA-SIM.XML, SCHEMA-SNIPPET-FIELD.XML, SCHEMA-COLLATE.XML, STOP-SNOWBALL.TXT, BAD-SCHEMA-SIM-GLOBAL-VS-FT-MISMATCH.XML, PROTWORDS.TXT, SCHEMA-TRIE.XML, SOLRCONFIG_CODEC.XML, BAD-SOLRCONFIG-INVALID-SCRIPTFILE.XML, JASUGGEST.TXT, SCHEMA-TFIDF.XML, SOLRCONFIG-SCRIPT-UPDATEPROCESSOR.XML, SCHEMA-LMJELINEKMERCER.XML, PHRASESUGGEST.TXT, BAD-SOLRCONFIG-MISSING-SCRIPTFILE.XML, BAD-SCHEMA-UNIQUEKEY-USES-DEFAULT.XML, OLD_SYNONYMS.TXT, SOLRCONFIG-DELPOLICY2.XML, XSLT, SOLRCONFIG-NATIVELOCK.XML, BAD-SCHEMA-DUP-FIELD.XML, SOLRCONFIG-NOCACHE.XML, SCHEMA-BM25.XML, ADDFIELDS.UPDATEPROCESSOR.JS, SOLRCONFIG-QUERYSENDER-NOQUERY.XML, SOLRCONFIG-ALTDIRECTORY.XML, COMPOUNDDICTIONARY.TXT, SOLRCONFIG_PERF.XML, SOLRCONFIG-INDEXCONFIG.XML, BAD-SCHEMA-ANALYZER-CLASS-AND-NESTED.XML, SCHEMA-NOT-REQUIRED-UNIQUE-KEY.XML, KEEP-2.TXT, BAD-SCHEMA-UNIQUEKEY-IS-COPYFIELD-DEST.XML, SCHEMA12.XML, MAPPING-ISOLATIN1ACCENT.TXT, BAD_SOLRCONFIG.XML, BAD-SCHEMA-EXTERNAL-FILEFIELD.XML]
[junit4:junit4]   2> 843 T3480 oasc.CachingDirectoryFactory.close Releasing directory:C:\Users\JenkinsSlave\workspace\Lucene-Solr-trunk-Windows\solr\build\solr-core\test\J0\.\solrtest-XmlUpdateRequestHandlerTest-1351608733112
[junit4:junit4]   2> 844 T3480 oass.SolrIndexSearcher.<init> Opening Searcher@27e7fdef main
[junit4:junit4]   2> 844 T3480 oasu.CommitTracker.<init> Hard AutoCommit: disabled
[junit4:junit4]   2> 845 T3480 oasu.CommitTracker.<init> Soft AutoCommit: disabled
[junit4:junit4]   2> 845 T3480 oashc.SpellCheckComponent.inform Initializing spell checkers
[junit4:junit4]   2> 895 T3480 oass.DirectSolrSpellChecker.init init: {name=direct,classname=DirectSolrSpellChecker,field=lowerfilt,minQueryLength=3}
[junit4:junit4]   2> 1158 T3480 oashc.HttpShardHandlerFactory.getParameter Setting socketTimeout to: 0
[junit4:junit4]   2> 1159 T3480 oashc.HttpShardHandlerFactory.getParameter Setting urlScheme to: http://
[junit4:junit4]   2> 1159 T3480 oashc.HttpShardHandlerFactory.getParameter Setting connTimeout to: 0
[junit4:junit4]   2> 1160 T3480 oashc.HttpShardHandlerFactory.getParameter Setting maxConnectionsPerHost to: 20
[junit4:junit4]   2> 1160 T3480 oashc.HttpShardHandlerFactory.getParameter Setting corePoolSize to: 0
[junit4:junit4]   2> 1160 T3480 oashc.HttpShardHandlerFactory.getParameter Setting maximumPoolSize to: 2147483647
[junit4:junit4]   2> 1161 T3480 oashc.HttpShardHandlerFactory.getParameter Setting maxThreadIdleTime to: 5
[junit4:junit4]   2> 1161 T3480 oashc.HttpShardHandlerFactory.getParameter Setting sizeOfQueue to: -1
[junit4:junit4]   2> 1161 T3480 oashc.HttpShardHandlerFactory.getParameter Setting fairnessPolicy to: false
[junit4:junit4]   2> 1162 T3480 oascsi.HttpClientUtil.createClient Creating new http client, config:maxConnectionsPerHost=20&maxConnections=10000&socketTimeout=0&connTimeout=0&retry=false
[junit4:junit4]   2> 1176 T3481 oasc.SolrCore.registerSearcher [collection1] Registered new searcher Searcher@27e7fdef main{StandardDirectoryReader(segments_1:1)}
[junit4:junit4]   2> 1181 T3480 oasc.CoreContainer.registerCore registering core: collection1
[junit4:junit4]   2> 1193 T3480 oas.SolrTestCaseJ4.initCore ####initCore end
[junit4:junit4]   2> 1199 T3480 oas.SolrTestCaseJ4.setUp ###Starting testExternalEntities
[junit4:junit4]   2> 1309 T3480 oas.SolrTestCaseJ4.tearDown ###Ending testExternalEntities
[junit4:junit4]   2> 1314 T3480 oas.SolrTestCaseJ4.setUp ###Starting testReadDelete
[junit4:junit4]   2> 1346 T3480 oas.SolrTestCaseJ4.tearDown ###Ending testReadDelete
[junit4:junit4]   2> 1350 T3480 oas.SolrTestCaseJ4.setUp ###Starting testNamedEntity
[junit4:junit4]   2> ASYNC  NEW_CORE C267 name=collection1 org.apache.solr.core.SolrCore@613aa740
[junit4:junit4]   2> 1358 T3480 C267 oasc.CachingDirectoryFactory.close Releasing directory:C:\Users\JenkinsSlave\workspace\Lucene-Solr-trunk-Windows\solr\build\solr-core\test\J0\.\solrtest-XmlUpdateRequestHandlerTest-1351608733112
[junit4:junit4]   2> 1361 T3480 C267 oasc.SolrDeletionPolicy.onInit SolrDeletionPolicy.onInit: commits:num=1
[junit4:junit4]   2> commit{dir=BaseDirectoryWrapper(org.apache.lucene.store.RAMDirectory@2b4e47d7 lockFactory=org.apache.lucene.store.NativeFSLockFactory@4649b33),segFN=segments_1,generation=1,filenames=[segments_1]
[junit4:junit4]   2> 1361 T3480 C267 oasc.SolrDeletionPolicy.updateCommits newest commit = 1[segments_1]
[junit4:junit4]   2> 1364 T3480 C267 UPDATE [collection1] webapp=null path=null params={} {add=[1]} 0 6
[junit4:junit4]   2> 1379 T3480 C267 oasu.DirectUpdateHandler2.commit start commit{flags=0,_version_=0,optimize=false,openSearcher=true,waitSearcher=true,expungeDeletes=false,softCommit=false}
[junit4:junit4]   2> 1381 T3480 C267 oasc.SolrDeletionPolicy.onCommit SolrDeletionPolicy.onCommit: commits:num=2
[junit4:junit4]   2> commit{dir=BaseDirectoryWrapper(org.apache.lucene.store.RAMDirectory@2b4e47d7 lockFactory=org.apache.lucene.store.NativeFSLockFactory@4649b33),segFN=segments_1,generation=1,filenames=[segments_1]
[junit4:junit4]   2> commit{dir=BaseDirectoryWrapper(org.apache.lucene.store.RAMDirectory@2b4e47d7 lockFactory=org.apache.lucene.store.NativeFSLockFactory@4649b33),segFN=segments_2,generation=2,filenames=[_0_MockSep_0.pos, _0_TestBloomFilteredLucene41Postings_0.tim, _0_TestBloomFilteredLucene41Postings_0.tip, _0_MockFixedIntBlock_0.tib, _0_TestBloomFilteredLucene41Postings_0.pos, _0_MockFixedIntBlock_0.pyl, _0_MockFixedIntBlock_0.skp, _0_MockSep_0.skp, _0_Pulsing41_0.tim, _0_Pulsing41_0.tip, _0_MockFixedIntBlock_0.tii, _0_MockSep_0.doc, _0.si, _0.fnm, _0_TestBloomFilteredLucene41Postings_0.blm, _0_MockFixedIntBlock_0.pos, _0_nrm.cfs, _0_MockFixedIntBlock_0.frq, _0_MockSep_0.tib, _0_Pulsing41_0.doc, _0_Pulsing41_0.pos, _0_MockFixedIntBlock_0.doc, _0_nrm.cfe, _0_MockSep_0.frq, _0_TestBloomFilteredLucene41Postings_0.doc, segments_2, _0.fdx, _0_MockSep_0.tii, _0_MockSep_0.pyl, _0.fdt]
[junit4:junit4]   2> 1381 T3480 C267 oasc.SolrDeletionPolicy.updateCommits newest commit = 2[_0_MockSep_0.pos, _0_TestBloomFilteredLucene41Postings_0.tim, _0_TestBloomFilteredLucene41Postings_0.tip, _0_MockFixedIntBlock_0.tib, _0_TestBloomFilteredLucene41Postings_0.pos, _0_MockFixedIntBlock_0.pyl, _0_MockFixedIntBlock_0.skp, _0_MockSep_0.skp, _0_Pulsing41_0.tim, _0_Pulsing41_0.tip, _0_MockFixedIntBlock_0.tii, _0_MockSep_0.doc, _0.si, _0.fnm, _0_TestBloomFilteredLucene41Postings_0.blm, _0_MockFixedIntBlock_0.pos, _0_nrm.cfs, _0_MockFixedIntBlock_0.frq, _0_MockSep_0.tib, _0_Pulsing41_0.doc, _0_Pulsing41_0.pos, _0_MockFixedIntBlock_0.doc, _0_nrm.cfe, _0_MockSep_0.frq, _0_TestBloomFilteredLucene41Postings_0.doc, segments_2, _0.fdx, _0_MockSep_0.tii, _0_MockSep_0.pyl, _0.fdt]
[junit4:junit4]   2> 1381 T3480 C267 oasc.CachingDirectoryFactory.close Releasing directory:C:\Users\JenkinsSlave\workspace\Lucene-Solr-trunk-Windows\solr\build\solr-core\test\J0\.\solrtest-XmlUpdateRequestHandlerTest-1351608733112
[junit4:junit4]   2> 1382 T3480 C267 oass.SolrIndexSearcher.<init> Opening Searcher@4a99196b main
[junit4:junit4]   2> 1384 T3480 C267 oasu.DirectUpdateHandler2.commit end_commit_flush
[junit4:junit4]   2> 1386 T3481 oasc.SolrCore.registerSearcher [collection1] Registered new searcher Searcher@4a99196b main{StandardDirectoryReader(segments_2:3 _0(5.0):C1)}
[junit4:junit4]   2> 1387 T3481 oasc.CachingDirectoryFactory.close Releasing directory:C:\Users\JenkinsSlave\workspace\Lucene-Solr-trunk-Windows\solr\build\solr-core\test\J0\.\solrtest-XmlUpdateRequestHandlerTest-1351608733112\index
[junit4:junit4]   2> 1387 T3480 C267 UPDATE [collection1] webapp=null path=null params={} {commit=} 0 8
[junit4:junit4]   2> 1389 T3480 C267 REQ [collection1] webapp=null path=null params={start=0&q=foo_s:zzz&qt=standard&rows=20&version=2.2} hits=1 status=0 QTime=0
[junit4:junit4]   2> 1391 T3480 oas.SolrTestCaseJ4.tearDown ###Ending testNamedEntity
[junit4:junit4]   2> 1399 T3480 oas.SolrTestCaseJ4.setUp ###Starting testRequestParams
[junit4:junit4]   2> 1402 T3480 oas.SolrTestCaseJ4.tearDown ###Ending testRequestParams
[junit4:junit4]   2> 1409 T3480 oas.SolrTestCaseJ4.setUp ###Starting testReadDoc
[junit4:junit4]   2> 1410 T3480 oas.SolrTestCaseJ4.tearDown ###Ending testReadDoc
[junit4:junit4]   2> 1414 T3480 oas.SolrTestCaseJ4.deleteCore ###deleteCore
[junit4:junit4]   2> 1414 T3480 oasc.CoreContainer.shutdown Shutting down CoreContainer instance=1635082524
[junit4:junit4]   2> 1414 T3480 oasc.SolrCore.close [collection1]  CLOSING SolrCore org.apache.solr.core.SolrCore@613aa740
[junit4:junit4]   2> 1422 T3480 oasu.DirectUpdateHandler2.close closing DirectUpdateHandler2{commits=1,autocommits=0,soft autocommits=0,optimizes=0,rollbacks=0,expungeDeletes=0,docsPending=0,adds=0,deletesById=0,deletesByQuery=0,errors=0,cumulative_adds=1,cumulative_deletesById=0,cumulative_deletesByQuery=0,cumulative_errors=0}
[junit4:junit4]   2> 1422 T3480 oasc.SolrCore.decrefSolrCoreState Closing SolrCoreState
[junit4:junit4]   2> 1423 T3480 oasu.DefaultSolrCoreState.closeIndexWriter SolrCoreState ref count has reached 0 - closing IndexWriter
[junit4:junit4]   2> 1423 T3480 oasu.DefaultSolrCoreState.closeIndexWriter closing IndexWriter with IndexWriterCloser
[junit4:junit4]   2> 1424 T3480 C267 oasc.CachingDirectoryFactory.close Releasing directory:C:\Users\JenkinsSlave\workspace\Lucene-Solr-trunk-Windows\solr\build\solr-core\test\J0\.\solrtest-XmlUpdateRequestHandlerTest-1351608733112\index
[junit4:junit4]   2> 1424 T3480 oasc.SolrCore.closeSearcher [collection1] Closing main searcher on request.
[junit4:junit4]   2> 1425 T3480 oasc.CachingDirectoryFactory.close Releasing directory:C:\Users\JenkinsSlave\workspace\Lucene-Solr-trunk-Windows\solr\build\solr-core\test\J0\.\solrtest-XmlUpdateRequestHandlerTest-1351608733112\index
[junit4:junit4]   2> NOTE: test params are: codec=Lucene41: {timestamp=PostingsFormat(name=TestBloomFilteredLucene41Postings), range_facet_l=PostingsFormat(name=TestBloomFilteredLucene41Postings), id=MockFixedIntBlock(blockSize=535), range_facet_sl=PostingsFormat(name=MockSep), range_facet_si=Pulsing41(freqCutoff=11 minBlockSize=68 maxBlockSize=165), foo_s=PostingsFormat(name=TestBloomFilteredLucene41Postings), multiDefault=Pulsing41(freqCutoff=11 minBlockSize=68 maxBlockSize=165), intDefault=PostingsFormat(name=TestBloomFilteredLucene41Postings)}, sim=RandomSimilarityProvider(queryNorm=true,coord=crazy): {}, locale=en_US, timezone=America/St_Lucia
[junit4:junit4]   2> NOTE: Windows 7 6.1 amd64/Oracle Corporation 1.7.0_07 (64-bit)/cpus=2,threads=1,free=40570416,total=431357952
[junit4:junit4]   2> NOTE: All tests run in this JVM: [DebugComponentTest, TestPropInjectDefaults, TestQueryUtils, ScriptEngineTest, TestQuerySenderNoQuery, EchoParamsTest, SuggesterTSTTest, TestFiltering, SolrCoreCheckLockOnStartupTest, StatsComponentTest, DistributedSpellCheckComponentTest, DateMathParserTest, StandardRequestHandlerTest, TestQueryTypes, TestIBSimilarityFactory, TestMergePolicyConfig, SpellCheckCollatorTest, TestLazyCores, PeerSyncTest, FileBasedSpellCheckerTest, TestCharFilters, TermVectorComponentDistributedTest, TestSolrJ, MultiTermTest, SpellPossibilityIteratorTest, TimeZoneUtilsTest, FieldAnalysisRequestHandlerTest, BasicDistributedZk2Test, MoreLikeThisHandlerTest, WordBreakSolrSpellCheckerTest, TestReload, DistributedQueryElevationComponentTest, CacheHeaderTest, TestPerFieldSimilarity, SpellingQueryConverterTest, SpellCheckComponentTest, TestBadConfig, TestLuceneMatchVersion, LeaderElectionIntegrationTest, RequiredFieldsTest, TestSort, SignatureUpdateProcessorFactoryTest, SearchHandlerTest, LukeRequestHandlerTest, TestSolrIndexConfig, TestArbitraryIndexDir, AnalysisAfterCoreReloadTest, TestCodecSupport, AlternateDirectoryTest, TestUtils, TestJmxIntegration, ZkControllerTest, TestPHPSerializedResponseWriter, IndexSchemaRuntimeFieldTest, TestWriterPerf, SampleTest, JsonLoaderTest, DOMUtilTest, TestIndexSearcher, TestReversedWildcardFilterFactory, TestCSVLoader, SolrPluginUtilsTest, QueryElevationComponentTest, ResponseLogComponentTest, SystemInfoHandlerTest, TestLRUCache, TestSurroundQueryParser, TestDFRSimilarityFactory, RequestHandlersTest, TestDocSet, MBeansHandlerTest, TestFaceting, SolrCmdDistributorTest, TestCollationField, TestStressLucene, TestBinaryField, SpatialFilterTest, TestJoin, TestReplicationHandler, ConvertedLegacyTest, OutputWriterTest, BadComponentTest, TestCoreContainer, LegacyHTMLStripCharFilterTest, DocumentAnalysisRequestHandlerTest, ClusterStateUpdateTest, TestSearchPerf, BasicZkTest, DirectUpdateHandlerTest, TestSuggestSpellingConverter, TestRecovery, SimpleFacetsTest, CurrencyFieldTest, TestFoldingMultitermQuery, TestOmitPositions, TestGroupingSearch, HighlighterTest, XsltUpdateRequestHandlerTest, TestLMDirichletSimilarityFactory, BasicDistributedZkTest, SuggesterFSTTest, FileUtilsTest, ZkSolrClientTest, TestDistributedGrouping, DefaultValueUpdateProcessorTest, BinaryUpdateRequestHandlerTest, ResourceLoaderTest, CSVRequestHandlerTest, TestTrie, ZkNodePropsTest, OverseerTest, RecoveryZkTest, FullSolrCloudDistribCmdsTest, LeaderElectionTest, TestRealTimeGet, TestRandomFaceting, TestDistributedSearch, TestExtendedDismaxParser, SoftAutoCommitTest, AutoCommitTest, TestHashPartitioner, DistributedTermsComponentTest, SolrCoreTest, IndexBasedSpellCheckerTest, TestRangeQuery, TestMultiCoreConfBootstrap, DirectSolrSpellCheckerTest, SortByFunctionTest, BasicFunctionalityTest, TestBinaryResponseWriter, CoreAdminHandlerTest, TestFunctionQuery, SolrRequestParserTest, DirectSolrConnectionTest, TestRemoteStreaming, QueryEqualityTest, TestWordDelimiterFilterFactory, PolyFieldTest, TestCSVResponseWriter, DocumentBuilderTest, TestPseudoReturnFields, DisMaxRequestHandlerTest, IndexSchemaTest, QueryParsingTest, TermsComponentTest, DistanceFunctionTest, SolrInfoMBeanTest, MinimalSchemaTest, XmlUpdateRequestHandlerTest]
[junit4:junit4]   2> NOTE: reproduce with: ant test  -Dtestcase=XmlUpdateRequestHandlerTest -Dtests.seed=48988F00C809D85F -Dtests.slow=true -Dtests.locale=en_US -Dtests.timezone=America/St_Lucia -Dtests.file.encoding=US-ASCII
[junit4:junit4] ERROR   0.00s | XmlUpdateRequestHandlerTest (suite) <<<
[junit4:junit4]    > Throwable #1: junit.framework.AssertionFailedError: Clean up static fields (in @AfterClass?), your test seems to hang on to approximately 10,608,816 bytes (threshold is 10,485,760). Field reference sizes (counted individually):
[junit4:junit4]    >   - 10,871,672 bytes, protected static org.apache.solr.handler.UpdateRequestHandler org.apache.solr.handler.XmlUpdateRequestHandlerTest.handler
[junit4:junit4]    >   - 3,792 bytes, private static javax.xml.stream.XMLInputFactory org.apache.solr.handler.XmlUpdateRequestHandlerTest.inputFactory
[junit4:junit4]    >   - 280 bytes, public static org.junit.rules.TestRule org.apache.solr.SolrTestCaseJ4.solrClassRules
[junit4:junit4]    >   - 232 bytes, protected static java.lang.String org.apache.solr.SolrTestCaseJ4.testSolrHome
[junit4:junit4]    >   - 128 bytes, private static java.lang.String org.apache.solr.SolrTestCaseJ4.factoryProp
[junit4:junit4]    >   - 64 bytes, private static java.lang.String org.apache.solr.SolrTestCaseJ4.coreName
[junit4:junit4]    > at __randomizedtesting.SeedInfo.seed([48988F00C809D85F]:0)
[junit4:junit4]    > at com.carrotsearch.randomizedtesting.rules.StaticFieldsInvariantRule$1.afterAlways(StaticFieldsInvariantRule.java:127)
[junit4:junit4]    > at com.carrotsearch.randomizedtesting.rules.StatementAdapter.evaluate(StatementAdapter.java:43)
[junit4:junit4]    > at org.apache.lucene.util.TestRuleAssertionsRequired$1.evaluate(TestRuleAssertionsRequired.java:43)
[junit4:junit4]    > at org.apache.lucene.util.TestRuleMarkFailure$1.evaluate(TestRuleMarkFailure.java:48)
[junit4:junit4]    > at org.apache.lucene.util.TestRuleIgnoreAfterMaxFailures$1.evaluate(TestRuleIgnoreAfterMaxFailures.java:70)
[junit4:junit4]    > at org.apache.lucene.util.TestRuleIgnoreTestSuites$1.evaluate(TestRuleIgnoreTestSuites.java:55)
[junit4:junit4]    > at com.carrotsearch.randomizedtesting.rules.StatementAdapter.evaluate(StatementAdapter.java:36)
[junit4:junit4]    > at com.carrotsearch.randomizedtesting.ThreadLeakControl$StatementRunner.run(ThreadLeakControl.java:358)
[junit4:junit4]    > at java.lang.Thread.run(Thread.java:722)
[junit4:junit4] Completed in 2.19s, 5 tests, 1 failure <<< FAILURES!

[...truncated 246 lines...]
BUILD FAILED
C:\Users\JenkinsSlave\workspace\Lucene-Solr-trunk-Windows\build.xml:335: The following error occurred while executing this line:
C:\Users\JenkinsSlave\workspace\Lucene-Solr-trunk-Windows\build.xml:39: The following error occurred while executing this line:
C:\Users\JenkinsSlave\workspace\Lucene-Solr-trunk-Windows\solr\build.xml:178: The following error occurred while executing this line:
C:\Users\JenkinsSlave\workspace\Lucene-Solr-trunk-Windows\lucene\module-build.xml:61: The following error occurred while executing this line:
C:\Users\JenkinsSlave\workspace\Lucene-Solr-trunk-Windows\lucene\common-build.xml:1159: The following error occurred while executing this line:
C:\Users\JenkinsSlave\workspace\Lucene-Solr-trunk-Windows\lucene\common-build.xml:827: There were test failures: 233 suites, 965 tests, 1 suite-level error, 13 ignored (8 assumptions)

Total time: 37 minutes 0 seconds
Build step 'Invoke Ant' marked build as failure
Archiving artifacts
Recording test results
Description set: Java: 64bit/jdk1.7.0_07 -XX:+UseParallelGC
Email was triggered for: Failure
Sending email for trigger: Failure




---------------------------------------------------------------------
To unsubscribe, e-mail: [hidden email]
For additional commands, e-mail: [hidden email]
Reply | Threaded
Open this post in threaded view
|

[JENKINS] Lucene-Solr-trunk-Windows (64bit/jdk1.7.0_07) - Build # 1370 - Still Failing!

Policeman Jenkins Server
Build: http://jenkins.sd-datasolutions.de/job/Lucene-Solr-trunk-Windows/1370/
Java: 64bit/jdk1.7.0_07 -XX:+UseConcMarkSweepGC

1 tests failed.
FAILED:  junit.framework.TestSuite.org.apache.solr.handler.XmlUpdateRequestHandlerTest

Error Message:
Clean up static fields (in @AfterClass?), your test seems to hang on to approximately 11,836,024 bytes (threshold is 10,485,760). Field reference sizes (counted individually):   - 12,070,224 bytes, protected static org.apache.solr.handler.UpdateRequestHandler org.apache.solr.handler.XmlUpdateRequestHandlerTest.handler   - 3,792 bytes, private static javax.xml.stream.XMLInputFactory org.apache.solr.handler.XmlUpdateRequestHandlerTest.inputFactory   - 280 bytes, public static org.junit.rules.TestRule org.apache.solr.SolrTestCaseJ4.solrClassRules   - 232 bytes, protected static java.lang.String org.apache.solr.SolrTestCaseJ4.testSolrHome   - 128 bytes, private static java.lang.String org.apache.solr.SolrTestCaseJ4.factoryProp   - 64 bytes, private static java.lang.String org.apache.solr.SolrTestCaseJ4.coreName

Stack Trace:
junit.framework.AssertionFailedError: Clean up static fields (in @AfterClass?), your test seems to hang on to approximately 11,836,024 bytes (threshold is 10,485,760). Field reference sizes (counted individually):
  - 12,070,224 bytes, protected static org.apache.solr.handler.UpdateRequestHandler org.apache.solr.handler.XmlUpdateRequestHandlerTest.handler
  - 3,792 bytes, private static javax.xml.stream.XMLInputFactory org.apache.solr.handler.XmlUpdateRequestHandlerTest.inputFactory
  - 280 bytes, public static org.junit.rules.TestRule org.apache.solr.SolrTestCaseJ4.solrClassRules
  - 232 bytes, protected static java.lang.String org.apache.solr.SolrTestCaseJ4.testSolrHome
  - 128 bytes, private static java.lang.String org.apache.solr.SolrTestCaseJ4.factoryProp
  - 64 bytes, private static java.lang.String org.apache.solr.SolrTestCaseJ4.coreName
        at __randomizedtesting.SeedInfo.seed([ED1A9C533D68A0C3]:0)
        at com.carrotsearch.randomizedtesting.rules.StaticFieldsInvariantRule$1.afterAlways(StaticFieldsInvariantRule.java:127)
        at com.carrotsearch.randomizedtesting.rules.StatementAdapter.evaluate(StatementAdapter.java:43)
        at org.apache.lucene.util.TestRuleAssertionsRequired$1.evaluate(TestRuleAssertionsRequired.java:43)
        at org.apache.lucene.util.TestRuleMarkFailure$1.evaluate(TestRuleMarkFailure.java:48)
        at org.apache.lucene.util.TestRuleIgnoreAfterMaxFailures$1.evaluate(TestRuleIgnoreAfterMaxFailures.java:70)
        at org.apache.lucene.util.TestRuleIgnoreTestSuites$1.evaluate(TestRuleIgnoreTestSuites.java:55)
        at com.carrotsearch.randomizedtesting.rules.StatementAdapter.evaluate(StatementAdapter.java:36)
        at com.carrotsearch.randomizedtesting.ThreadLeakControl$StatementRunner.run(ThreadLeakControl.java:358)
        at java.lang.Thread.run(Thread.java:722)




Build Log:
[...truncated 8847 lines...]
[junit4:junit4] Suite: org.apache.solr.handler.XmlUpdateRequestHandlerTest
[junit4:junit4]   2> 1 T3303 oas.SolrTestCaseJ4.initCore ####initCore
[junit4:junit4]   2> Creating dataDir: C:\Users\JenkinsSlave\workspace\Lucene-Solr-trunk-Windows\solr\build\solr-core\test\J0\.\solrtest-XmlUpdateRequestHandlerTest-1351614363016
[junit4:junit4]   2> 3 T3303 oasc.SolrResourceLoader.<init> new SolrResourceLoader for directory: 'C:\Users\JenkinsSlave\workspace\Lucene-Solr-trunk-Windows\solr\build\solr-core\test-files\solr\collection1\'
[junit4:junit4]   2> 4 T3303 oasc.SolrResourceLoader.replaceClassLoader Adding 'file:/C:/Users/JenkinsSlave/workspace/Lucene-Solr-trunk-Windows/solr/build/solr-core/test-files/solr/collection1/lib/classes/' to classloader
[junit4:junit4]   2> 5 T3303 oasc.SolrResourceLoader.replaceClassLoader Adding 'file:/C:/Users/JenkinsSlave/workspace/Lucene-Solr-trunk-Windows/solr/build/solr-core/test-files/solr/collection1/lib/README' to classloader
[junit4:junit4]   2> 73 T3303 oasc.SolrConfig.<init> Using Lucene MatchVersion: LUCENE_50
[junit4:junit4]   2> 139 T3303 oasc.SolrConfig.<init> Loaded SolrConfig: solrconfig.xml
[junit4:junit4]   2> 140 T3303 oass.IndexSchema.readSchema Reading Solr Schema
[junit4:junit4]   2> 144 T3303 oass.IndexSchema.readSchema Schema name=test
[junit4:junit4]   2> 719 T3303 oass.OpenExchangeRatesOrgProvider.init Initialized with rates=open-exchange-rates.json, refreshInterval=1440.
[junit4:junit4]   2> 732 T3303 oass.IndexSchema.readSchema default search field in schema is text
[junit4:junit4]   2> 738 T3303 oass.IndexSchema.readSchema unique key field: id
[junit4:junit4]   2> 746 T3303 oass.FileExchangeRateProvider.reload Reloading exchange rates from file currency.xml
[junit4:junit4]   2> 751 T3303 oass.FileExchangeRateProvider.reload Reloading exchange rates from file currency.xml
[junit4:junit4]   2> 755 T3303 oass.OpenExchangeRatesOrgProvider.reload Reloading exchange rates from open-exchange-rates.json
[junit4:junit4]   2> 756 T3303 oass.OpenExchangeRatesOrgProvider.reload Reloading exchange rates from open-exchange-rates.json
[junit4:junit4]   2> 756 T3303 oasc.SolrResourceLoader.locateSolrHome JNDI not configured for solr (NoInitialContextEx)
[junit4:junit4]   2> 757 T3303 oasc.SolrResourceLoader.locateSolrHome using system property solr.solr.home: C:\Users\JenkinsSlave\workspace\Lucene-Solr-trunk-Windows\solr\build\solr-core\test-files\solr
[junit4:junit4]   2> 757 T3303 oasc.SolrResourceLoader.<init> new SolrResourceLoader for directory: 'C:\Users\JenkinsSlave\workspace\Lucene-Solr-trunk-Windows\solr\build\solr-core\test-files\solr\'
[junit4:junit4]   2> 768 T3303 oasc.CoreContainer.<init> New CoreContainer 974373728
[junit4:junit4]   2> 768 T3303 oasc.SolrCore.<init> [collection1] Opening new SolrCore at C:\Users\JenkinsSlave\workspace\Lucene-Solr-trunk-Windows\solr\build\solr-core\test-files\solr\collection1\, dataDir=C:\Users\JenkinsSlave\workspace\Lucene-Solr-trunk-Windows\solr\build\solr-core\test\J0\.\solrtest-XmlUpdateRequestHandlerTest-1351614363016\
[junit4:junit4]   2> 769 T3303 oasc.JmxMonitoredMap.<init> JMX monitoring is enabled. Adding Solr mbeans to JMX Server: com.sun.jmx.mbeanserver.JmxMBeanServer@49dbfd4d
[junit4:junit4]   2> 769 T3303 oasc.SolrCore.initDirectoryFactory org.apache.solr.core.MockDirectoryFactory
[junit4:junit4]   2> 770 T3303 oasc.CachingDirectoryFactory.injectLockFactory WARNING No lockType configured for MockDirWrapper(org.apache.lucene.store.RAMDirectory@c25995 lockFactory=org.apache.lucene.store.SingleInstanceLockFactory@57874596) assuming 'simple'
[junit4:junit4]   2> 771 T3303 oasc.CachingDirectoryFactory.get return new directory for C:\Users\JenkinsSlave\workspace\Lucene-Solr-trunk-Windows\solr\build\solr-core\test\J0\.\solrtest-XmlUpdateRequestHandlerTest-1351614363016 forceNew:false
[junit4:junit4]   2> 771 T3303 oasc.CachingDirectoryFactory.close Releasing directory:C:\Users\JenkinsSlave\workspace\Lucene-Solr-trunk-Windows\solr\build\solr-core\test\J0\.\solrtest-XmlUpdateRequestHandlerTest-1351614363016
[junit4:junit4]   2> 771 T3303 oasc.SolrCore.getNewIndexDir New index directory detected: old=null new=C:\Users\JenkinsSlave\workspace\Lucene-Solr-trunk-Windows\solr\build\solr-core\test\J0\.\solrtest-XmlUpdateRequestHandlerTest-1351614363016\index/
[junit4:junit4]   2> 772 T3303 oasc.SolrCore.initIndex WARNING [collection1] Solr index directory 'C:\Users\JenkinsSlave\workspace\Lucene-Solr-trunk-Windows\solr\build\solr-core\test\J0\.\solrtest-XmlUpdateRequestHandlerTest-1351614363016\index' doesn't exist. Creating new index...
[junit4:junit4]   2> 773 T3303 oasc.CachingDirectoryFactory.get return new directory for C:\Users\JenkinsSlave\workspace\Lucene-Solr-trunk-Windows\solr\build\solr-core\test\J0\.\solrtest-XmlUpdateRequestHandlerTest-1351614363016\index forceNew:false
[junit4:junit4]   2> 775 T3303 oasc.SolrDeletionPolicy.onCommit SolrDeletionPolicy.onCommit: commits:num=1
[junit4:junit4]   2> commit{dir=MockDirWrapper(org.apache.lucene.store.RAMDirectory@54c7d1ee lockFactory=org.apache.lucene.store.NativeFSLockFactory@7dc76c68),segFN=segments_1,generation=1,filenames=[segments_1]
[junit4:junit4]   2> 775 T3303 oasc.SolrDeletionPolicy.updateCommits newest commit = 1[segments_1]
[junit4:junit4]   2> 776 T3303 oasc.CachingDirectoryFactory.close Releasing directory:C:\Users\JenkinsSlave\workspace\Lucene-Solr-trunk-Windows\solr\build\solr-core\test\J0\.\solrtest-XmlUpdateRequestHandlerTest-1351614363016\index
[junit4:junit4]   2> 776 T3303 oasc.SolrCore.initWriters created xml: solr.XMLResponseWriter
[junit4:junit4]   2> 778 T3303 oasup.UpdateRequestProcessorChain.init inserting DistributedUpdateProcessorFactory into updateRequestProcessorChain "dedupe"
[junit4:junit4]   2> 778 T3303 oasup.UpdateRequestProcessorChain.init inserting DistributedUpdateProcessorFactory into updateRequestProcessorChain "dedupe-allfields"
[junit4:junit4]   2> 779 T3303 oasup.UpdateRequestProcessorChain.init inserting DistributedUpdateProcessorFactory into updateRequestProcessorChain "stored_sig"
[junit4:junit4]   2> 779 T3303 oasup.UpdateRequestProcessorChain.init inserting DistributedUpdateProcessorFactory into updateRequestProcessorChain "uniq-fields"
[junit4:junit4]   2> 780 T3303 oasup.UpdateRequestProcessorChain.init inserting DistributedUpdateProcessorFactory into updateRequestProcessorChain "distrib-dup-test-chain-implicit"
[junit4:junit4]   2> 780 T3303 oasc.RequestHandlers.initHandlersFromConfig adding lazy requestHandler: solr.ReplicationHandler
[junit4:junit4]   2> 780 T3303 oasc.RequestHandlers.initHandlersFromConfig created /replication: solr.ReplicationHandler
[junit4:junit4]   2> 781 T3303 oasc.RequestHandlers.initHandlersFromConfig created standard: solr.StandardRequestHandler
[junit4:junit4]   2> 782 T3303 oasc.RequestHandlers.initHandlersFromConfig created /get: solr.RealTimeGetHandler
[junit4:junit4]   2> 783 T3303 oasc.RequestHandlers.initHandlersFromConfig created dismax: solr.SearchHandler
[junit4:junit4]   2> 783 T3303 oasc.RequestHandlers.initHandlersFromConfig created mock: org.apache.solr.core.MockQuerySenderListenerReqHandler
[junit4:junit4]   2> 784 T3303 oasc.RequestHandlers.initHandlersFromConfig created /admin/: org.apache.solr.handler.admin.AdminHandlers
[junit4:junit4]   2> 785 T3303 oasc.RequestHandlers.initHandlersFromConfig created defaults: solr.StandardRequestHandler
[junit4:junit4]   2> 785 T3303 oasc.RequestHandlers.initHandlersFromConfig adding lazy requestHandler: solr.StandardRequestHandler
[junit4:junit4]   2> 785 T3303 oasc.RequestHandlers.initHandlersFromConfig created lazy: solr.StandardRequestHandler
[junit4:junit4]   2> 786 T3303 oasc.RequestHandlers.initHandlersFromConfig created /update: solr.UpdateRequestHandler
[junit4:junit4]   2> 787 T3303 oasc.RequestHandlers.initHandlersFromConfig created /terms: org.apache.solr.handler.component.SearchHandler
[junit4:junit4]   2> 788 T3303 oasc.RequestHandlers.initHandlersFromConfig created spellCheckCompRH: org.apache.solr.handler.component.SearchHandler
[junit4:junit4]   2> 788 T3303 oasc.RequestHandlers.initHandlersFromConfig created spellCheckCompRH_Direct: org.apache.solr.handler.component.SearchHandler
[junit4:junit4]   2> 789 T3303 oasc.RequestHandlers.initHandlersFromConfig created spellCheckWithWordbreak: org.apache.solr.handler.component.SearchHandler
[junit4:junit4]   2> 790 T3303 oasc.RequestHandlers.initHandlersFromConfig created spellCheckWithWordbreak_Direct: org.apache.solr.handler.component.SearchHandler
[junit4:junit4]   2> 791 T3303 oasc.RequestHandlers.initHandlersFromConfig created spellCheckCompRH1: org.apache.solr.handler.component.SearchHandler
[junit4:junit4]   2> 792 T3303 oasc.RequestHandlers.initHandlersFromConfig created tvrh: org.apache.solr.handler.component.SearchHandler
[junit4:junit4]   2> 792 T3303 oasc.RequestHandlers.initHandlersFromConfig created /mlt: solr.MoreLikeThisHandler
[junit4:junit4]   2> 793 T3303 oasc.RequestHandlers.initHandlersFromConfig created /debug/dump: solr.DumpRequestHandler
[junit4:junit4]   2> 804 T3303 oashl.XMLLoader.init xsltCacheLifetimeSeconds=60
[junit4:junit4]   2> 810 T3303 oasc.SolrCore.initDeprecatedSupport WARNING solrconfig.xml uses deprecated <admin/gettableFiles>, Please update your config to use the ShowFileRequestHandler.
[junit4:junit4]   2> 813 T3303 oasc.SolrCore.initDeprecatedSupport WARNING adding ShowFileRequestHandler with hidden files: [THROW.ERROR.ON.ADD.UPDATEPROCESSOR.JS, SOLRCONFIG-HIGHLIGHT.XML, SCHEMA-REQUIRED-FIELDS.XML, TRIVIAL.UPDATEPROCESSOR1.JS, BAD-SCHEMA-DUP-DYNAMICFIELD.XML, SCHEMA-MINIMAL.XML, SCHEMA-REPLICATION2.XML, SOLRCONFIG-CACHING.XML, SOLRCONFIG-REPEATER.XML, CURRENCY.XML, BAD-SCHEMA-NONTEXT-ANALYZER.XML, SOLRCONFIG-MERGEPOLICY.XML, SOLRCONFIG-TLOG.XML, SOLRCONFIG-MASTER.XML, BAD-SCHEMA-UNIQUEKEY-MULTIVALUED.XML, SCHEMA11.XML, SOLRCONFIG-BASIC.XML, DA_COMPOUNDDICTIONARY.TXT, MISSLEADING.EXTENSION.UPDATEPROCESSOR.JS.TXT, SCHEMA-COPYFIELD-TEST.XML, SOLRCONFIG-SLAVE.XML, SOLRCONFIG-PROPINJECT-INDEXDEFAULT.XML, ELEVATE.XML, TRIVIAL.UPDATEPROCESSOR0.JS, BAD-SOLRCONFIG-BOGUS-SCRIPTENGINE-NAME.XML, SCHEMA-CHARFILTERS.XML, SCHEMA-IB.XML, SOLRCONFIG-QUERYSENDER.XML, SOLRCONFIG-SNIPPET-PROCESSOR.XML, DA_UTF8.XML, SCHEMA-REPLICATION1.XML, CONDITIONAL.UPDATEPROCESSOR.JS, MISSING.FUNCTIONS.UPDATEPROCESSOR.JS, HYPHENATION.DTD, SOLRCONFIG-ENABLEPLUGIN.XML, STEMDICT.TXT, SCHEMA-PHRASESUGGEST.XML, HUNSPELL-TEST.AFF, SCHEMA-SNIPPET-TYPE.XML, STOPTYPES-1.TXT, STOPWORDSWRONGENCODING.TXT, SCHEMA-NUMERIC.XML, SOLRCONFIG-TRANSFORMERS.XML, SOLRCONFIG-PROPINJECT.XML, BAD-SCHEMA-NOT-INDEXED-BUT-TF.XML, SOLRCONFIG-SIMPLELOCK.XML, WDFTYPES.TXT, STOPTYPES-2.TXT, SCHEMA-REVERSED.XML, BAD-SCHEMA-CURRENCY-FT-MULTIVALUED.XML, SOLRCONFIG-SPELLCHECKCOMPONENT.XML, SOLRCONFIG-PHRASESUGGEST.XML, BAD-SCHEMA-CURRENCY-MULTIVALUED.XML, SCHEMA-DFR.XML, BAD-SCHEMA-NOT-INDEXED-BUT-POS.XML, KEEP-1.TXT, OPEN-EXCHANGE-RATES.JSON, SCHEMA-SPATIAL.XML, STOPWITHBOM.TXT, SOLRCONFIG-SPELLCHECKER.XML, SCHEMA-BINARYFIELD.XML, SOLRCONFIG-UPDATE-PROCESSOR-CHAINS.XML, BAD-SCHEMA-OMIT-TF-BUT-NOT-POS.XML, BAD-SCHEMA-DUP-FIELDTYPE.XML, SCHEMA-XINCLUDE.XML, SOLRCONFIG-MASTER1.XML, SYNONYMS.TXT, BAD-SCHEMA-CURRENCY-DYNAMIC-MULTIVALUED.XML, SCHEMA.XML, SCHEMA_CODEC.XML, SOLRCONFIG-SOLR-749.XML, SOLRCONFIG-MASTER1-KEEPONEBACKUP.XML, STOP-2.TXT, SOLRCONFIG-FUNCTIONQUERY.XML, SOLRCONFIG-TERMINDEX.XML, SCHEMA-LMDIRICHLET.XML, SOLRCONFIG-ELEVATE.XML, STOPWORDS.TXT, SCHEMA-FOLDING.XML, SCHEMA-STOP-KEEP.XML, BAD-SCHEMA-NOT-INDEXED-BUT-NORMS.XML, SOLRCONFIG-SOLCOREPROPERTIES.XML, STOP-1.TXT, SOLRCONFIG-MASTER2.XML, SCHEMA-SPELLCHECKER.XML, SOLRCONFIG-RESPONSE-LOG-COMPONENT.XML, SOLRCONFIG-LAZYWRITER.XML, SCHEMA-LUCENEMATCHVERSION.XML, FRENCHARTICLES.TXT, BAD-MP-SOLRCONFIG.XML, SCHEMA15.XML, SOLRCONFIG-REQHANDLER.INCL, SCHEMASURROUND.XML, SOLRCONFIG-MASTER3.XML, HUNSPELL-TEST.DIC, SOLRCONFIG-XINCLUDE.XML, BAD-SCHEMA-CODEC-GLOBAL-VS-FT-MISMATCH.XML, SOLRCONFIG-SLAVE1.XML, SOLRCONFIG-DELPOLICY1.XML, SCHEMA-SIM.XML, SCHEMA-SNIPPET-FIELD.XML, SCHEMA-COLLATE.XML, STOP-SNOWBALL.TXT, BAD-SCHEMA-SIM-GLOBAL-VS-FT-MISMATCH.XML, PROTWORDS.TXT, SCHEMA-TRIE.XML, SOLRCONFIG_CODEC.XML, BAD-SOLRCONFIG-INVALID-SCRIPTFILE.XML, JASUGGEST.TXT, SCHEMA-TFIDF.XML, SOLRCONFIG-SCRIPT-UPDATEPROCESSOR.XML, SCHEMA-LMJELINEKMERCER.XML, PHRASESUGGEST.TXT, BAD-SOLRCONFIG-MISSING-SCRIPTFILE.XML, BAD-SCHEMA-UNIQUEKEY-USES-DEFAULT.XML, OLD_SYNONYMS.TXT, SOLRCONFIG-DELPOLICY2.XML, XSLT, SOLRCONFIG-NATIVELOCK.XML, BAD-SCHEMA-DUP-FIELD.XML, SOLRCONFIG-NOCACHE.XML, SCHEMA-BM25.XML, ADDFIELDS.UPDATEPROCESSOR.JS, SOLRCONFIG-QUERYSENDER-NOQUERY.XML, SOLRCONFIG-ALTDIRECTORY.XML, COMPOUNDDICTIONARY.TXT, SOLRCONFIG_PERF.XML, SOLRCONFIG-INDEXCONFIG.XML, BAD-SCHEMA-ANALYZER-CLASS-AND-NESTED.XML, SCHEMA-NOT-REQUIRED-UNIQUE-KEY.XML, KEEP-2.TXT, BAD-SCHEMA-UNIQUEKEY-IS-COPYFIELD-DEST.XML, SCHEMA12.XML, MAPPING-ISOLATIN1ACCENT.TXT, BAD_SOLRCONFIG.XML, BAD-SCHEMA-EXTERNAL-FILEFIELD.XML]
[junit4:junit4]   2> 815 T3303 oasc.CachingDirectoryFactory.close Releasing directory:C:\Users\JenkinsSlave\workspace\Lucene-Solr-trunk-Windows\solr\build\solr-core\test\J0\.\solrtest-XmlUpdateRequestHandlerTest-1351614363016
[junit4:junit4]   2> 815 T3303 oass.SolrIndexSearcher.<init> Opening Searcher@77103877 main
[junit4:junit4]   2> 816 T3303 oasu.CommitTracker.<init> Hard AutoCommit: disabled
[junit4:junit4]   2> 816 T3303 oasu.CommitTracker.<init> Soft AutoCommit: disabled
[junit4:junit4]   2> 817 T3303 oashc.SpellCheckComponent.inform Initializing spell checkers
[junit4:junit4]   2> 827 T3303 oass.DirectSolrSpellChecker.init init: {name=direct,classname=DirectSolrSpellChecker,field=lowerfilt,minQueryLength=3}
[junit4:junit4]   2> 882 T3303 oashc.HttpShardHandlerFactory.getParameter Setting socketTimeout to: 0
[junit4:junit4]   2> 883 T3303 oashc.HttpShardHandlerFactory.getParameter Setting urlScheme to: http://
[junit4:junit4]   2> 883 T3303 oashc.HttpShardHandlerFactory.getParameter Setting connTimeout to: 0
[junit4:junit4]   2> 883 T3303 oashc.HttpShardHandlerFactory.getParameter Setting maxConnectionsPerHost to: 20
[junit4:junit4]   2> 884 T3303 oashc.HttpShardHandlerFactory.getParameter Setting corePoolSize to: 0
[junit4:junit4]   2> 884 T3303 oashc.HttpShardHandlerFactory.getParameter Setting maximumPoolSize to: 2147483647
[junit4:junit4]   2> 884 T3303 oashc.HttpShardHandlerFactory.getParameter Setting maxThreadIdleTime to: 5
[junit4:junit4]   2> 884 T3303 oashc.HttpShardHandlerFactory.getParameter Setting sizeOfQueue to: -1
[junit4:junit4]   2> 884 T3303 oashc.HttpShardHandlerFactory.getParameter Setting fairnessPolicy to: false
[junit4:junit4]   2> 885 T3303 oascsi.HttpClientUtil.createClient Creating new http client, config:maxConnectionsPerHost=20&maxConnections=10000&socketTimeout=0&connTimeout=0&retry=false
[junit4:junit4]   2> 897 T3304 oasc.SolrCore.registerSearcher [collection1] Registered new searcher Searcher@77103877 main{StandardDirectoryReader(segments_1:1)}
[junit4:junit4]   2> 899 T3303 oasc.CoreContainer.registerCore registering core: collection1
[junit4:junit4]   2> 909 T3303 oas.SolrTestCaseJ4.initCore ####initCore end
[junit4:junit4]   2> 913 T3303 oas.SolrTestCaseJ4.setUp ###Starting testNamedEntity
[junit4:junit4]   2> ASYNC  NEW_CORE C257 name=collection1 org.apache.solr.core.SolrCore@677ff169
[junit4:junit4]   2> 1006 T3303 C257 oasc.CachingDirectoryFactory.close Releasing directory:C:\Users\JenkinsSlave\workspace\Lucene-Solr-trunk-Windows\solr\build\solr-core\test\J0\.\solrtest-XmlUpdateRequestHandlerTest-1351614363016
[junit4:junit4]   2> 1010 T3303 C257 oasc.SolrDeletionPolicy.onInit SolrDeletionPolicy.onInit: commits:num=1
[junit4:junit4]   2> commit{dir=MockDirWrapper(org.apache.lucene.store.RAMDirectory@54c7d1ee lockFactory=org.apache.lucene.store.NativeFSLockFactory@7dc76c68),segFN=segments_1,generation=1,filenames=[segments_1]
[junit4:junit4]   2> 1010 T3303 C257 oasc.SolrDeletionPolicy.updateCommits newest commit = 1[segments_1]
[junit4:junit4]   2> 1011 T3303 C257 UPDATE [collection1] webapp=null path=null params={} {add=[1]} 0 91
[junit4:junit4]   2> 1032 T3303 C257 oasu.DirectUpdateHandler2.commit start commit{flags=0,_version_=0,optimize=false,openSearcher=true,waitSearcher=true,expungeDeletes=false,softCommit=false}
[junit4:junit4]   2> 1035 T3303 C257 oasc.SolrDeletionPolicy.onCommit SolrDeletionPolicy.onCommit: commits:num=2
[junit4:junit4]   2> commit{dir=MockDirWrapper(org.apache.lucene.store.RAMDirectory@54c7d1ee lockFactory=org.apache.lucene.store.NativeFSLockFactory@7dc76c68),segFN=segments_1,generation=1,filenames=[segments_1]
[junit4:junit4]   2> commit{dir=MockDirWrapper(org.apache.lucene.store.RAMDirectory@54c7d1ee lockFactory=org.apache.lucene.store.NativeFSLockFactory@7dc76c68),segFN=segments_2,generation=2,filenames=[_0_Lucene41WithOrds_0.tib, _0.fnm, _0_Lucene41WithOrds_0.doc, _0_MockVariableIntBlock_0.doc, _0_Lucene41WithOrds_0.tii, _0_Lucene41WithOrds_0.pos, _0_nrm.cfs, _0_MockVariableIntBlock_0.skp, _0_Direct_0.doc, _0_MockVariableIntBlock_0.pyl, _0_MockVariableIntBlock_0.tib, _0_MockVariableIntBlock_0.frq, _0_SimpleText_0.pst, _0_nrm.cfe, _0_MockVariableIntBlock_0.pos, _0_Direct_0.pos, segments_2, _0.fdx, _0_Direct_0.tip, _0.si, _0_Direct_0.tim, _0.fdt, _0_MockVariableIntBlock_0.tii]
[junit4:junit4]   2> 1035 T3303 C257 oasc.SolrDeletionPolicy.updateCommits newest commit = 2[_0_Lucene41WithOrds_0.tib, _0.fnm, _0_Lucene41WithOrds_0.doc, _0_MockVariableIntBlock_0.doc, _0_Lucene41WithOrds_0.tii, _0_Lucene41WithOrds_0.pos, _0_nrm.cfs, _0_MockVariableIntBlock_0.skp, _0_Direct_0.doc, _0_MockVariableIntBlock_0.pyl, _0_MockVariableIntBlock_0.tib, _0_MockVariableIntBlock_0.frq, _0_SimpleText_0.pst, _0_nrm.cfe, _0_MockVariableIntBlock_0.pos, _0_Direct_0.pos, segments_2, _0.fdx, _0_Direct_0.tip, _0.si, _0_Direct_0.tim, _0.fdt, _0_MockVariableIntBlock_0.tii]
[junit4:junit4]   2> 1036 T3303 C257 oasc.CachingDirectoryFactory.close Releasing directory:C:\Users\JenkinsSlave\workspace\Lucene-Solr-trunk-Windows\solr\build\solr-core\test\J0\.\solrtest-XmlUpdateRequestHandlerTest-1351614363016
[junit4:junit4]   2> 1037 T3303 C257 oass.SolrIndexSearcher.<init> Opening Searcher@4992bebc main
[junit4:junit4]   2> 1037 T3303 C257 oasu.DirectUpdateHandler2.commit end_commit_flush
[junit4:junit4]   2> 1037 T3304 oasc.SolrCore.registerSearcher [collection1] Registered new searcher Searcher@4992bebc main{StandardDirectoryReader(segments_2:3 _0(5.0):C1)}
[junit4:junit4]   2> 1038 T3304 oasc.CachingDirectoryFactory.close Releasing directory:C:\Users\JenkinsSlave\workspace\Lucene-Solr-trunk-Windows\solr\build\solr-core\test\J0\.\solrtest-XmlUpdateRequestHandlerTest-1351614363016\index
[junit4:junit4]   2> 1039 T3303 C257 UPDATE [collection1] webapp=null path=null params={} {commit=} 0 7
[junit4:junit4]   2> 1040 T3303 C257 REQ [collection1] webapp=null path=null params={start=0&q=foo_s:zzz&qt=standard&rows=20&version=2.2} hits=1 status=0 QTime=0
[junit4:junit4]   2> 1042 T3303 oas.SolrTestCaseJ4.tearDown ###Ending testNamedEntity
[junit4:junit4]   2> 1044 T3303 oas.SolrTestCaseJ4.setUp ###Starting testRequestParams
[junit4:junit4]   2> 1051 T3303 oas.SolrTestCaseJ4.tearDown ###Ending testRequestParams
[junit4:junit4]   2> 1056 T3303 oas.SolrTestCaseJ4.setUp ###Starting testReadDelete
[junit4:junit4]   2> 1072 T3303 oas.SolrTestCaseJ4.tearDown ###Ending testReadDelete
[junit4:junit4]   2> 1074 T3303 oas.SolrTestCaseJ4.setUp ###Starting testReadDoc
[junit4:junit4]   2> 1075 T3303 oas.SolrTestCaseJ4.tearDown ###Ending testReadDoc
[junit4:junit4]   2> 1077 T3303 oas.SolrTestCaseJ4.setUp ###Starting testExternalEntities
[junit4:junit4]   2> 1083 T3303 oas.SolrTestCaseJ4.tearDown ###Ending testExternalEntities
[junit4:junit4]   2> 1083 T3303 oas.SolrTestCaseJ4.deleteCore ###deleteCore
[junit4:junit4]   2> 1084 T3303 oasc.CoreContainer.shutdown Shutting down CoreContainer instance=974373728
[junit4:junit4]   2> 1084 T3303 oasc.SolrCore.close [collection1]  CLOSING SolrCore org.apache.solr.core.SolrCore@677ff169
[junit4:junit4]   2> 1087 T3303 oasu.DirectUpdateHandler2.close closing DirectUpdateHandler2{commits=1,autocommits=0,soft autocommits=0,optimizes=0,rollbacks=0,expungeDeletes=0,docsPending=0,adds=0,deletesById=0,deletesByQuery=0,errors=0,cumulative_adds=1,cumulative_deletesById=0,cumulative_deletesByQuery=0,cumulative_errors=0}
[junit4:junit4]   2> 1087 T3303 oasc.SolrCore.decrefSolrCoreState Closing SolrCoreState
[junit4:junit4]   2> 1087 T3303 oasu.DefaultSolrCoreState.closeIndexWriter SolrCoreState ref count has reached 0 - closing IndexWriter
[junit4:junit4]   2> 1089 T3303 oasu.DefaultSolrCoreState.closeIndexWriter closing IndexWriter with IndexWriterCloser
[junit4:junit4]   2> 1089 T3303 C257 oasc.CachingDirectoryFactory.close Releasing directory:C:\Users\JenkinsSlave\workspace\Lucene-Solr-trunk-Windows\solr\build\solr-core\test\J0\.\solrtest-XmlUpdateRequestHandlerTest-1351614363016\index
[junit4:junit4]   2> 1090 T3303 oasc.SolrCore.closeSearcher [collection1] Closing main searcher on request.
[junit4:junit4]   2> 1090 T3303 oasc.CachingDirectoryFactory.close Releasing directory:C:\Users\JenkinsSlave\workspace\Lucene-Solr-trunk-Windows\solr\build\solr-core\test\J0\.\solrtest-XmlUpdateRequestHandlerTest-1351614363016\index
[junit4:junit4]   2> NOTE: test params are: codec=Lucene41: {timestamp=PostingsFormat(name=Lucene41WithOrds), range_facet_l=PostingsFormat(name=Lucene41WithOrds), id=PostingsFormat(name=SimpleText), range_facet_sl=PostingsFormat(name=Direct), range_facet_si=MockVariableIntBlock(baseBlockSize=34), foo_s=PostingsFormat(name=Lucene41WithOrds), multiDefault=MockVariableIntBlock(baseBlockSize=34), intDefault=PostingsFormat(name=Lucene41WithOrds)}, sim=DefaultSimilarity, locale=mk_MK, timezone=Asia/Sakhalin
[junit4:junit4]   2> NOTE: Windows 7 6.1 amd64/Oracle Corporation 1.7.0_07 (64-bit)/cpus=2,threads=1,free=153683832,total=432218112
[junit4:junit4]   2> NOTE: All tests run in this JVM: [TestSolrIndexConfig, PreAnalyzedFieldTest, OpenExchangeRatesOrgProviderTest, TestCSVLoader, RequestHandlersTest, TestCharFilters, URLClassifyProcessorTest, LoggingHandlerTest, TestSolrQueryParser, TestNumberUtils, TestSolrDeletionPolicy1, FileUtilsTest, TestPropInjectDefaults, DistributedSpellCheckComponentTest, TestPHPSerializedResponseWriter, SolrCmdDistributorTest, TestStressLucene, DefaultValueUpdateProcessorTest, TestReplicationHandler, XsltUpdateRequestHandlerTest, ZkNodePropsTest, LeaderElectionTest, TestPerFieldSimilarity, DateFieldTest, BasicDistributedZkTest, DocumentAnalysisRequestHandlerTest, TestElisionMultitermQuery, TestSurroundQueryParser, AlternateDirectoryTest, FieldAnalysisRequestHandlerTest, TestLazyCores, TestFaceting, TestIndexSearcher, SuggesterTSTTest, MBeansHandlerTest, TestDefaultSimilarityFactory, TestSolrDeletionPolicy2, TimeZoneUtilsTest, TestQueryTypes, TestReversedWildcardFilterFactory, NoCacheHeaderTest, SpellPossibilityIteratorTest, LeaderElectionIntegrationTest, TestReload, TestSolrCoreProperties, RequiredFieldsTest, TestSort, FileBasedSpellCheckerTest, CoreContainerCoreInitFailuresTest, DistributedTermsComponentTest, TestIBSimilarityFactory, TestSearchPerf, DirectUpdateHandlerOptimizeTest, TestFunctionQuery, JsonLoaderTest, DistributedQueryElevationComponentTest, ResourceLoaderTest, DebugComponentTest, AnalysisAfterCoreReloadTest, TestSuggestSpellingConverter, TestRecovery, TestLFUCache, TestFastLRUCache, FullSolrCloudDistribCmdsTest, TestStressVersions, CSVRequestHandlerTest, TestWordDelimiterFilterFactory, TestLMDirichletSimilarityFactory, AutoCommitTest, PluginInfoTest, SolrRequestParserTest, TestQuerySenderNoQuery, TestPropInject, TestCollationField, StatsComponentTest, BadComponentTest, TestJmxMonitoredMap, DisMaxRequestHandlerTest, TestJoin, SolrInfoMBeanTest, TestDFRSimilarityFactory, CoreAdminHandlerTest, ZkSolrClientTest, RAMDirectoryFactoryTest, BinaryUpdateRequestHandlerTest, TestPhraseSuggestions, MinimalSchemaTest, SearchHandlerTest, TestLuceneMatchVersion, QueryEqualityTest, TestDistributedSearch, TestStressRecovery, StatelessScriptUpdateProcessorFactoryTest, ClusterStateUpdateTest, TestWriterPerf, WordBreakSolrSpellCheckerTest, TestFastOutputStream, TestRandomFaceting, SolrCoreCheckLockOnStartupTest, TestIndexingPerformance, TestUpdate, TestCodecSupport, ClusterStateTest, DocumentBuilderTest, ConvertedLegacyTest, TestCoreContainer, DistanceFunctionTest, SystemInfoHandlerTest, SolrCoreTest, CircularListTest, SpellCheckComponentTest, OverseerTest, RecoveryZkTest, TestRealTimeGet, ZkControllerTest, TestDistributedGrouping, SpellCheckCollatorTest, TestExtendedDismaxParser, SoftAutoCommitTest, BasicZkTest, TestHashPartitioner, IndexBasedSpellCheckerTest, TestRangeQuery, DirectUpdateHandlerTest, TestMultiCoreConfBootstrap, SimpleFacetsTest, LukeRequestHandlerTest, TestGroupingSearch, DirectSolrSpellCheckerTest, TestFiltering, PeerSyncTest, QueryElevationComponentTest, SortByFunctionTest, BasicFunctionalityTest, SignatureUpdateProcessorFactoryTest, TestBinaryResponseWriter, TestJmxIntegration, SampleTest, HighlighterTest, TestTrie, DirectSolrConnectionTest, TestRemoteStreaming, CacheHeaderTest, PolyFieldTest, SpatialFilterTest, TestCSVResponseWriter, MoreLikeThisHandlerTest, CurrencyFieldTest, TestPseudoReturnFields, IndexSchemaTest, QueryParsingTest, TermsComponentTest, StandardRequestHandlerTest, XmlUpdateRequestHandlerTest]
[junit4:junit4]   2> NOTE: reproduce with: ant test  -Dtestcase=XmlUpdateRequestHandlerTest -Dtests.seed=ED1A9C533D68A0C3 -Dtests.slow=true -Dtests.locale=mk_MK -Dtests.timezone=Asia/Sakhalin -Dtests.file.encoding=Cp1252
[junit4:junit4] ERROR   0.00s | XmlUpdateRequestHandlerTest (suite) <<<
[junit4:junit4]    > Throwable #1: junit.framework.AssertionFailedError: Clean up static fields (in @AfterClass?), your test seems to hang on to approximately 11,836,024 bytes (threshold is 10,485,760). Field reference sizes (counted individually):
[junit4:junit4]    >   - 12,070,224 bytes, protected static org.apache.solr.handler.UpdateRequestHandler org.apache.solr.handler.XmlUpdateRequestHandlerTest.handler
[junit4:junit4]    >   - 3,792 bytes, private static javax.xml.stream.XMLInputFactory org.apache.solr.handler.XmlUpdateRequestHandlerTest.inputFactory
[junit4:junit4]    >   - 280 bytes, public static org.junit.rules.TestRule org.apache.solr.SolrTestCaseJ4.solrClassRules
[junit4:junit4]    >   - 232 bytes, protected static java.lang.String org.apache.solr.SolrTestCaseJ4.testSolrHome
[junit4:junit4]    >   - 128 bytes, private static java.lang.String org.apache.solr.SolrTestCaseJ4.factoryProp
[junit4:junit4]    >   - 64 bytes, private static java.lang.String org.apache.solr.SolrTestCaseJ4.coreName
[junit4:junit4]    > at __randomizedtesting.SeedInfo.seed([ED1A9C533D68A0C3]:0)
[junit4:junit4]    > at com.carrotsearch.randomizedtesting.rules.StaticFieldsInvariantRule$1.afterAlways(StaticFieldsInvariantRule.java:127)
[junit4:junit4]    > at com.carrotsearch.randomizedtesting.rules.StatementAdapter.evaluate(StatementAdapter.java:43)
[junit4:junit4]    > at org.apache.lucene.util.TestRuleAssertionsRequired$1.evaluate(TestRuleAssertionsRequired.java:43)
[junit4:junit4]    > at org.apache.lucene.util.TestRuleMarkFailure$1.evaluate(TestRuleMarkFailure.java:48)
[junit4:junit4]    > at org.apache.lucene.util.TestRuleIgnoreAfterMaxFailures$1.evaluate(TestRuleIgnoreAfterMaxFailures.java:70)
[junit4:junit4]    > at org.apache.lucene.util.TestRuleIgnoreTestSuites$1.evaluate(TestRuleIgnoreTestSuites.java:55)
[junit4:junit4]    > at com.carrotsearch.randomizedtesting.rules.StatementAdapter.evaluate(StatementAdapter.java:36)
[junit4:junit4]    > at com.carrotsearch.randomizedtesting.ThreadLeakControl$StatementRunner.run(ThreadLeakControl.java:358)
[junit4:junit4]    > at java.lang.Thread.run(Thread.java:722)
[junit4:junit4] Completed in 1.54s, 5 tests, 1 failure <<< FAILURES!

[...truncated 232 lines...]
BUILD FAILED
C:\Users\JenkinsSlave\workspace\Lucene-Solr-trunk-Windows\build.xml:335: The following error occurred while executing this line:
C:\Users\JenkinsSlave\workspace\Lucene-Solr-trunk-Windows\build.xml:39: The following error occurred while executing this line:
C:\Users\JenkinsSlave\workspace\Lucene-Solr-trunk-Windows\solr\build.xml:178: The following error occurred while executing this line:
C:\Users\JenkinsSlave\workspace\Lucene-Solr-trunk-Windows\lucene\module-build.xml:61: The following error occurred while executing this line:
C:\Users\JenkinsSlave\workspace\Lucene-Solr-trunk-Windows\lucene\common-build.xml:1159: The following error occurred while executing this line:
C:\Users\JenkinsSlave\workspace\Lucene-Solr-trunk-Windows\lucene\common-build.xml:827: There were test failures: 233 suites, 965 tests, 1 suite-level error, 12 ignored (7 assumptions)

Total time: 37 minutes 54 seconds
Build step 'Invoke Ant' marked build as failure
Archiving artifacts
Recording test results
Description set: Java: 64bit/jdk1.7.0_07 -XX:+UseConcMarkSweepGC
Email was triggered for: Failure
Sending email for trigger: Failure




---------------------------------------------------------------------
To unsubscribe, e-mail: [hidden email]
For additional commands, e-mail: [hidden email]
Reply | Threaded
Open this post in threaded view
|

Re: [JENKINS] Lucene-Solr-trunk-Windows (64bit/jdk1.7.0_07) - Build # 1370 - Still Failing!

Alan Woodward
I think these failures must be related to the metrics I added in SOLR-1972, which use static fields.  I'm not sure why, though, as the objects involved should be pretty small.

Is there a way of getting a more detailed breakdown of which classes/objects are using the memory?

On 30 Oct 2012, at 16:30, Policeman Jenkins Server wrote:

> Build: http://jenkins.sd-datasolutions.de/job/Lucene-Solr-trunk-Windows/1370/
> Java: 64bit/jdk1.7.0_07 -XX:+UseConcMarkSweepGC
>
> 1 tests failed.
> FAILED:  junit.framework.TestSuite.org.apache.solr.handler.XmlUpdateRequestHandlerTest
>
> Error Message:
> Clean up static fields (in @AfterClass?), your test seems to hang on to approximately 11,836,024 bytes (threshold is 10,485,760). Field reference sizes (counted individually):   - 12,070,224 bytes, protected static org.apache.solr.handler.UpdateRequestHandler org.apache.solr.handler.XmlUpdateRequestHandlerTest.handler   - 3,792 bytes, private static javax.xml.stream.XMLInputFactory org.apache.solr.handler.XmlUpdateRequestHandlerTest.inputFactory   - 280 bytes, public static org.junit.rules.TestRule org.apache.solr.SolrTestCaseJ4.solrClassRules   - 232 bytes, protected static java.lang.String org.apache.solr.SolrTestCaseJ4.testSolrHome   - 128 bytes, private static java.lang.String org.apache.solr.SolrTestCaseJ4.factoryProp   - 64 bytes, private static java.lang.String org.apache.solr.SolrTestCaseJ4.coreName
>
> Stack Trace:
> junit.framework.AssertionFailedError: Clean up static fields (in @AfterClass?), your test seems to hang on to approximately 11,836,024 bytes (threshold is 10,485,760). Field reference sizes (counted individually):
>  - 12,070,224 bytes, protected static org.apache.solr.handler.UpdateRequestHandler org.apache.solr.handler.XmlUpdateRequestHandlerTest.handler
>  - 3,792 bytes, private static javax.xml.stream.XMLInputFactory org.apache.solr.handler.XmlUpdateRequestHandlerTest.inputFactory
>  - 280 bytes, public static org.junit.rules.TestRule org.apache.solr.SolrTestCaseJ4.solrClassRules
>  - 232 bytes, protected static java.lang.String org.apache.solr.SolrTestCaseJ4.testSolrHome
>  - 128 bytes, private static java.lang.String org.apache.solr.SolrTestCaseJ4.factoryProp
>  - 64 bytes, private static java.lang.String org.apache.solr.SolrTestCaseJ4.coreName
> at __randomizedtesting.SeedInfo.seed([ED1A9C533D68A0C3]:0)
> at com.carrotsearch.randomizedtesting.rules.StaticFieldsInvariantRule$1.afterAlways(StaticFieldsInvariantRule.java:127)
> at com.carrotsearch.randomizedtesting.rules.StatementAdapter.evaluate(StatementAdapter.java:43)
> at org.apache.lucene.util.TestRuleAssertionsRequired$1.evaluate(TestRuleAssertionsRequired.java:43)
> at org.apache.lucene.util.TestRuleMarkFailure$1.evaluate(TestRuleMarkFailure.java:48)
> at org.apache.lucene.util.TestRuleIgnoreAfterMaxFailures$1.evaluate(TestRuleIgnoreAfterMaxFailures.java:70)
> at org.apache.lucene.util.TestRuleIgnoreTestSuites$1.evaluate(TestRuleIgnoreTestSuites.java:55)
> at com.carrotsearch.randomizedtesting.rules.StatementAdapter.evaluate(StatementAdapter.java:36)
> at com.carrotsearch.randomizedtesting.ThreadLeakControl$StatementRunner.run(ThreadLeakControl.java:358)
> at java.lang.Thread.run(Thread.java:722)
>
>
>
>
> Build Log:
> [...truncated 8847 lines...]
> [junit4:junit4] Suite: org.apache.solr.handler.XmlUpdateRequestHandlerTest
> [junit4:junit4]   2> 1 T3303 oas.SolrTestCaseJ4.initCore ####initCore
> [junit4:junit4]   2> Creating dataDir: C:\Users\JenkinsSlave\workspace\Lucene-Solr-trunk-Windows\solr\build\solr-core\test\J0\.\solrtest-XmlUpdateRequestHandlerTest-1351614363016
> [junit4:junit4]   2> 3 T3303 oasc.SolrResourceLoader.<init> new SolrResourceLoader for directory: 'C:\Users\JenkinsSlave\workspace\Lucene-Solr-trunk-Windows\solr\build\solr-core\test-files\solr\collection1\'
> [junit4:junit4]   2> 4 T3303 oasc.SolrResourceLoader.replaceClassLoader Adding 'file:/C:/Users/JenkinsSlave/workspace/Lucene-Solr-trunk-Windows/solr/build/solr-core/test-files/solr/collection1/lib/classes/' to classloader
> [junit4:junit4]   2> 5 T3303 oasc.SolrResourceLoader.replaceClassLoader Adding 'file:/C:/Users/JenkinsSlave/workspace/Lucene-Solr-trunk-Windows/solr/build/solr-core/test-files/solr/collection1/lib/README' to classloader
> [junit4:junit4]   2> 73 T3303 oasc.SolrConfig.<init> Using Lucene MatchVersion: LUCENE_50
> [junit4:junit4]   2> 139 T3303 oasc.SolrConfig.<init> Loaded SolrConfig: solrconfig.xml
> [junit4:junit4]   2> 140 T3303 oass.IndexSchema.readSchema Reading Solr Schema
> [junit4:junit4]   2> 144 T3303 oass.IndexSchema.readSchema Schema name=test
> [junit4:junit4]   2> 719 T3303 oass.OpenExchangeRatesOrgProvider.init Initialized with rates=open-exchange-rates.json, refreshInterval=1440.
> [junit4:junit4]   2> 732 T3303 oass.IndexSchema.readSchema default search field in schema is text
> [junit4:junit4]   2> 738 T3303 oass.IndexSchema.readSchema unique key field: id
> [junit4:junit4]   2> 746 T3303 oass.FileExchangeRateProvider.reload Reloading exchange rates from file currency.xml
> [junit4:junit4]   2> 751 T3303 oass.FileExchangeRateProvider.reload Reloading exchange rates from file currency.xml
> [junit4:junit4]   2> 755 T3303 oass.OpenExchangeRatesOrgProvider.reload Reloading exchange rates from open-exchange-rates.json
> [junit4:junit4]   2> 756 T3303 oass.OpenExchangeRatesOrgProvider.reload Reloading exchange rates from open-exchange-rates.json
> [junit4:junit4]   2> 756 T3303 oasc.SolrResourceLoader.locateSolrHome JNDI not configured for solr (NoInitialContextEx)
> [junit4:junit4]   2> 757 T3303 oasc.SolrResourceLoader.locateSolrHome using system property solr.solr.home: C:\Users\JenkinsSlave\workspace\Lucene-Solr-trunk-Windows\solr\build\solr-core\test-files\solr
> [junit4:junit4]   2> 757 T3303 oasc.SolrResourceLoader.<init> new SolrResourceLoader for directory: 'C:\Users\JenkinsSlave\workspace\Lucene-Solr-trunk-Windows\solr\build\solr-core\test-files\solr\'
> [junit4:junit4]   2> 768 T3303 oasc.CoreContainer.<init> New CoreContainer 974373728
> [junit4:junit4]   2> 768 T3303 oasc.SolrCore.<init> [collection1] Opening new SolrCore at C:\Users\JenkinsSlave\workspace\Lucene-Solr-trunk-Windows\solr\build\solr-core\test-files\solr\collection1\, dataDir=C:\Users\JenkinsSlave\workspace\Lucene-Solr-trunk-Windows\solr\build\solr-core\test\J0\.\solrtest-XmlUpdateRequestHandlerTest-1351614363016\
> [junit4:junit4]   2> 769 T3303 oasc.JmxMonitoredMap.<init> JMX monitoring is enabled. Adding Solr mbeans to JMX Server: com.sun.jmx.mbeanserver.JmxMBeanServer@49dbfd4d
> [junit4:junit4]   2> 769 T3303 oasc.SolrCore.initDirectoryFactory org.apache.solr.core.MockDirectoryFactory
> [junit4:junit4]   2> 770 T3303 oasc.CachingDirectoryFactory.injectLockFactory WARNING No lockType configured for MockDirWrapper(org.apache.lucene.store.RAMDirectory@c25995 lockFactory=org.apache.lucene.store.SingleInstanceLockFactory@57874596) assuming 'simple'
> [junit4:junit4]   2> 771 T3303 oasc.CachingDirectoryFactory.get return new directory for C:\Users\JenkinsSlave\workspace\Lucene-Solr-trunk-Windows\solr\build\solr-core\test\J0\.\solrtest-XmlUpdateRequestHandlerTest-1351614363016 forceNew:false
> [junit4:junit4]   2> 771 T3303 oasc.CachingDirectoryFactory.close Releasing directory:C:\Users\JenkinsSlave\workspace\Lucene-Solr-trunk-Windows\solr\build\solr-core\test\J0\.\solrtest-XmlUpdateRequestHandlerTest-1351614363016
> [junit4:junit4]   2> 771 T3303 oasc.SolrCore.getNewIndexDir New index directory detected: old=null new=C:\Users\JenkinsSlave\workspace\Lucene-Solr-trunk-Windows\solr\build\solr-core\test\J0\.\solrtest-XmlUpdateRequestHandlerTest-1351614363016\index/
> [junit4:junit4]   2> 772 T3303 oasc.SolrCore.initIndex WARNING [collection1] Solr index directory 'C:\Users\JenkinsSlave\workspace\Lucene-Solr-trunk-Windows\solr\build\solr-core\test\J0\.\solrtest-XmlUpdateRequestHandlerTest-1351614363016\index' doesn't exist. Creating new index...
> [junit4:junit4]   2> 773 T3303 oasc.CachingDirectoryFactory.get return new directory for C:\Users\JenkinsSlave\workspace\Lucene-Solr-trunk-Windows\solr\build\solr-core\test\J0\.\solrtest-XmlUpdateRequestHandlerTest-1351614363016\index forceNew:false
> [junit4:junit4]   2> 775 T3303 oasc.SolrDeletionPolicy.onCommit SolrDeletionPolicy.onCommit: commits:num=1
> [junit4:junit4]   2> commit{dir=MockDirWrapper(org.apache.lucene.store.RAMDirectory@54c7d1ee lockFactory=org.apache.lucene.store.NativeFSLockFactory@7dc76c68),segFN=segments_1,generation=1,filenames=[segments_1]
> [junit4:junit4]   2> 775 T3303 oasc.SolrDeletionPolicy.updateCommits newest commit = 1[segments_1]
> [junit4:junit4]   2> 776 T3303 oasc.CachingDirectoryFactory.close Releasing directory:C:\Users\JenkinsSlave\workspace\Lucene-Solr-trunk-Windows\solr\build\solr-core\test\J0\.\solrtest-XmlUpdateRequestHandlerTest-1351614363016\index
> [junit4:junit4]   2> 776 T3303 oasc.SolrCore.initWriters created xml: solr.XMLResponseWriter
> [junit4:junit4]   2> 778 T3303 oasup.UpdateRequestProcessorChain.init inserting DistributedUpdateProcessorFactory into updateRequestProcessorChain "dedupe"
> [junit4:junit4]   2> 778 T3303 oasup.UpdateRequestProcessorChain.init inserting DistributedUpdateProcessorFactory into updateRequestProcessorChain "dedupe-allfields"
> [junit4:junit4]   2> 779 T3303 oasup.UpdateRequestProcessorChain.init inserting DistributedUpdateProcessorFactory into updateRequestProcessorChain "stored_sig"
> [junit4:junit4]   2> 779 T3303 oasup.UpdateRequestProcessorChain.init inserting DistributedUpdateProcessorFactory into updateRequestProcessorChain "uniq-fields"
> [junit4:junit4]   2> 780 T3303 oasup.UpdateRequestProcessorChain.init inserting DistributedUpdateProcessorFactory into updateRequestProcessorChain "distrib-dup-test-chain-implicit"
> [junit4:junit4]   2> 780 T3303 oasc.RequestHandlers.initHandlersFromConfig adding lazy requestHandler: solr.ReplicationHandler
> [junit4:junit4]   2> 780 T3303 oasc.RequestHandlers.initHandlersFromConfig created /replication: solr.ReplicationHandler
> [junit4:junit4]   2> 781 T3303 oasc.RequestHandlers.initHandlersFromConfig created standard: solr.StandardRequestHandler
> [junit4:junit4]   2> 782 T3303 oasc.RequestHandlers.initHandlersFromConfig created /get: solr.RealTimeGetHandler
> [junit4:junit4]   2> 783 T3303 oasc.RequestHandlers.initHandlersFromConfig created dismax: solr.SearchHandler
> [junit4:junit4]   2> 783 T3303 oasc.RequestHandlers.initHandlersFromConfig created mock: org.apache.solr.core.MockQuerySenderListenerReqHandler
> [junit4:junit4]   2> 784 T3303 oasc.RequestHandlers.initHandlersFromConfig created /admin/: org.apache.solr.handler.admin.AdminHandlers
> [junit4:junit4]   2> 785 T3303 oasc.RequestHandlers.initHandlersFromConfig created defaults: solr.StandardRequestHandler
> [junit4:junit4]   2> 785 T3303 oasc.RequestHandlers.initHandlersFromConfig adding lazy requestHandler: solr.StandardRequestHandler
> [junit4:junit4]   2> 785 T3303 oasc.RequestHandlers.initHandlersFromConfig created lazy: solr.StandardRequestHandler
> [junit4:junit4]   2> 786 T3303 oasc.RequestHandlers.initHandlersFromConfig created /update: solr.UpdateRequestHandler
> [junit4:junit4]   2> 787 T3303 oasc.RequestHandlers.initHandlersFromConfig created /terms: org.apache.solr.handler.component.SearchHandler
> [junit4:junit4]   2> 788 T3303 oasc.RequestHandlers.initHandlersFromConfig created spellCheckCompRH: org.apache.solr.handler.component.SearchHandler
> [junit4:junit4]   2> 788 T3303 oasc.RequestHandlers.initHandlersFromConfig created spellCheckCompRH_Direct: org.apache.solr.handler.component.SearchHandler
> [junit4:junit4]   2> 789 T3303 oasc.RequestHandlers.initHandlersFromConfig created spellCheckWithWordbreak: org.apache.solr.handler.component.SearchHandler
> [junit4:junit4]   2> 790 T3303 oasc.RequestHandlers.initHandlersFromConfig created spellCheckWithWordbreak_Direct: org.apache.solr.handler.component.SearchHandler
> [junit4:junit4]   2> 791 T3303 oasc.RequestHandlers.initHandlersFromConfig created spellCheckCompRH1: org.apache.solr.handler.component.SearchHandler
> [junit4:junit4]   2> 792 T3303 oasc.RequestHandlers.initHandlersFromConfig created tvrh: org.apache.solr.handler.component.SearchHandler
> [junit4:junit4]   2> 792 T3303 oasc.RequestHandlers.initHandlersFromConfig created /mlt: solr.MoreLikeThisHandler
> [junit4:junit4]   2> 793 T3303 oasc.RequestHandlers.initHandlersFromConfig created /debug/dump: solr.DumpRequestHandler
> [junit4:junit4]   2> 804 T3303 oashl.XMLLoader.init xsltCacheLifetimeSeconds=60
> [junit4:junit4]   2> 810 T3303 oasc.SolrCore.initDeprecatedSupport WARNING solrconfig.xml uses deprecated <admin/gettableFiles>, Please update your config to use the ShowFileRequestHandler.
> [junit4:junit4]   2> 813 T3303 oasc.SolrCore.initDeprecatedSupport WARNING adding ShowFileRequestHandler with hidden files: [THROW.ERROR.ON.ADD.UPDATEPROCESSOR.JS, SOLRCONFIG-HIGHLIGHT.XML, SCHEMA-REQUIRED-FIELDS.XML, TRIVIAL.UPDATEPROCESSOR1.JS, BAD-SCHEMA-DUP-DYNAMICFIELD.XML, SCHEMA-MINIMAL.XML, SCHEMA-REPLICATION2.XML, SOLRCONFIG-CACHING.XML, SOLRCONFIG-REPEATER.XML, CURRENCY.XML, BAD-SCHEMA-NONTEXT-ANALYZER.XML, SOLRCONFIG-MERGEPOLICY.XML, SOLRCONFIG-TLOG.XML, SOLRCONFIG-MASTER.XML, BAD-SCHEMA-UNIQUEKEY-MULTIVALUED.XML, SCHEMA11.XML, SOLRCONFIG-BASIC.XML, DA_COMPOUNDDICTIONARY.TXT, MISSLEADING.EXTENSION.UPDATEPROCESSOR.JS.TXT, SCHEMA-COPYFIELD-TEST.XML, SOLRCONFIG-SLAVE.XML, SOLRCONFIG-PROPINJECT-INDEXDEFAULT.XML, ELEVATE.XML, TRIVIAL.UPDATEPROCESSOR0.JS, BAD-SOLRCONFIG-BOGUS-SCRIPTENGINE-NAME.XML, SCHEMA-CHARFILTERS.XML, SCHEMA-IB.XML, SOLRCONFIG-QUERYSENDER.XML, SOLRCONFIG-SNIPPET-PROCESSOR.XML, DA_UTF8.XML, SCHEMA-REPLICATION1.XML, CONDITIONAL.UPDATEPROCESSOR.JS, MISSING.FUNCTIONS.UPDATEPROCESSOR.JS, HYPHENATION.DTD, SOLRCONFIG-ENABLEPLUGIN.XML, STEMDICT.TXT, SCHEMA-PHRASESUGGEST.XML, HUNSPELL-TEST.AFF, SCHEMA-SNIPPET-TYPE.XML, STOPTYPES-1.TXT, STOPWORDSWRONGENCODING.TXT, SCHEMA-NUMERIC.XML, SOLRCONFIG-TRANSFORMERS.XML, SOLRCONFIG-PROPINJECT.XML, BAD-SCHEMA-NOT-INDEXED-BUT-TF.XML, SOLRCONFIG-SIMPLELOCK.XML, WDFTYPES.TXT, STOPTYPES-2.TXT, SCHEMA-REVERSED.XML, BAD-SCHEMA-CURRENCY-FT-MULTIVALUED.XML, SOLRCONFIG-SPELLCHECKCOMPONENT.XML, SOLRCONFIG-PHRASESUGGEST.XML, BAD-SCHEMA-CURRENCY-MULTIVALUED.XML, SCHEMA-DFR.XML, BAD-SCHEMA-NOT-INDEXED-BUT-POS.XML, KEEP-1.TXT, OPEN-EXCHANGE-RATES.JSON, SCHEMA-SPATIAL.XML, STOPWITHBOM.TXT, SOLRCONFIG-SPELLCHECKER.XML, SCHEMA-BINARYFIELD.XML, SOLRCONFIG-UPDATE-PROCESSOR-CHAINS.XML, BAD-SCHEMA-OMIT-TF-BUT-NOT-POS.XML, BAD-SCHEMA-DUP-FIELDTYPE.XML, SCHEMA-XINCLUDE.XML, SOLRCONFIG-MASTER1.XML, SYNONYMS.TXT, BAD-SCHEMA-CURRENCY-DYNAMIC-MULTIVALUED.XML, SCHEMA.XML, SCHEMA_CODEC.XML, SOLRCONFIG-SOLR-749.XML, SOLRCONFIG-MASTER1-KEEPONEBACKUP.XML, STOP-2.TXT, SOLRCONFIG-FUNCTIONQUERY.XML, SOLRCONFIG-TERMINDEX.XML, SCHEMA-LMDIRICHLET.XML, SOLRCONFIG-ELEVATE.XML, STOPWORDS.TXT, SCHEMA-FOLDING.XML, SCHEMA-STOP-KEEP.XML, BAD-SCHEMA-NOT-INDEXED-BUT-NORMS.XML, SOLRCONFIG-SOLCOREPROPERTIES.XML, STOP-1.TXT, SOLRCONFIG-MASTER2.XML, SCHEMA-SPELLCHECKER.XML, SOLRCONFIG-RESPONSE-LOG-COMPONENT.XML, SOLRCONFIG-LAZYWRITER.XML, SCHEMA-LUCENEMATCHVERSION.XML, FRENCHARTICLES.TXT, BAD-MP-SOLRCONFIG.XML, SCHEMA15.XML, SOLRCONFIG-REQHANDLER.INCL, SCHEMASURROUND.XML, SOLRCONFIG-MASTER3.XML, HUNSPELL-TEST.DIC, SOLRCONFIG-XINCLUDE.XML, BAD-SCHEMA-CODEC-GLOBAL-VS-FT-MISMATCH.XML, SOLRCONFIG-SLAVE1.XML, SOLRCONFIG-DELPOLICY1.XML, SCHEMA-SIM.XML, SCHEMA-SNIPPET-FIELD.XML, SCHEMA-COLLATE.XML, STOP-SNOWBALL.TXT, BAD-SCHEMA-SIM-GLOBAL-VS-FT-MISMATCH.XML, PROTWORDS.TXT, SCHEMA-TRIE.XML, SOLRCONFIG_CODEC.XML, BAD-SOLRCONFIG-INVALID-SCRIPTFILE.XML, JASUGGEST.TXT, SCHEMA-TFIDF.XML, SOLRCONFIG-SCRIPT-UPDATEPROCESSOR.XML, SCHEMA-LMJELINEKMERCER.XML, PHRASESUGGEST.TXT, BAD-SOLRCONFIG-MISSING-SCRIPTFILE.XML, BAD-SCHEMA-UNIQUEKEY-USES-DEFAULT.XML, OLD_SYNONYMS.TXT, SOLRCONFIG-DELPOLICY2.XML, XSLT, SOLRCONFIG-NATIVELOCK.XML, BAD-SCHEMA-DUP-FIELD.XML, SOLRCONFIG-NOCACHE.XML, SCHEMA-BM25.XML, ADDFIELDS.UPDATEPROCESSOR.JS, SOLRCONFIG-QUERYSENDER-NOQUERY.XML, SOLRCONFIG-ALTDIRECTORY.XML, COMPOUNDDICTIONARY.TXT, SOLRCONFIG_PERF.XML, SOLRCONFIG-INDEXCONFIG.XML, BAD-SCHEMA-ANALYZER-CLASS-AND-NESTED.XML, SCHEMA-NOT-REQUIRED-UNIQUE-KEY.XML, KEEP-2.TXT, BAD-SCHEMA-UNIQUEKEY-IS-COPYFIELD-DEST.XML, SCHEMA12.XML, MAPPING-ISOLATIN1ACCENT.TXT, BAD_SOLRCONFIG.XML, BAD-SCHEMA-EXTERNAL-FILEFIELD.XML]
> [junit4:junit4]   2> 815 T3303 oasc.CachingDirectoryFactory.close Releasing directory:C:\Users\JenkinsSlave\workspace\Lucene-Solr-trunk-Windows\solr\build\solr-core\test\J0\.\solrtest-XmlUpdateRequestHandlerTest-1351614363016
> [junit4:junit4]   2> 815 T3303 oass.SolrIndexSearcher.<init> Opening Searcher@77103877 main
> [junit4:junit4]   2> 816 T3303 oasu.CommitTracker.<init> Hard AutoCommit: disabled
> [junit4:junit4]   2> 816 T3303 oasu.CommitTracker.<init> Soft AutoCommit: disabled
> [junit4:junit4]   2> 817 T3303 oashc.SpellCheckComponent.inform Initializing spell checkers
> [junit4:junit4]   2> 827 T3303 oass.DirectSolrSpellChecker.init init: {name=direct,classname=DirectSolrSpellChecker,field=lowerfilt,minQueryLength=3}
> [junit4:junit4]   2> 882 T3303 oashc.HttpShardHandlerFactory.getParameter Setting socketTimeout to: 0
> [junit4:junit4]   2> 883 T3303 oashc.HttpShardHandlerFactory.getParameter Setting urlScheme to: http://
> [junit4:junit4]   2> 883 T3303 oashc.HttpShardHandlerFactory.getParameter Setting connTimeout to: 0
> [junit4:junit4]   2> 883 T3303 oashc.HttpShardHandlerFactory.getParameter Setting maxConnectionsPerHost to: 20
> [junit4:junit4]   2> 884 T3303 oashc.HttpShardHandlerFactory.getParameter Setting corePoolSize to: 0
> [junit4:junit4]   2> 884 T3303 oashc.HttpShardHandlerFactory.getParameter Setting maximumPoolSize to: 2147483647
> [junit4:junit4]   2> 884 T3303 oashc.HttpShardHandlerFactory.getParameter Setting maxThreadIdleTime to: 5
> [junit4:junit4]   2> 884 T3303 oashc.HttpShardHandlerFactory.getParameter Setting sizeOfQueue to: -1
> [junit4:junit4]   2> 884 T3303 oashc.HttpShardHandlerFactory.getParameter Setting fairnessPolicy to: false
> [junit4:junit4]   2> 885 T3303 oascsi.HttpClientUtil.createClient Creating new http client, config:maxConnectionsPerHost=20&maxConnections=10000&socketTimeout=0&connTimeout=0&retry=false
> [junit4:junit4]   2> 897 T3304 oasc.SolrCore.registerSearcher [collection1] Registered new searcher Searcher@77103877 main{StandardDirectoryReader(segments_1:1)}
> [junit4:junit4]   2> 899 T3303 oasc.CoreContainer.registerCore registering core: collection1
> [junit4:junit4]   2> 909 T3303 oas.SolrTestCaseJ4.initCore ####initCore end
> [junit4:junit4]   2> 913 T3303 oas.SolrTestCaseJ4.setUp ###Starting testNamedEntity
> [junit4:junit4]   2> ASYNC  NEW_CORE C257 name=collection1 org.apache.solr.core.SolrCore@677ff169
> [junit4:junit4]   2> 1006 T3303 C257 oasc.CachingDirectoryFactory.close Releasing directory:C:\Users\JenkinsSlave\workspace\Lucene-Solr-trunk-Windows\solr\build\solr-core\test\J0\.\solrtest-XmlUpdateRequestHandlerTest-1351614363016
> [junit4:junit4]   2> 1010 T3303 C257 oasc.SolrDeletionPolicy.onInit SolrDeletionPolicy.onInit: commits:num=1
> [junit4:junit4]   2> commit{dir=MockDirWrapper(org.apache.lucene.store.RAMDirectory@54c7d1ee lockFactory=org.apache.lucene.store.NativeFSLockFactory@7dc76c68),segFN=segments_1,generation=1,filenames=[segments_1]
> [junit4:junit4]   2> 1010 T3303 C257 oasc.SolrDeletionPolicy.updateCommits newest commit = 1[segments_1]
> [junit4:junit4]   2> 1011 T3303 C257 UPDATE [collection1] webapp=null path=null params={} {add=[1]} 0 91
> [junit4:junit4]   2> 1032 T3303 C257 oasu.DirectUpdateHandler2.commit start commit{flags=0,_version_=0,optimize=false,openSearcher=true,waitSearcher=true,expungeDeletes=false,softCommit=false}
> [junit4:junit4]   2> 1035 T3303 C257 oasc.SolrDeletionPolicy.onCommit SolrDeletionPolicy.onCommit: commits:num=2
> [junit4:junit4]   2> commit{dir=MockDirWrapper(org.apache.lucene.store.RAMDirectory@54c7d1ee lockFactory=org.apache.lucene.store.NativeFSLockFactory@7dc76c68),segFN=segments_1,generation=1,filenames=[segments_1]
> [junit4:junit4]   2> commit{dir=MockDirWrapper(org.apache.lucene.store.RAMDirectory@54c7d1ee lockFactory=org.apache.lucene.store.NativeFSLockFactory@7dc76c68),segFN=segments_2,generation=2,filenames=[_0_Lucene41WithOrds_0.tib, _0.fnm, _0_Lucene41WithOrds_0.doc, _0_MockVariableIntBlock_0.doc, _0_Lucene41WithOrds_0.tii, _0_Lucene41WithOrds_0.pos, _0_nrm.cfs, _0_MockVariableIntBlock_0.skp, _0_Direct_0.doc, _0_MockVariableIntBlock_0.pyl, _0_MockVariableIntBlock_0.tib, _0_MockVariableIntBlock_0.frq, _0_SimpleText_0.pst, _0_nrm.cfe, _0_MockVariableIntBlock_0.pos, _0_Direct_0.pos, segments_2, _0.fdx, _0_Direct_0.tip, _0.si, _0_Direct_0.tim, _0.fdt, _0_MockVariableIntBlock_0.tii]
> [junit4:junit4]   2> 1035 T3303 C257 oasc.SolrDeletionPolicy.updateCommits newest commit = 2[_0_Lucene41WithOrds_0.tib, _0.fnm, _0_Lucene41WithOrds_0.doc, _0_MockVariableIntBlock_0.doc, _0_Lucene41WithOrds_0.tii, _0_Lucene41WithOrds_0.pos, _0_nrm.cfs, _0_MockVariableIntBlock_0.skp, _0_Direct_0.doc, _0_MockVariableIntBlock_0.pyl, _0_MockVariableIntBlock_0.tib, _0_MockVariableIntBlock_0.frq, _0_SimpleText_0.pst, _0_nrm.cfe, _0_MockVariableIntBlock_0.pos, _0_Direct_0.pos, segments_2, _0.fdx, _0_Direct_0.tip, _0.si, _0_Direct_0.tim, _0.fdt, _0_MockVariableIntBlock_0.tii]
> [junit4:junit4]   2> 1036 T3303 C257 oasc.CachingDirectoryFactory.close Releasing directory:C:\Users\JenkinsSlave\workspace\Lucene-Solr-trunk-Windows\solr\build\solr-core\test\J0\.\solrtest-XmlUpdateRequestHandlerTest-1351614363016
> [junit4:junit4]   2> 1037 T3303 C257 oass.SolrIndexSearcher.<init> Opening Searcher@4992bebc main
> [junit4:junit4]   2> 1037 T3303 C257 oasu.DirectUpdateHandler2.commit end_commit_flush
> [junit4:junit4]   2> 1037 T3304 oasc.SolrCore.registerSearcher [collection1] Registered new searcher Searcher@4992bebc main{StandardDirectoryReader(segments_2:3 _0(5.0):C1)}
> [junit4:junit4]   2> 1038 T3304 oasc.CachingDirectoryFactory.close Releasing directory:C:\Users\JenkinsSlave\workspace\Lucene-Solr-trunk-Windows\solr\build\solr-core\test\J0\.\solrtest-XmlUpdateRequestHandlerTest-1351614363016\index
> [junit4:junit4]   2> 1039 T3303 C257 UPDATE [collection1] webapp=null path=null params={} {commit=} 0 7
> [junit4:junit4]   2> 1040 T3303 C257 REQ [collection1] webapp=null path=null params={start=0&q=foo_s:zzz&qt=standard&rows=20&version=2.2} hits=1 status=0 QTime=0
> [junit4:junit4]   2> 1042 T3303 oas.SolrTestCaseJ4.tearDown ###Ending testNamedEntity
> [junit4:junit4]   2> 1044 T3303 oas.SolrTestCaseJ4.setUp ###Starting testRequestParams
> [junit4:junit4]   2> 1051 T3303 oas.SolrTestCaseJ4.tearDown ###Ending testRequestParams
> [junit4:junit4]   2> 1056 T3303 oas.SolrTestCaseJ4.setUp ###Starting testReadDelete
> [junit4:junit4]   2> 1072 T3303 oas.SolrTestCaseJ4.tearDown ###Ending testReadDelete
> [junit4:junit4]   2> 1074 T3303 oas.SolrTestCaseJ4.setUp ###Starting testReadDoc
> [junit4:junit4]   2> 1075 T3303 oas.SolrTestCaseJ4.tearDown ###Ending testReadDoc
> [junit4:junit4]   2> 1077 T3303 oas.SolrTestCaseJ4.setUp ###Starting testExternalEntities
> [junit4:junit4]   2> 1083 T3303 oas.SolrTestCaseJ4.tearDown ###Ending testExternalEntities
> [junit4:junit4]   2> 1083 T3303 oas.SolrTestCaseJ4.deleteCore ###deleteCore
> [junit4:junit4]   2> 1084 T3303 oasc.CoreContainer.shutdown Shutting down CoreContainer instance=974373728
> [junit4:junit4]   2> 1084 T3303 oasc.SolrCore.close [collection1]  CLOSING SolrCore org.apache.solr.core.SolrCore@677ff169
> [junit4:junit4]   2> 1087 T3303 oasu.DirectUpdateHandler2.close closing DirectUpdateHandler2{commits=1,autocommits=0,soft autocommits=0,optimizes=0,rollbacks=0,expungeDeletes=0,docsPending=0,adds=0,deletesById=0,deletesByQuery=0,errors=0,cumulative_adds=1,cumulative_deletesById=0,cumulative_deletesByQuery=0,cumulative_errors=0}
> [junit4:junit4]   2> 1087 T3303 oasc.SolrCore.decrefSolrCoreState Closing SolrCoreState
> [junit4:junit4]   2> 1087 T3303 oasu.DefaultSolrCoreState.closeIndexWriter SolrCoreState ref count has reached 0 - closing IndexWriter
> [junit4:junit4]   2> 1089 T3303 oasu.DefaultSolrCoreState.closeIndexWriter closing IndexWriter with IndexWriterCloser
> [junit4:junit4]   2> 1089 T3303 C257 oasc.CachingDirectoryFactory.close Releasing directory:C:\Users\JenkinsSlave\workspace\Lucene-Solr-trunk-Windows\solr\build\solr-core\test\J0\.\solrtest-XmlUpdateRequestHandlerTest-1351614363016\index
> [junit4:junit4]   2> 1090 T3303 oasc.SolrCore.closeSearcher [collection1] Closing main searcher on request.
> [junit4:junit4]   2> 1090 T3303 oasc.CachingDirectoryFactory.close Releasing directory:C:\Users\JenkinsSlave\workspace\Lucene-Solr-trunk-Windows\solr\build\solr-core\test\J0\.\solrtest-XmlUpdateRequestHandlerTest-1351614363016\index
> [junit4:junit4]   2> NOTE: test params are: codec=Lucene41: {timestamp=PostingsFormat(name=Lucene41WithOrds), range_facet_l=PostingsFormat(name=Lucene41WithOrds), id=PostingsFormat(name=SimpleText), range_facet_sl=PostingsFormat(name=Direct), range_facet_si=MockVariableIntBlock(baseBlockSize=34), foo_s=PostingsFormat(name=Lucene41WithOrds), multiDefault=MockVariableIntBlock(baseBlockSize=34), intDefault=PostingsFormat(name=Lucene41WithOrds)}, sim=DefaultSimilarity, locale=mk_MK, timezone=Asia/Sakhalin
> [junit4:junit4]   2> NOTE: Windows 7 6.1 amd64/Oracle Corporation 1.7.0_07 (64-bit)/cpus=2,threads=1,free=153683832,total=432218112
> [junit4:junit4]   2> NOTE: All tests run in this JVM: [TestSolrIndexConfig, PreAnalyzedFieldTest, OpenExchangeRatesOrgProviderTest, TestCSVLoader, RequestHandlersTest, TestCharFilters, URLClassifyProcessorTest, LoggingHandlerTest, TestSolrQueryParser, TestNumberUtils, TestSolrDeletionPolicy1, FileUtilsTest, TestPropInjectDefaults, DistributedSpellCheckComponentTest, TestPHPSerializedResponseWriter, SolrCmdDistributorTest, TestStressLucene, DefaultValueUpdateProcessorTest, TestReplicationHandler, XsltUpdateRequestHandlerTest, ZkNodePropsTest, LeaderElectionTest, TestPerFieldSimilarity, DateFieldTest, BasicDistributedZkTest, DocumentAnalysisRequestHandlerTest, TestElisionMultitermQuery, TestSurroundQueryParser, AlternateDirectoryTest, FieldAnalysisRequestHandlerTest, TestLazyCores, TestFaceting, TestIndexSearcher, SuggesterTSTTest, MBeansHandlerTest, TestDefaultSimilarityFactory, TestSolrDeletionPolicy2, TimeZoneUtilsTest, TestQueryTypes, TestReversedWildcardFilterFactory, NoCacheHeaderTest, SpellPossibilityIteratorTest, LeaderElectionIntegrationTest, TestReload, TestSolrCoreProperties, RequiredFieldsTest, TestSort, FileBasedSpellCheckerTest, CoreContainerCoreInitFailuresTest, DistributedTermsComponentTest, TestIBSimilarityFactory, TestSearchPerf, DirectUpdateHandlerOptimizeTest, TestFunctionQuery, JsonLoaderTest, DistributedQueryElevationComponentTest, ResourceLoaderTest, DebugComponentTest, AnalysisAfterCoreReloadTest, TestSuggestSpellingConverter, TestRecovery, TestLFUCache, TestFastLRUCache, FullSolrCloudDistribCmdsTest, TestStressVersions, CSVRequestHandlerTest, TestWordDelimiterFilterFactory, TestLMDirichletSimilarityFactory, AutoCommitTest, PluginInfoTest, SolrRequestParserTest, TestQuerySenderNoQuery, TestPropInject, TestCollationField, StatsComponentTest, BadComponentTest, TestJmxMonitoredMap, DisMaxRequestHandlerTest, TestJoin, SolrInfoMBeanTest, TestDFRSimilarityFactory, CoreAdminHandlerTest, ZkSolrClientTest, RAMDirectoryFactoryTest, BinaryUpdateRequestHandlerTest, TestPhraseSuggestions, MinimalSchemaTest, SearchHandlerTest, TestLuceneMatchVersion, QueryEqualityTest, TestDistributedSearch, TestStressRecovery, StatelessScriptUpdateProcessorFactoryTest, ClusterStateUpdateTest, TestWriterPerf, WordBreakSolrSpellCheckerTest, TestFastOutputStream, TestRandomFaceting, SolrCoreCheckLockOnStartupTest, TestIndexingPerformance, TestUpdate, TestCodecSupport, ClusterStateTest, DocumentBuilderTest, ConvertedLegacyTest, TestCoreContainer, DistanceFunctionTest, SystemInfoHandlerTest, SolrCoreTest, CircularListTest, SpellCheckComponentTest, OverseerTest, RecoveryZkTest, TestRealTimeGet, ZkControllerTest, TestDistributedGrouping, SpellCheckCollatorTest, TestExtendedDismaxParser, SoftAutoCommitTest, BasicZkTest, TestHashPartitioner, IndexBasedSpellCheckerTest, TestRangeQuery, DirectUpdateHandlerTest, TestMultiCoreConfBootstrap, SimpleFacetsTest, LukeRequestHandlerTest, TestGroupingSearch, DirectSolrSpellCheckerTest, TestFiltering, PeerSyncTest, QueryElevationComponentTest, SortByFunctionTest, BasicFunctionalityTest, SignatureUpdateProcessorFactoryTest, TestBinaryResponseWriter, TestJmxIntegration, SampleTest, HighlighterTest, TestTrie, DirectSolrConnectionTest, TestRemoteStreaming, CacheHeaderTest, PolyFieldTest, SpatialFilterTest, TestCSVResponseWriter, MoreLikeThisHandlerTest, CurrencyFieldTest, TestPseudoReturnFields, IndexSchemaTest, QueryParsingTest, TermsComponentTest, StandardRequestHandlerTest, XmlUpdateRequestHandlerTest]
> [junit4:junit4]   2> NOTE: reproduce with: ant test  -Dtestcase=XmlUpdateRequestHandlerTest -Dtests.seed=ED1A9C533D68A0C3 -Dtests.slow=true -Dtests.locale=mk_MK -Dtests.timezone=Asia/Sakhalin -Dtests.file.encoding=Cp1252
> [junit4:junit4] ERROR   0.00s | XmlUpdateRequestHandlerTest (suite) <<<
> [junit4:junit4]    > Throwable #1: junit.framework.AssertionFailedError: Clean up static fields (in @AfterClass?), your test seems to hang on to approximately 11,836,024 bytes (threshold is 10,485,760). Field reference sizes (counted individually):
> [junit4:junit4]    >   - 12,070,224 bytes, protected static org.apache.solr.handler.UpdateRequestHandler org.apache.solr.handler.XmlUpdateRequestHandlerTest.handler
> [junit4:junit4]    >   - 3,792 bytes, private static javax.xml.stream.XMLInputFactory org.apache.solr.handler.XmlUpdateRequestHandlerTest.inputFactory
> [junit4:junit4]    >   - 280 bytes, public static org.junit.rules.TestRule org.apache.solr.SolrTestCaseJ4.solrClassRules
> [junit4:junit4]    >   - 232 bytes, protected static java.lang.String org.apache.solr.SolrTestCaseJ4.testSolrHome
> [junit4:junit4]    >   - 128 bytes, private static java.lang.String org.apache.solr.SolrTestCaseJ4.factoryProp
> [junit4:junit4]    >   - 64 bytes, private static java.lang.String org.apache.solr.SolrTestCaseJ4.coreName
> [junit4:junit4]    > at __randomizedtesting.SeedInfo.seed([ED1A9C533D68A0C3]:0)
> [junit4:junit4]    > at com.carrotsearch.randomizedtesting.rules.StaticFieldsInvariantRule$1.afterAlways(StaticFieldsInvariantRule.java:127)
> [junit4:junit4]    > at com.carrotsearch.randomizedtesting.rules.StatementAdapter.evaluate(StatementAdapter.java:43)
> [junit4:junit4]    > at org.apache.lucene.util.TestRuleAssertionsRequired$1.evaluate(TestRuleAssertionsRequired.java:43)
> [junit4:junit4]    > at org.apache.lucene.util.TestRuleMarkFailure$1.evaluate(TestRuleMarkFailure.java:48)
> [junit4:junit4]    > at org.apache.lucene.util.TestRuleIgnoreAfterMaxFailures$1.evaluate(TestRuleIgnoreAfterMaxFailures.java:70)
> [junit4:junit4]    > at org.apache.lucene.util.TestRuleIgnoreTestSuites$1.evaluate(TestRuleIgnoreTestSuites.java:55)
> [junit4:junit4]    > at com.carrotsearch.randomizedtesting.rules.StatementAdapter.evaluate(StatementAdapter.java:36)
> [junit4:junit4]    > at com.carrotsearch.randomizedtesting.ThreadLeakControl$StatementRunner.run(ThreadLeakControl.java:358)
> [junit4:junit4]    > at java.lang.Thread.run(Thread.java:722)
> [junit4:junit4] Completed in 1.54s, 5 tests, 1 failure <<< FAILURES!
>
> [...truncated 232 lines...]
> BUILD FAILED
> C:\Users\JenkinsSlave\workspace\Lucene-Solr-trunk-Windows\build.xml:335: The following error occurred while executing this line:
> C:\Users\JenkinsSlave\workspace\Lucene-Solr-trunk-Windows\build.xml:39: The following error occurred while executing this line:
> C:\Users\JenkinsSlave\workspace\Lucene-Solr-trunk-Windows\solr\build.xml:178: The following error occurred while executing this line:
> C:\Users\JenkinsSlave\workspace\Lucene-Solr-trunk-Windows\lucene\module-build.xml:61: The following error occurred while executing this line:
> C:\Users\JenkinsSlave\workspace\Lucene-Solr-trunk-Windows\lucene\common-build.xml:1159: The following error occurred while executing this line:
> C:\Users\JenkinsSlave\workspace\Lucene-Solr-trunk-Windows\lucene\common-build.xml:827: There were test failures: 233 suites, 965 tests, 1 suite-level error, 12 ignored (7 assumptions)
>
> Total time: 37 minutes 54 seconds
> Build step 'Invoke Ant' marked build as failure
> Archiving artifacts
> Recording test results
> Description set: Java: 64bit/jdk1.7.0_07 -XX:+UseConcMarkSweepGC
> Email was triggered for: Failure
> Sending email for trigger: Failure
>
>
>
> ---------------------------------------------------------------------
> To unsubscribe, e-mail: [hidden email]
> For additional commands, e-mail: [hidden email]


---------------------------------------------------------------------
To unsubscribe, e-mail: [hidden email]
For additional commands, e-mail: [hidden email]

Reply | Threaded
Open this post in threaded view
|

Re: [JENKINS] Lucene-Solr-trunk-Windows (64bit/jdk1.7.0_07) - Build # 1370 - Still Failing!

Robert Muir
I think it tells you in the exception?

Stack Trace:
junit.framework.AssertionFailedError: Clean up static fields (in
@AfterClass?), your test seems to hang on to approximately 11,836,024
bytes (threshold is 10,485,760). Field reference sizes (counted
individually):
  - 12,070,224 bytes, protected static
org.apache.solr.handler.UpdateRequestHandler
org.apache.solr.handler.XmlUpdateRequestHandlerTest.handler
  - 3,792 bytes, private static javax.xml.stream.XMLInputFactory
org.apache.solr.handler.XmlUpdateRequestHandlerTest.inputFactory
  - 280 bytes, public static org.junit.rules.TestRule
org.apache.solr.SolrTestCaseJ4.solrClassRules
  - 232 bytes, protected static java.lang.String
org.apache.solr.SolrTestCaseJ4.testSolrHome
  - 128 bytes, private static java.lang.String
org.apache.solr.SolrTestCaseJ4.factoryProp
  - 64 bytes, private static java.lang.String
org.apache.solr.SolrTestCaseJ4.coreName
        at __randomizedtesting.SeedInfo.seed([ED1A9C533D68A0C3]:0)
        at com.carrotsearch.randomizedtesting.rules.StaticFieldsInvariantRule$1.afterAlways(StaticFieldsInvariantRule.java:127)
        at com.carrotsearch.randomizedtesting.rules.StatementAdapter.evaluate(StatementAdapter.java:43)
        at org.apache.lucene.util.TestRuleAssertionsRequired$1.evaluate(TestRuleAssertionsRequired.java:43)
        at org.apache.lucene.util.TestRuleMarkFailure$1.evaluate(TestRuleMarkFailure.java:48)
        at org.apache.lucene.util.TestRuleIgnoreAfterMaxFailures$1.evaluate(TestRuleIgnoreAfterMaxFailures.java:70)
        at org.apache.lucene.util.TestRuleIgnoreTestSuites$1.evaluate(TestRuleIgnoreTestSuites.java:55)
        at com.carrotsearch.randomizedtesting.rules.StatementAdapter.evaluate(StatementAdapter.java:36)
        at com.carrotsearch.randomizedtesting.ThreadLeakControl$StatementRunner.run(ThreadLeakControl.java:358)
        at java.lang.Thread.run(Thread.java:722)


I would recommend something like this:
Index: solr/core/src/test/org/apache/solr/handler/XmlUpdateRequestHandlerTest.java
===================================================================
--- solr/core/src/test/org/apache/solr/handler/XmlUpdateRequestHandlerTest.java (revision
1403781)
+++ solr/core/src/test/org/apache/solr/handler/XmlUpdateRequestHandlerTest.java (working
copy)
@@ -27,6 +27,7 @@
 import org.apache.solr.update.DeleteUpdateCommand;
 import org.apache.solr.update.processor.BufferingRequestProcessor;
 import org.apache.solr.update.processor.UpdateRequestProcessor;
+import org.junit.AfterClass;
 import org.junit.BeforeClass;
 import org.junit.Test;

@@ -40,14 +41,21 @@
 import javax.xml.stream.XMLStreamReader;

 public class XmlUpdateRequestHandlerTest extends SolrTestCaseJ4 {
-  private static XMLInputFactory inputFactory = XMLInputFactory.newInstance();
+  private static XMLInputFactory inputFactory;
   protected static UpdateRequestHandler handler;

   @BeforeClass
   public static void beforeTests() throws Exception {
     initCore("solrconfig.xml","schema.xml");
     handler = new UpdateRequestHandler();
+    inputFactory = XMLInputFactory.newInstance();
   }
+
+  @AfterClass
+  public static void afterTests() throws Exception {
+    handler = null;
+    inputFactory = null;
+  }

   @Test
   public void testReadDoc() throws Exception


On Tue, Oct 30, 2012 at 1:12 PM, Alan Woodward
<[hidden email]> wrote:

> I think these failures must be related to the metrics I added in SOLR-1972, which use static fields.  I'm not sure why, though, as the objects involved should be pretty small.
>
> Is there a way of getting a more detailed breakdown of which classes/objects are using the memory?
>
> On 30 Oct 2012, at 16:30, Policeman Jenkins Server wrote:
>
>> Build: http://jenkins.sd-datasolutions.de/job/Lucene-Solr-trunk-Windows/1370/
>> Java: 64bit/jdk1.7.0_07 -XX:+UseConcMarkSweepGC
>>
>> 1 tests failed.
>> FAILED:  junit.framework.TestSuite.org.apache.solr.handler.XmlUpdateRequestHandlerTest
>>
>> Error Message:
>> Clean up static fields (in @AfterClass?), your test seems to hang on to approximately 11,836,024 bytes (threshold is 10,485,760). Field reference sizes (counted individually):   - 12,070,224 bytes, protected static org.apache.solr.handler.UpdateRequestHandler org.apache.solr.handler.XmlUpdateRequestHandlerTest.handler   - 3,792 bytes, private static javax.xml.stream.XMLInputFactory org.apache.solr.handler.XmlUpdateRequestHandlerTest.inputFactory   - 280 bytes, public static org.junit.rules.TestRule org.apache.solr.SolrTestCaseJ4.solrClassRules   - 232 bytes, protected static java.lang.String org.apache.solr.SolrTestCaseJ4.testSolrHome   - 128 bytes, private static java.lang.String org.apache.solr.SolrTestCaseJ4.factoryProp   - 64 bytes, private static java.lang.String org.apache.solr.SolrTestCaseJ4.coreName
>>
>> Stack Trace:
>> junit.framework.AssertionFailedError: Clean up static fields (in @AfterClass?), your test seems to hang on to approximately 11,836,024 bytes (threshold is 10,485,760). Field reference sizes (counted individually):
>>  - 12,070,224 bytes, protected static org.apache.solr.handler.UpdateRequestHandler org.apache.solr.handler.XmlUpdateRequestHandlerTest.handler
>>  - 3,792 bytes, private static javax.xml.stream.XMLInputFactory org.apache.solr.handler.XmlUpdateRequestHandlerTest.inputFactory
>>  - 280 bytes, public static org.junit.rules.TestRule org.apache.solr.SolrTestCaseJ4.solrClassRules
>>  - 232 bytes, protected static java.lang.String org.apache.solr.SolrTestCaseJ4.testSolrHome
>>  - 128 bytes, private static java.lang.String org.apache.solr.SolrTestCaseJ4.factoryProp
>>  - 64 bytes, private static java.lang.String org.apache.solr.SolrTestCaseJ4.coreName
>>       at __randomizedtesting.SeedInfo.seed([ED1A9C533D68A0C3]:0)
>>       at com.carrotsearch.randomizedtesting.rules.StaticFieldsInvariantRule$1.afterAlways(StaticFieldsInvariantRule.java:127)
>>       at com.carrotsearch.randomizedtesting.rules.StatementAdapter.evaluate(StatementAdapter.java:43)
>>       at org.apache.lucene.util.TestRuleAssertionsRequired$1.evaluate(TestRuleAssertionsRequired.java:43)
>>       at org.apache.lucene.util.TestRuleMarkFailure$1.evaluate(TestRuleMarkFailure.java:48)
>>       at org.apache.lucene.util.TestRuleIgnoreAfterMaxFailures$1.evaluate(TestRuleIgnoreAfterMaxFailures.java:70)
>>       at org.apache.lucene.util.TestRuleIgnoreTestSuites$1.evaluate(TestRuleIgnoreTestSuites.java:55)
>>       at com.carrotsearch.randomizedtesting.rules.StatementAdapter.evaluate(StatementAdapter.java:36)
>>       at com.carrotsearch.randomizedtesting.ThreadLeakControl$StatementRunner.run(ThreadLeakControl.java:358)
>>       at java.lang.Thread.run(Thread.java:722)
>>
>>
>>
>>
>> Build Log:
>> [...truncated 8847 lines...]
>> [junit4:junit4] Suite: org.apache.solr.handler.XmlUpdateRequestHandlerTest
>> [junit4:junit4]   2> 1 T3303 oas.SolrTestCaseJ4.initCore ####initCore
>> [junit4:junit4]   2> Creating dataDir: C:\Users\JenkinsSlave\workspace\Lucene-Solr-trunk-Windows\solr\build\solr-core\test\J0\.\solrtest-XmlUpdateRequestHandlerTest-1351614363016
>> [junit4:junit4]   2> 3 T3303 oasc.SolrResourceLoader.<init> new SolrResourceLoader for directory: 'C:\Users\JenkinsSlave\workspace\Lucene-Solr-trunk-Windows\solr\build\solr-core\test-files\solr\collection1\'
>> [junit4:junit4]   2> 4 T3303 oasc.SolrResourceLoader.replaceClassLoader Adding 'file:/C:/Users/JenkinsSlave/workspace/Lucene-Solr-trunk-Windows/solr/build/solr-core/test-files/solr/collection1/lib/classes/' to classloader
>> [junit4:junit4]   2> 5 T3303 oasc.SolrResourceLoader.replaceClassLoader Adding 'file:/C:/Users/JenkinsSlave/workspace/Lucene-Solr-trunk-Windows/solr/build/solr-core/test-files/solr/collection1/lib/README' to classloader
>> [junit4:junit4]   2> 73 T3303 oasc.SolrConfig.<init> Using Lucene MatchVersion: LUCENE_50
>> [junit4:junit4]   2> 139 T3303 oasc.SolrConfig.<init> Loaded SolrConfig: solrconfig.xml
>> [junit4:junit4]   2> 140 T3303 oass.IndexSchema.readSchema Reading Solr Schema
>> [junit4:junit4]   2> 144 T3303 oass.IndexSchema.readSchema Schema name=test
>> [junit4:junit4]   2> 719 T3303 oass.OpenExchangeRatesOrgProvider.init Initialized with rates=open-exchange-rates.json, refreshInterval=1440.
>> [junit4:junit4]   2> 732 T3303 oass.IndexSchema.readSchema default search field in schema is text
>> [junit4:junit4]   2> 738 T3303 oass.IndexSchema.readSchema unique key field: id
>> [junit4:junit4]   2> 746 T3303 oass.FileExchangeRateProvider.reload Reloading exchange rates from file currency.xml
>> [junit4:junit4]   2> 751 T3303 oass.FileExchangeRateProvider.reload Reloading exchange rates from file currency.xml
>> [junit4:junit4]   2> 755 T3303 oass.OpenExchangeRatesOrgProvider.reload Reloading exchange rates from open-exchange-rates.json
>> [junit4:junit4]   2> 756 T3303 oass.OpenExchangeRatesOrgProvider.reload Reloading exchange rates from open-exchange-rates.json
>> [junit4:junit4]   2> 756 T3303 oasc.SolrResourceLoader.locateSolrHome JNDI not configured for solr (NoInitialContextEx)
>> [junit4:junit4]   2> 757 T3303 oasc.SolrResourceLoader.locateSolrHome using system property solr.solr.home: C:\Users\JenkinsSlave\workspace\Lucene-Solr-trunk-Windows\solr\build\solr-core\test-files\solr
>> [junit4:junit4]   2> 757 T3303 oasc.SolrResourceLoader.<init> new SolrResourceLoader for directory: 'C:\Users\JenkinsSlave\workspace\Lucene-Solr-trunk-Windows\solr\build\solr-core\test-files\solr\'
>> [junit4:junit4]   2> 768 T3303 oasc.CoreContainer.<init> New CoreContainer 974373728
>> [junit4:junit4]   2> 768 T3303 oasc.SolrCore.<init> [collection1] Opening new SolrCore at C:\Users\JenkinsSlave\workspace\Lucene-Solr-trunk-Windows\solr\build\solr-core\test-files\solr\collection1\, dataDir=C:\Users\JenkinsSlave\workspace\Lucene-Solr-trunk-Windows\solr\build\solr-core\test\J0\.\solrtest-XmlUpdateRequestHandlerTest-1351614363016\
>> [junit4:junit4]   2> 769 T3303 oasc.JmxMonitoredMap.<init> JMX monitoring is enabled. Adding Solr mbeans to JMX Server: com.sun.jmx.mbeanserver.JmxMBeanServer@49dbfd4d
>> [junit4:junit4]   2> 769 T3303 oasc.SolrCore.initDirectoryFactory org.apache.solr.core.MockDirectoryFactory
>> [junit4:junit4]   2> 770 T3303 oasc.CachingDirectoryFactory.injectLockFactory WARNING No lockType configured for MockDirWrapper(org.apache.lucene.store.RAMDirectory@c25995 lockFactory=org.apache.lucene.store.SingleInstanceLockFactory@57874596) assuming 'simple'
>> [junit4:junit4]   2> 771 T3303 oasc.CachingDirectoryFactory.get return new directory for C:\Users\JenkinsSlave\workspace\Lucene-Solr-trunk-Windows\solr\build\solr-core\test\J0\.\solrtest-XmlUpdateRequestHandlerTest-1351614363016 forceNew:false
>> [junit4:junit4]   2> 771 T3303 oasc.CachingDirectoryFactory.close Releasing directory:C:\Users\JenkinsSlave\workspace\Lucene-Solr-trunk-Windows\solr\build\solr-core\test\J0\.\solrtest-XmlUpdateRequestHandlerTest-1351614363016
>> [junit4:junit4]   2> 771 T3303 oasc.SolrCore.getNewIndexDir New index directory detected: old=null new=C:\Users\JenkinsSlave\workspace\Lucene-Solr-trunk-Windows\solr\build\solr-core\test\J0\.\solrtest-XmlUpdateRequestHandlerTest-1351614363016\index/
>> [junit4:junit4]   2> 772 T3303 oasc.SolrCore.initIndex WARNING [collection1] Solr index directory 'C:\Users\JenkinsSlave\workspace\Lucene-Solr-trunk-Windows\solr\build\solr-core\test\J0\.\solrtest-XmlUpdateRequestHandlerTest-1351614363016\index' doesn't exist. Creating new index...
>> [junit4:junit4]   2> 773 T3303 oasc.CachingDirectoryFactory.get return new directory for C:\Users\JenkinsSlave\workspace\Lucene-Solr-trunk-Windows\solr\build\solr-core\test\J0\.\solrtest-XmlUpdateRequestHandlerTest-1351614363016\index forceNew:false
>> [junit4:junit4]   2> 775 T3303 oasc.SolrDeletionPolicy.onCommit SolrDeletionPolicy.onCommit: commits:num=1
>> [junit4:junit4]   2>          commit{dir=MockDirWrapper(org.apache.lucene.store.RAMDirectory@54c7d1ee lockFactory=org.apache.lucene.store.NativeFSLockFactory@7dc76c68),segFN=segments_1,generation=1,filenames=[segments_1]
>> [junit4:junit4]   2> 775 T3303 oasc.SolrDeletionPolicy.updateCommits newest commit = 1[segments_1]
>> [junit4:junit4]   2> 776 T3303 oasc.CachingDirectoryFactory.close Releasing directory:C:\Users\JenkinsSlave\workspace\Lucene-Solr-trunk-Windows\solr\build\solr-core\test\J0\.\solrtest-XmlUpdateRequestHandlerTest-1351614363016\index
>> [junit4:junit4]   2> 776 T3303 oasc.SolrCore.initWriters created xml: solr.XMLResponseWriter
>> [junit4:junit4]   2> 778 T3303 oasup.UpdateRequestProcessorChain.init inserting DistributedUpdateProcessorFactory into updateRequestProcessorChain "dedupe"
>> [junit4:junit4]   2> 778 T3303 oasup.UpdateRequestProcessorChain.init inserting DistributedUpdateProcessorFactory into updateRequestProcessorChain "dedupe-allfields"
>> [junit4:junit4]   2> 779 T3303 oasup.UpdateRequestProcessorChain.init inserting DistributedUpdateProcessorFactory into updateRequestProcessorChain "stored_sig"
>> [junit4:junit4]   2> 779 T3303 oasup.UpdateRequestProcessorChain.init inserting DistributedUpdateProcessorFactory into updateRequestProcessorChain "uniq-fields"
>> [junit4:junit4]   2> 780 T3303 oasup.UpdateRequestProcessorChain.init inserting DistributedUpdateProcessorFactory into updateRequestProcessorChain "distrib-dup-test-chain-implicit"
>> [junit4:junit4]   2> 780 T3303 oasc.RequestHandlers.initHandlersFromConfig adding lazy requestHandler: solr.ReplicationHandler
>> [junit4:junit4]   2> 780 T3303 oasc.RequestHandlers.initHandlersFromConfig created /replication: solr.ReplicationHandler
>> [junit4:junit4]   2> 781 T3303 oasc.RequestHandlers.initHandlersFromConfig created standard: solr.StandardRequestHandler
>> [junit4:junit4]   2> 782 T3303 oasc.RequestHandlers.initHandlersFromConfig created /get: solr.RealTimeGetHandler
>> [junit4:junit4]   2> 783 T3303 oasc.RequestHandlers.initHandlersFromConfig created dismax: solr.SearchHandler
>> [junit4:junit4]   2> 783 T3303 oasc.RequestHandlers.initHandlersFromConfig created mock: org.apache.solr.core.MockQuerySenderListenerReqHandler
>> [junit4:junit4]   2> 784 T3303 oasc.RequestHandlers.initHandlersFromConfig created /admin/: org.apache.solr.handler.admin.AdminHandlers
>> [junit4:junit4]   2> 785 T3303 oasc.RequestHandlers.initHandlersFromConfig created defaults: solr.StandardRequestHandler
>> [junit4:junit4]   2> 785 T3303 oasc.RequestHandlers.initHandlersFromConfig adding lazy requestHandler: solr.StandardRequestHandler
>> [junit4:junit4]   2> 785 T3303 oasc.RequestHandlers.initHandlersFromConfig created lazy: solr.StandardRequestHandler
>> [junit4:junit4]   2> 786 T3303 oasc.RequestHandlers.initHandlersFromConfig created /update: solr.UpdateRequestHandler
>> [junit4:junit4]   2> 787 T3303 oasc.RequestHandlers.initHandlersFromConfig created /terms: org.apache.solr.handler.component.SearchHandler
>> [junit4:junit4]   2> 788 T3303 oasc.RequestHandlers.initHandlersFromConfig created spellCheckCompRH: org.apache.solr.handler.component.SearchHandler
>> [junit4:junit4]   2> 788 T3303 oasc.RequestHandlers.initHandlersFromConfig created spellCheckCompRH_Direct: org.apache.solr.handler.component.SearchHandler
>> [junit4:junit4]   2> 789 T3303 oasc.RequestHandlers.initHandlersFromConfig created spellCheckWithWordbreak: org.apache.solr.handler.component.SearchHandler
>> [junit4:junit4]   2> 790 T3303 oasc.RequestHandlers.initHandlersFromConfig created spellCheckWithWordbreak_Direct: org.apache.solr.handler.component.SearchHandler
>> [junit4:junit4]   2> 791 T3303 oasc.RequestHandlers.initHandlersFromConfig created spellCheckCompRH1: org.apache.solr.handler.component.SearchHandler
>> [junit4:junit4]   2> 792 T3303 oasc.RequestHandlers.initHandlersFromConfig created tvrh: org.apache.solr.handler.component.SearchHandler
>> [junit4:junit4]   2> 792 T3303 oasc.RequestHandlers.initHandlersFromConfig created /mlt: solr.MoreLikeThisHandler
>> [junit4:junit4]   2> 793 T3303 oasc.RequestHandlers.initHandlersFromConfig created /debug/dump: solr.DumpRequestHandler
>> [junit4:junit4]   2> 804 T3303 oashl.XMLLoader.init xsltCacheLifetimeSeconds=60
>> [junit4:junit4]   2> 810 T3303 oasc.SolrCore.initDeprecatedSupport WARNING solrconfig.xml uses deprecated <admin/gettableFiles>, Please update your config to use the ShowFileRequestHandler.
>> [junit4:junit4]   2> 813 T3303 oasc.SolrCore.initDeprecatedSupport WARNING adding ShowFileRequestHandler with hidden files: [THROW.ERROR.ON.ADD.UPDATEPROCESSOR.JS, SOLRCONFIG-HIGHLIGHT.XML, SCHEMA-REQUIRED-FIELDS.XML, TRIVIAL.UPDATEPROCESSOR1.JS, BAD-SCHEMA-DUP-DYNAMICFIELD.XML, SCHEMA-MINIMAL.XML, SCHEMA-REPLICATION2.XML, SOLRCONFIG-CACHING.XML, SOLRCONFIG-REPEATER.XML, CURRENCY.XML, BAD-SCHEMA-NONTEXT-ANALYZER.XML, SOLRCONFIG-MERGEPOLICY.XML, SOLRCONFIG-TLOG.XML, SOLRCONFIG-MASTER.XML, BAD-SCHEMA-UNIQUEKEY-MULTIVALUED.XML, SCHEMA11.XML, SOLRCONFIG-BASIC.XML, DA_COMPOUNDDICTIONARY.TXT, MISSLEADING.EXTENSION.UPDATEPROCESSOR.JS.TXT, SCHEMA-COPYFIELD-TEST.XML, SOLRCONFIG-SLAVE.XML, SOLRCONFIG-PROPINJECT-INDEXDEFAULT.XML, ELEVATE.XML, TRIVIAL.UPDATEPROCESSOR0.JS, BAD-SOLRCONFIG-BOGUS-SCRIPTENGINE-NAME.XML, SCHEMA-CHARFILTERS.XML, SCHEMA-IB.XML, SOLRCONFIG-QUERYSENDER.XML, SOLRCONFIG-SNIPPET-PROCESSOR.XML, DA_UTF8.XML, SCHEMA-REPLICATION1.XML, CONDITIONAL.UPDATEPROCESSOR.JS, MISSING.FUNCTIONS.UPDATEPROCESSOR.JS, HYPHENATION.DTD, SOLRCONFIG-ENABLEPLUGIN.XML, STEMDICT.TXT, SCHEMA-PHRASESUGGEST.XML, HUNSPELL-TEST.AFF, SCHEMA-SNIPPET-TYPE.XML, STOPTYPES-1.TXT, STOPWORDSWRONGENCODING.TXT, SCHEMA-NUMERIC.XML, SOLRCONFIG-TRANSFORMERS.XML, SOLRCONFIG-PROPINJECT.XML, BAD-SCHEMA-NOT-INDEXED-BUT-TF.XML, SOLRCONFIG-SIMPLELOCK.XML, WDFTYPES.TXT, STOPTYPES-2.TXT, SCHEMA-REVERSED.XML, BAD-SCHEMA-CURRENCY-FT-MULTIVALUED.XML, SOLRCONFIG-SPELLCHECKCOMPONENT.XML, SOLRCONFIG-PHRASESUGGEST.XML, BAD-SCHEMA-CURRENCY-MULTIVALUED.XML, SCHEMA-DFR.XML, BAD-SCHEMA-NOT-INDEXED-BUT-POS.XML, KEEP-1.TXT, OPEN-EXCHANGE-RATES.JSON, SCHEMA-SPATIAL.XML, STOPWITHBOM.TXT, SOLRCONFIG-SPELLCHECKER.XML, SCHEMA-BINARYFIELD.XML, SOLRCONFIG-UPDATE-PROCESSOR-CHAINS.XML, BAD-SCHEMA-OMIT-TF-BUT-NOT-POS.XML, BAD-SCHEMA-DUP-FIELDTYPE.XML, SCHEMA-XINCLUDE.XML, SOLRCONFIG-MASTER1.XML, SYNONYMS.TXT, BAD-SCHEMA-CURRENCY-DYNAMIC-MULTIVALUED.XML, SCHEMA.XML, SCHEMA_CODEC.XML, SOLRCONFIG-SOLR-749.XML, SOLRCONFIG-MASTER1-KEEPONEBACKUP.XML, STOP-2.TXT, SOLRCONFIG-FUNCTIONQUERY.XML, SOLRCONFIG-TERMINDEX.XML, SCHEMA-LMDIRICHLET.XML, SOLRCONFIG-ELEVATE.XML, STOPWORDS.TXT, SCHEMA-FOLDING.XML, SCHEMA-STOP-KEEP.XML, BAD-SCHEMA-NOT-INDEXED-BUT-NORMS.XML, SOLRCONFIG-SOLCOREPROPERTIES.XML, STOP-1.TXT, SOLRCONFIG-MASTER2.XML, SCHEMA-SPELLCHECKER.XML, SOLRCONFIG-RESPONSE-LOG-COMPONENT.XML, SOLRCONFIG-LAZYWRITER.XML, SCHEMA-LUCENEMATCHVERSION.XML, FRENCHARTICLES.TXT, BAD-MP-SOLRCONFIG.XML, SCHEMA15.XML, SOLRCONFIG-REQHANDLER.INCL, SCHEMASURROUND.XML, SOLRCONFIG-MASTER3.XML, HUNSPELL-TEST.DIC, SOLRCONFIG-XINCLUDE.XML, BAD-SCHEMA-CODEC-GLOBAL-VS-FT-MISMATCH.XML, SOLRCONFIG-SLAVE1.XML, SOLRCONFIG-DELPOLICY1.XML, SCHEMA-SIM.XML, SCHEMA-SNIPPET-FIELD.XML, SCHEMA-COLLATE.XML, STOP-SNOWBALL.TXT, BAD-SCHEMA-SIM-GLOBAL-VS-FT-MISMATCH.XML, PROTWORDS.TXT, SCHEMA-TRIE.XML, SOLRCONFIG_CODEC.XML, BAD-SOLRCONFIG-INVALID-SCRIPTFILE.XML, JASUGGEST.TXT, SCHEMA-TFIDF.XML, SOLRCONFIG-SCRIPT-UPDATEPROCESSOR.XML, SCHEMA-LMJELINEKMERCER.XML, PHRASESUGGEST.TXT, BAD-SOLRCONFIG-MISSING-SCRIPTFILE.XML, BAD-SCHEMA-UNIQUEKEY-USES-DEFAULT.XML, OLD_SYNONYMS.TXT, SOLRCONFIG-DELPOLICY2.XML, XSLT, SOLRCONFIG-NATIVELOCK.XML, BAD-SCHEMA-DUP-FIELD.XML, SOLRCONFIG-NOCACHE.XML, SCHEMA-BM25.XML, ADDFIELDS.UPDATEPROCESSOR.JS, SOLRCONFIG-QUERYSENDER-NOQUERY.XML, SOLRCONFIG-ALTDIRECTORY.XML, COMPOUNDDICTIONARY.TXT, SOLRCONFIG_PERF.XML, SOLRCONFIG-INDEXCONFIG.XML, BAD-SCHEMA-ANALYZER-CLASS-AND-NESTED.XML, SCHEMA-NOT-REQUIRED-UNIQUE-KEY.XML, KEEP-2.TXT, BAD-SCHEMA-UNIQUEKEY-IS-COPYFIELD-DEST.XML, SCHEMA12.XML, MAPPING-ISOLATIN1ACCENT.TXT, BAD_SOLRCONFIG.XML, BAD-SCHEMA-EXTERNAL-FILEFIELD.XML]
>> [junit4:junit4]   2> 815 T3303 oasc.CachingDirectoryFactory.close Releasing directory:C:\Users\JenkinsSlave\workspace\Lucene-Solr-trunk-Windows\solr\build\solr-core\test\J0\.\solrtest-XmlUpdateRequestHandlerTest-1351614363016
>> [junit4:junit4]   2> 815 T3303 oass.SolrIndexSearcher.<init> Opening Searcher@77103877 main
>> [junit4:junit4]   2> 816 T3303 oasu.CommitTracker.<init> Hard AutoCommit: disabled
>> [junit4:junit4]   2> 816 T3303 oasu.CommitTracker.<init> Soft AutoCommit: disabled
>> [junit4:junit4]   2> 817 T3303 oashc.SpellCheckComponent.inform Initializing spell checkers
>> [junit4:junit4]   2> 827 T3303 oass.DirectSolrSpellChecker.init init: {name=direct,classname=DirectSolrSpellChecker,field=lowerfilt,minQueryLength=3}
>> [junit4:junit4]   2> 882 T3303 oashc.HttpShardHandlerFactory.getParameter Setting socketTimeout to: 0
>> [junit4:junit4]   2> 883 T3303 oashc.HttpShardHandlerFactory.getParameter Setting urlScheme to: http://
>> [junit4:junit4]   2> 883 T3303 oashc.HttpShardHandlerFactory.getParameter Setting connTimeout to: 0
>> [junit4:junit4]   2> 883 T3303 oashc.HttpShardHandlerFactory.getParameter Setting maxConnectionsPerHost to: 20
>> [junit4:junit4]   2> 884 T3303 oashc.HttpShardHandlerFactory.getParameter Setting corePoolSize to: 0
>> [junit4:junit4]   2> 884 T3303 oashc.HttpShardHandlerFactory.getParameter Setting maximumPoolSize to: 2147483647
>> [junit4:junit4]   2> 884 T3303 oashc.HttpShardHandlerFactory.getParameter Setting maxThreadIdleTime to: 5
>> [junit4:junit4]   2> 884 T3303 oashc.HttpShardHandlerFactory.getParameter Setting sizeOfQueue to: -1
>> [junit4:junit4]   2> 884 T3303 oashc.HttpShardHandlerFactory.getParameter Setting fairnessPolicy to: false
>> [junit4:junit4]   2> 885 T3303 oascsi.HttpClientUtil.createClient Creating new http client, config:maxConnectionsPerHost=20&maxConnections=10000&socketTimeout=0&connTimeout=0&retry=false
>> [junit4:junit4]   2> 897 T3304 oasc.SolrCore.registerSearcher [collection1] Registered new searcher Searcher@77103877 main{StandardDirectoryReader(segments_1:1)}
>> [junit4:junit4]   2> 899 T3303 oasc.CoreContainer.registerCore registering core: collection1
>> [junit4:junit4]   2> 909 T3303 oas.SolrTestCaseJ4.initCore ####initCore end
>> [junit4:junit4]   2> 913 T3303 oas.SolrTestCaseJ4.setUp ###Starting testNamedEntity
>> [junit4:junit4]   2> ASYNC  NEW_CORE C257 name=collection1 org.apache.solr.core.SolrCore@677ff169
>> [junit4:junit4]   2> 1006 T3303 C257 oasc.CachingDirectoryFactory.close Releasing directory:C:\Users\JenkinsSlave\workspace\Lucene-Solr-trunk-Windows\solr\build\solr-core\test\J0\.\solrtest-XmlUpdateRequestHandlerTest-1351614363016
>> [junit4:junit4]   2> 1010 T3303 C257 oasc.SolrDeletionPolicy.onInit SolrDeletionPolicy.onInit: commits:num=1
>> [junit4:junit4]   2>          commit{dir=MockDirWrapper(org.apache.lucene.store.RAMDirectory@54c7d1ee lockFactory=org.apache.lucene.store.NativeFSLockFactory@7dc76c68),segFN=segments_1,generation=1,filenames=[segments_1]
>> [junit4:junit4]   2> 1010 T3303 C257 oasc.SolrDeletionPolicy.updateCommits newest commit = 1[segments_1]
>> [junit4:junit4]   2> 1011 T3303 C257 UPDATE [collection1] webapp=null path=null params={} {add=[1]} 0 91
>> [junit4:junit4]   2> 1032 T3303 C257 oasu.DirectUpdateHandler2.commit start commit{flags=0,_version_=0,optimize=false,openSearcher=true,waitSearcher=true,expungeDeletes=false,softCommit=false}
>> [junit4:junit4]   2> 1035 T3303 C257 oasc.SolrDeletionPolicy.onCommit SolrDeletionPolicy.onCommit: commits:num=2
>> [junit4:junit4]   2>          commit{dir=MockDirWrapper(org.apache.lucene.store.RAMDirectory@54c7d1ee lockFactory=org.apache.lucene.store.NativeFSLockFactory@7dc76c68),segFN=segments_1,generation=1,filenames=[segments_1]
>> [junit4:junit4]   2>          commit{dir=MockDirWrapper(org.apache.lucene.store.RAMDirectory@54c7d1ee lockFactory=org.apache.lucene.store.NativeFSLockFactory@7dc76c68),segFN=segments_2,generation=2,filenames=[_0_Lucene41WithOrds_0.tib, _0.fnm, _0_Lucene41WithOrds_0.doc, _0_MockVariableIntBlock_0.doc, _0_Lucene41WithOrds_0.tii, _0_Lucene41WithOrds_0.pos, _0_nrm.cfs, _0_MockVariableIntBlock_0.skp, _0_Direct_0.doc, _0_MockVariableIntBlock_0.pyl, _0_MockVariableIntBlock_0.tib, _0_MockVariableIntBlock_0.frq, _0_SimpleText_0.pst, _0_nrm.cfe, _0_MockVariableIntBlock_0.pos, _0_Direct_0.pos, segments_2, _0.fdx, _0_Direct_0.tip, _0.si, _0_Direct_0.tim, _0.fdt, _0_MockVariableIntBlock_0.tii]
>> [junit4:junit4]   2> 1035 T3303 C257 oasc.SolrDeletionPolicy.updateCommits newest commit = 2[_0_Lucene41WithOrds_0.tib, _0.fnm, _0_Lucene41WithOrds_0.doc, _0_MockVariableIntBlock_0.doc, _0_Lucene41WithOrds_0.tii, _0_Lucene41WithOrds_0.pos, _0_nrm.cfs, _0_MockVariableIntBlock_0.skp, _0_Direct_0.doc, _0_MockVariableIntBlock_0.pyl, _0_MockVariableIntBlock_0.tib, _0_MockVariableIntBlock_0.frq, _0_SimpleText_0.pst, _0_nrm.cfe, _0_MockVariableIntBlock_0.pos, _0_Direct_0.pos, segments_2, _0.fdx, _0_Direct_0.tip, _0.si, _0_Direct_0.tim, _0.fdt, _0_MockVariableIntBlock_0.tii]
>> [junit4:junit4]   2> 1036 T3303 C257 oasc.CachingDirectoryFactory.close Releasing directory:C:\Users\JenkinsSlave\workspace\Lucene-Solr-trunk-Windows\solr\build\solr-core\test\J0\.\solrtest-XmlUpdateRequestHandlerTest-1351614363016
>> [junit4:junit4]   2> 1037 T3303 C257 oass.SolrIndexSearcher.<init> Opening Searcher@4992bebc main
>> [junit4:junit4]   2> 1037 T3303 C257 oasu.DirectUpdateHandler2.commit end_commit_flush
>> [junit4:junit4]   2> 1037 T3304 oasc.SolrCore.registerSearcher [collection1] Registered new searcher Searcher@4992bebc main{StandardDirectoryReader(segments_2:3 _0(5.0):C1)}
>> [junit4:junit4]   2> 1038 T3304 oasc.CachingDirectoryFactory.close Releasing directory:C:\Users\JenkinsSlave\workspace\Lucene-Solr-trunk-Windows\solr\build\solr-core\test\J0\.\solrtest-XmlUpdateRequestHandlerTest-1351614363016\index
>> [junit4:junit4]   2> 1039 T3303 C257 UPDATE [collection1] webapp=null path=null params={} {commit=} 0 7
>> [junit4:junit4]   2> 1040 T3303 C257 REQ [collection1] webapp=null path=null params={start=0&q=foo_s:zzz&qt=standard&rows=20&version=2.2} hits=1 status=0 QTime=0
>> [junit4:junit4]   2> 1042 T3303 oas.SolrTestCaseJ4.tearDown ###Ending testNamedEntity
>> [junit4:junit4]   2> 1044 T3303 oas.SolrTestCaseJ4.setUp ###Starting testRequestParams
>> [junit4:junit4]   2> 1051 T3303 oas.SolrTestCaseJ4.tearDown ###Ending testRequestParams
>> [junit4:junit4]   2> 1056 T3303 oas.SolrTestCaseJ4.setUp ###Starting testReadDelete
>> [junit4:junit4]   2> 1072 T3303 oas.SolrTestCaseJ4.tearDown ###Ending testReadDelete
>> [junit4:junit4]   2> 1074 T3303 oas.SolrTestCaseJ4.setUp ###Starting testReadDoc
>> [junit4:junit4]   2> 1075 T3303 oas.SolrTestCaseJ4.tearDown ###Ending testReadDoc
>> [junit4:junit4]   2> 1077 T3303 oas.SolrTestCaseJ4.setUp ###Starting testExternalEntities
>> [junit4:junit4]   2> 1083 T3303 oas.SolrTestCaseJ4.tearDown ###Ending testExternalEntities
>> [junit4:junit4]   2> 1083 T3303 oas.SolrTestCaseJ4.deleteCore ###deleteCore
>> [junit4:junit4]   2> 1084 T3303 oasc.CoreContainer.shutdown Shutting down CoreContainer instance=974373728
>> [junit4:junit4]   2> 1084 T3303 oasc.SolrCore.close [collection1]  CLOSING SolrCore org.apache.solr.core.SolrCore@677ff169
>> [junit4:junit4]   2> 1087 T3303 oasu.DirectUpdateHandler2.close closing DirectUpdateHandler2{commits=1,autocommits=0,soft autocommits=0,optimizes=0,rollbacks=0,expungeDeletes=0,docsPending=0,adds=0,deletesById=0,deletesByQuery=0,errors=0,cumulative_adds=1,cumulative_deletesById=0,cumulative_deletesByQuery=0,cumulative_errors=0}
>> [junit4:junit4]   2> 1087 T3303 oasc.SolrCore.decrefSolrCoreState Closing SolrCoreState
>> [junit4:junit4]   2> 1087 T3303 oasu.DefaultSolrCoreState.closeIndexWriter SolrCoreState ref count has reached 0 - closing IndexWriter
>> [junit4:junit4]   2> 1089 T3303 oasu.DefaultSolrCoreState.closeIndexWriter closing IndexWriter with IndexWriterCloser
>> [junit4:junit4]   2> 1089 T3303 C257 oasc.CachingDirectoryFactory.close Releasing directory:C:\Users\JenkinsSlave\workspace\Lucene-Solr-trunk-Windows\solr\build\solr-core\test\J0\.\solrtest-XmlUpdateRequestHandlerTest-1351614363016\index
>> [junit4:junit4]   2> 1090 T3303 oasc.SolrCore.closeSearcher [collection1] Closing main searcher on request.
>> [junit4:junit4]   2> 1090 T3303 oasc.CachingDirectoryFactory.close Releasing directory:C:\Users\JenkinsSlave\workspace\Lucene-Solr-trunk-Windows\solr\build\solr-core\test\J0\.\solrtest-XmlUpdateRequestHandlerTest-1351614363016\index
>> [junit4:junit4]   2> NOTE: test params are: codec=Lucene41: {timestamp=PostingsFormat(name=Lucene41WithOrds), range_facet_l=PostingsFormat(name=Lucene41WithOrds), id=PostingsFormat(name=SimpleText), range_facet_sl=PostingsFormat(name=Direct), range_facet_si=MockVariableIntBlock(baseBlockSize=34), foo_s=PostingsFormat(name=Lucene41WithOrds), multiDefault=MockVariableIntBlock(baseBlockSize=34), intDefault=PostingsFormat(name=Lucene41WithOrds)}, sim=DefaultSimilarity, locale=mk_MK, timezone=Asia/Sakhalin
>> [junit4:junit4]   2> NOTE: Windows 7 6.1 amd64/Oracle Corporation 1.7.0_07 (64-bit)/cpus=2,threads=1,free=153683832,total=432218112
>> [junit4:junit4]   2> NOTE: All tests run in this JVM: [TestSolrIndexConfig, PreAnalyzedFieldTest, OpenExchangeRatesOrgProviderTest, TestCSVLoader, RequestHandlersTest, TestCharFilters, URLClassifyProcessorTest, LoggingHandlerTest, TestSolrQueryParser, TestNumberUtils, TestSolrDeletionPolicy1, FileUtilsTest, TestPropInjectDefaults, DistributedSpellCheckComponentTest, TestPHPSerializedResponseWriter, SolrCmdDistributorTest, TestStressLucene, DefaultValueUpdateProcessorTest, TestReplicationHandler, XsltUpdateRequestHandlerTest, ZkNodePropsTest, LeaderElectionTest, TestPerFieldSimilarity, DateFieldTest, BasicDistributedZkTest, DocumentAnalysisRequestHandlerTest, TestElisionMultitermQuery, TestSurroundQueryParser, AlternateDirectoryTest, FieldAnalysisRequestHandlerTest, TestLazyCores, TestFaceting, TestIndexSearcher, SuggesterTSTTest, MBeansHandlerTest, TestDefaultSimilarityFactory, TestSolrDeletionPolicy2, TimeZoneUtilsTest, TestQueryTypes, TestReversedWildcardFilterFactory, NoCacheHeaderTest, SpellPossibilityIteratorTest, LeaderElectionIntegrationTest, TestReload, TestSolrCoreProperties, RequiredFieldsTest, TestSort, FileBasedSpellCheckerTest, CoreContainerCoreInitFailuresTest, DistributedTermsComponentTest, TestIBSimilarityFactory, TestSearchPerf, DirectUpdateHandlerOptimizeTest, TestFunctionQuery, JsonLoaderTest, DistributedQueryElevationComponentTest, ResourceLoaderTest, DebugComponentTest, AnalysisAfterCoreReloadTest, TestSuggestSpellingConverter, TestRecovery, TestLFUCache, TestFastLRUCache, FullSolrCloudDistribCmdsTest, TestStressVersions, CSVRequestHandlerTest, TestWordDelimiterFilterFactory, TestLMDirichletSimilarityFactory, AutoCommitTest, PluginInfoTest, SolrRequestParserTest, TestQuerySenderNoQuery, TestPropInject, TestCollationField, StatsComponentTest, BadComponentTest, TestJmxMonitoredMap, DisMaxRequestHandlerTest, TestJoin, SolrInfoMBeanTest, TestDFRSimilarityFactory, CoreAdminHandlerTest, ZkSolrClientTest, RAMDirectoryFactoryTest, BinaryUpdateRequestHandlerTest, TestPhraseSuggestions, MinimalSchemaTest, SearchHandlerTest, TestLuceneMatchVersion, QueryEqualityTest, TestDistributedSearch, TestStressRecovery, StatelessScriptUpdateProcessorFactoryTest, ClusterStateUpdateTest, TestWriterPerf, WordBreakSolrSpellCheckerTest, TestFastOutputStream, TestRandomFaceting, SolrCoreCheckLockOnStartupTest, TestIndexingPerformance, TestUpdate, TestCodecSupport, ClusterStateTest, DocumentBuilderTest, ConvertedLegacyTest, TestCoreContainer, DistanceFunctionTest, SystemInfoHandlerTest, SolrCoreTest, CircularListTest, SpellCheckComponentTest, OverseerTest, RecoveryZkTest, TestRealTimeGet, ZkControllerTest, TestDistributedGrouping, SpellCheckCollatorTest, TestExtendedDismaxParser, SoftAutoCommitTest, BasicZkTest, TestHashPartitioner, IndexBasedSpellCheckerTest, TestRangeQuery, DirectUpdateHandlerTest, TestMultiCoreConfBootstrap, SimpleFacetsTest, LukeRequestHandlerTest, TestGroupingSearch, DirectSolrSpellCheckerTest, TestFiltering, PeerSyncTest, QueryElevationComponentTest, SortByFunctionTest, BasicFunctionalityTest, SignatureUpdateProcessorFactoryTest, TestBinaryResponseWriter, TestJmxIntegration, SampleTest, HighlighterTest, TestTrie, DirectSolrConnectionTest, TestRemoteStreaming, CacheHeaderTest, PolyFieldTest, SpatialFilterTest, TestCSVResponseWriter, MoreLikeThisHandlerTest, CurrencyFieldTest, TestPseudoReturnFields, IndexSchemaTest, QueryParsingTest, TermsComponentTest, StandardRequestHandlerTest, XmlUpdateRequestHandlerTest]
>> [junit4:junit4]   2> NOTE: reproduce with: ant test  -Dtestcase=XmlUpdateRequestHandlerTest -Dtests.seed=ED1A9C533D68A0C3 -Dtests.slow=true -Dtests.locale=mk_MK -Dtests.timezone=Asia/Sakhalin -Dtests.file.encoding=Cp1252
>> [junit4:junit4] ERROR   0.00s | XmlUpdateRequestHandlerTest (suite) <<<
>> [junit4:junit4]    > Throwable #1: junit.framework.AssertionFailedError: Clean up static fields (in @AfterClass?), your test seems to hang on to approximately 11,836,024 bytes (threshold is 10,485,760). Field reference sizes (counted individually):
>> [junit4:junit4]    >   - 12,070,224 bytes, protected static org.apache.solr.handler.UpdateRequestHandler org.apache.solr.handler.XmlUpdateRequestHandlerTest.handler
>> [junit4:junit4]    >   - 3,792 bytes, private static javax.xml.stream.XMLInputFactory org.apache.solr.handler.XmlUpdateRequestHandlerTest.inputFactory
>> [junit4:junit4]    >   - 280 bytes, public static org.junit.rules.TestRule org.apache.solr.SolrTestCaseJ4.solrClassRules
>> [junit4:junit4]    >   - 232 bytes, protected static java.lang.String org.apache.solr.SolrTestCaseJ4.testSolrHome
>> [junit4:junit4]    >   - 128 bytes, private static java.lang.String org.apache.solr.SolrTestCaseJ4.factoryProp
>> [junit4:junit4]    >   - 64 bytes, private static java.lang.String org.apache.solr.SolrTestCaseJ4.coreName
>> [junit4:junit4]    >  at __randomizedtesting.SeedInfo.seed([ED1A9C533D68A0C3]:0)
>> [junit4:junit4]    >  at com.carrotsearch.randomizedtesting.rules.StaticFieldsInvariantRule$1.afterAlways(StaticFieldsInvariantRule.java:127)
>> [junit4:junit4]    >  at com.carrotsearch.randomizedtesting.rules.StatementAdapter.evaluate(StatementAdapter.java:43)
>> [junit4:junit4]    >  at org.apache.lucene.util.TestRuleAssertionsRequired$1.evaluate(TestRuleAssertionsRequired.java:43)
>> [junit4:junit4]    >  at org.apache.lucene.util.TestRuleMarkFailure$1.evaluate(TestRuleMarkFailure.java:48)
>> [junit4:junit4]    >  at org.apache.lucene.util.TestRuleIgnoreAfterMaxFailures$1.evaluate(TestRuleIgnoreAfterMaxFailures.java:70)
>> [junit4:junit4]    >  at org.apache.lucene.util.TestRuleIgnoreTestSuites$1.evaluate(TestRuleIgnoreTestSuites.java:55)
>> [junit4:junit4]    >  at com.carrotsearch.randomizedtesting.rules.StatementAdapter.evaluate(StatementAdapter.java:36)
>> [junit4:junit4]    >  at com.carrotsearch.randomizedtesting.ThreadLeakControl$StatementRunner.run(ThreadLeakControl.java:358)
>> [junit4:junit4]    >  at java.lang.Thread.run(Thread.java:722)
>> [junit4:junit4] Completed in 1.54s, 5 tests, 1 failure <<< FAILURES!
>>
>> [...truncated 232 lines...]
>> BUILD FAILED
>> C:\Users\JenkinsSlave\workspace\Lucene-Solr-trunk-Windows\build.xml:335: The following error occurred while executing this line:
>> C:\Users\JenkinsSlave\workspace\Lucene-Solr-trunk-Windows\build.xml:39: The following error occurred while executing this line:
>> C:\Users\JenkinsSlave\workspace\Lucene-Solr-trunk-Windows\solr\build.xml:178: The following error occurred while executing this line:
>> C:\Users\JenkinsSlave\workspace\Lucene-Solr-trunk-Windows\lucene\module-build.xml:61: The following error occurred while executing this line:
>> C:\Users\JenkinsSlave\workspace\Lucene-Solr-trunk-Windows\lucene\common-build.xml:1159: The following error occurred while executing this line:
>> C:\Users\JenkinsSlave\workspace\Lucene-Solr-trunk-Windows\lucene\common-build.xml:827: There were test failures: 233 suites, 965 tests, 1 suite-level error, 12 ignored (7 assumptions)
>>
>> Total time: 37 minutes 54 seconds
>> Build step 'Invoke Ant' marked build as failure
>> Archiving artifacts
>> Recording test results
>> Description set: Java: 64bit/jdk1.7.0_07 -XX:+UseConcMarkSweepGC
>> Email was triggered for: Failure
>> Sending email for trigger: Failure
>>
>>
>>
>> ---------------------------------------------------------------------
>> To unsubscribe, e-mail: [hidden email]
>> For additional commands, e-mail: [hidden email]
>
>
> ---------------------------------------------------------------------
> To unsubscribe, e-mail: [hidden email]
> For additional commands, e-mail: [hidden email]
>

---------------------------------------------------------------------
To unsubscribe, e-mail: [hidden email]
For additional commands, e-mail: [hidden email]

Reply | Threaded
Open this post in threaded view
|

[JENKINS] Lucene-Solr-trunk-Windows (32bit/jdk1.6.0_35) - Build # 1371 - Still Failing!

Policeman Jenkins Server
In reply to this post by Policeman Jenkins Server
Build: http://jenkins.sd-datasolutions.de/job/Lucene-Solr-trunk-Windows/1371/
Java: 32bit/jdk1.6.0_35 -server -XX:+UseParallelGC

1 tests failed.
REGRESSION:  org.apache.solr.spelling.suggest.SuggesterTSTTest.testRebuild

Error Message:
Exception during query

Stack Trace:
java.lang.RuntimeException: Exception during query
        at __randomizedtesting.SeedInfo.seed([C74E3F67F0A25500:9C6B9D24C4A22F9A]:0)
        at org.apache.solr.SolrTestCaseJ4.assertQ(SolrTestCaseJ4.java:515)
        at org.apache.solr.SolrTestCaseJ4.assertQ(SolrTestCaseJ4.java:482)
        at org.apache.solr.spelling.suggest.SuggesterTest.testRebuild(SuggesterTest.java:105)
        at sun.reflect.NativeMethodAccessorImpl.invoke0(Native Method)
        at sun.reflect.NativeMethodAccessorImpl.invoke(NativeMethodAccessorImpl.java:39)
        at sun.reflect.DelegatingMethodAccessorImpl.invoke(DelegatingMethodAccessorImpl.java:25)
        at java.lang.reflect.Method.invoke(Method.java:597)
        at com.carrotsearch.randomizedtesting.RandomizedRunner.invoke(RandomizedRunner.java:1559)
        at com.carrotsearch.randomizedtesting.RandomizedRunner.access$600(RandomizedRunner.java:79)
        at com.carrotsearch.randomizedtesting.RandomizedRunner$6.evaluate(RandomizedRunner.java:737)
        at com.carrotsearch.randomizedtesting.RandomizedRunner$7.evaluate(RandomizedRunner.java:773)
        at com.carrotsearch.randomizedtesting.RandomizedRunner$8.evaluate(RandomizedRunner.java:787)
        at com.carrotsearch.randomizedtesting.rules.SystemPropertiesRestoreRule$1.evaluate(SystemPropertiesRestoreRule.java:53)
        at org.apache.lucene.util.TestRuleSetupTeardownChained$1.evaluate(TestRuleSetupTeardownChained.java:50)
        at org.apache.lucene.util.TestRuleFieldCacheSanity$1.evaluate(TestRuleFieldCacheSanity.java:51)
        at org.apache.lucene.util.AbstractBeforeAfterRule$1.evaluate(AbstractBeforeAfterRule.java:45)
        at com.carrotsearch.randomizedtesting.rules.SystemPropertiesInvariantRule$1.evaluate(SystemPropertiesInvariantRule.java:55)
        at org.apache.lucene.util.TestRuleThreadAndTestName$1.evaluate(TestRuleThreadAndTestName.java:48)
        at org.apache.lucene.util.TestRuleIgnoreAfterMaxFailures$1.evaluate(TestRuleIgnoreAfterMaxFailures.java:70)
        at org.apache.lucene.util.TestRuleMarkFailure$1.evaluate(TestRuleMarkFailure.java:48)
        at com.carrotsearch.randomizedtesting.rules.StatementAdapter.evaluate(StatementAdapter.java:36)
        at com.carrotsearch.randomizedtesting.ThreadLeakControl$StatementRunner.run(ThreadLeakControl.java:358)
        at com.carrotsearch.randomizedtesting.ThreadLeakControl.forkTimeoutingTask(ThreadLeakControl.java:782)
        at com.carrotsearch.randomizedtesting.ThreadLeakControl$3.evaluate(ThreadLeakControl.java:442)
        at com.carrotsearch.randomizedtesting.RandomizedRunner.runSingleTest(RandomizedRunner.java:746)
        at com.carrotsearch.randomizedtesting.RandomizedRunner$3.evaluate(RandomizedRunner.java:648)
        at com.carrotsearch.randomizedtesting.RandomizedRunner$4.evaluate(RandomizedRunner.java:682)
        at com.carrotsearch.randomizedtesting.RandomizedRunner$5.evaluate(RandomizedRunner.java:693)
        at com.carrotsearch.randomizedtesting.rules.StatementAdapter.evaluate(StatementAdapter.java:36)
        at com.carrotsearch.randomizedtesting.rules.SystemPropertiesRestoreRule$1.evaluate(SystemPropertiesRestoreRule.java:53)
        at org.apache.lucene.util.AbstractBeforeAfterRule$1.evaluate(AbstractBeforeAfterRule.java:45)
        at org.apache.lucene.util.TestRuleStoreClassName$1.evaluate(TestRuleStoreClassName.java:42)
        at com.carrotsearch.randomizedtesting.rules.SystemPropertiesInvariantRule$1.evaluate(SystemPropertiesInvariantRule.java:55)
        at com.carrotsearch.randomizedtesting.rules.NoShadowingOrOverridesOnMethodsRule$1.evaluate(NoShadowingOrOverridesOnMethodsRule.java:39)
        at com.carrotsearch.randomizedtesting.rules.NoShadowingOrOverridesOnMethodsRule$1.evaluate(NoShadowingOrOverridesOnMethodsRule.java:39)
        at com.carrotsearch.randomizedtesting.rules.StatementAdapter.evaluate(StatementAdapter.java:36)
        at org.apache.lucene.util.TestRuleAssertionsRequired$1.evaluate(TestRuleAssertionsRequired.java:43)
        at org.apache.lucene.util.TestRuleMarkFailure$1.evaluate(TestRuleMarkFailure.java:48)
        at org.apache.lucene.util.TestRuleIgnoreAfterMaxFailures$1.evaluate(TestRuleIgnoreAfterMaxFailures.java:70)
        at org.apache.lucene.util.TestRuleIgnoreTestSuites$1.evaluate(TestRuleIgnoreTestSuites.java:55)
        at com.carrotsearch.randomizedtesting.rules.StatementAdapter.evaluate(StatementAdapter.java:36)
        at com.carrotsearch.randomizedtesting.ThreadLeakControl$StatementRunner.run(ThreadLeakControl.java:358)
        at java.lang.Thread.run(Thread.java:662)
Caused by: java.lang.RuntimeException: REQUEST FAILED: xpath=//lst[@name='spellcheck']/lst[@name='suggestions']/lst[@name='ac']/int[@name='numFound'][.='2']
        xml response was: <?xml version="1.0" encoding="UTF-8"?>
<response>
<lst name="responseHeader"><int name="status">0</int><int name="QTime">0</int></lst><lst name="spellcheck"><lst name="suggestions"/></lst>
</response>

        request was:q=ac&spellcheck.count=2&qt=/suggest_tst&spellcheck.onlyMorePopular=true
        at org.apache.solr.SolrTestCaseJ4.assertQ(SolrTestCaseJ4.java:508)
        ... 42 more




Build Log:
[...truncated 8023 lines...]
[junit4:junit4] Suite: org.apache.solr.spelling.suggest.SuggesterTSTTest
[junit4:junit4]   2> 1 T1718 oas.SolrTestCaseJ4.initCore ####initCore
[junit4:junit4]   2> Creating dataDir: C:\Users\JenkinsSlave\workspace\Lucene-Solr-trunk-Windows\solr\build\solr-core\test\J0\.\solrtest-SuggesterTSTTest-1351618641237
[junit4:junit4]   2> 4 T1718 oasc.SolrResourceLoader.<init> new SolrResourceLoader for directory: 'C:\Users\JenkinsSlave\workspace\Lucene-Solr-trunk-Windows\solr\build\solr-core\test-files\solr\collection1\'
[junit4:junit4]   2> 6 T1718 oasc.SolrResourceLoader.replaceClassLoader Adding 'file:/C:/Users/JenkinsSlave/workspace/Lucene-Solr-trunk-Windows/solr/build/solr-core/test-files/solr/collection1/lib/classes/' to classloader
[junit4:junit4]   2> 7 T1718 oasc.SolrResourceLoader.replaceClassLoader Adding 'file:/C:/Users/JenkinsSlave/workspace/Lucene-Solr-trunk-Windows/solr/build/solr-core/test-files/solr/collection1/lib/README' to classloader
[junit4:junit4]   2> 73 T1718 oasc.SolrConfig.<init> Using Lucene MatchVersion: LUCENE_50
[junit4:junit4]   2> 173 T1718 oasc.SolrConfig.<init> Loaded SolrConfig: solrconfig-spellchecker.xml
[junit4:junit4]   2> 174 T1718 oass.IndexSchema.readSchema Reading Solr Schema
[junit4:junit4]   2> 180 T1718 oass.IndexSchema.readSchema Schema name=Solr SpellCheck Test
[junit4:junit4]   2> 221 T1718 oass.IndexSchema.readSchema default search field in schema is text
[junit4:junit4]   2> 223 T1718 oass.IndexSchema.readSchema query parser default operator is OR
[junit4:junit4]   2> 225 T1718 oass.IndexSchema.readSchema unique key field: id
[junit4:junit4]   2> 228 T1718 oasc.SolrResourceLoader.locateSolrHome JNDI not configured for solr (NoInitialContextEx)
[junit4:junit4]   2> 229 T1718 oasc.SolrResourceLoader.locateSolrHome using system property solr.solr.home: C:\Users\JenkinsSlave\workspace\Lucene-Solr-trunk-Windows\solr\build\solr-core\test-files\solr
[junit4:junit4]   2> 229 T1718 oasc.SolrResourceLoader.<init> new SolrResourceLoader for directory: 'C:\Users\JenkinsSlave\workspace\Lucene-Solr-trunk-Windows\solr\build\solr-core\test-files\solr\'
[junit4:junit4]   2> 240 T1718 oasc.CoreContainer.<init> New CoreContainer 28084046
[junit4:junit4]   2> 240 T1718 oasc.SolrCore.<init> [collection1] Opening new SolrCore at C:\Users\JenkinsSlave\workspace\Lucene-Solr-trunk-Windows\solr\build\solr-core\test-files\solr\collection1\, dataDir=C:\Users\JenkinsSlave\workspace\Lucene-Solr-trunk-Windows\solr\build\solr-core\test\J0\.\solrtest-SuggesterTSTTest-1351618641237\
[junit4:junit4]   2> 240 T1718 oasc.SolrCore.<init> JMX monitoring not detected for core: collection1
[junit4:junit4]   2> 241 T1718 oasc.SolrCore.initDirectoryFactory org.apache.solr.core.MockFSDirectoryFactory
[junit4:junit4]   2> 241 T1718 oasc.CachingDirectoryFactory.injectLockFactory WARNING No lockType configured for MockDirWrapper(org.apache.lucene.store.MMapDirectory@C:\Users\JenkinsSlave\workspace\Lucene-Solr-trunk-Windows\solr\build\solr-core\test\J0\solrtest-SuggesterTSTTest-1351618641237 lockFactory=org.apache.lucene.store.NativeFSLockFactory@1e72327) assuming 'simple'
[junit4:junit4]   2> 242 T1718 oasc.CachingDirectoryFactory.get return new directory for C:\Users\JenkinsSlave\workspace\Lucene-Solr-trunk-Windows\solr\build\solr-core\test\J0\.\solrtest-SuggesterTSTTest-1351618641237 forceNew:false
[junit4:junit4]   2> 242 T1718 oasc.CachingDirectoryFactory.close Releasing directory:C:\Users\JenkinsSlave\workspace\Lucene-Solr-trunk-Windows\solr\build\solr-core\test\J0\.\solrtest-SuggesterTSTTest-1351618641237
[junit4:junit4]   2> 242 T1718 oasc.SolrCore.getNewIndexDir New index directory detected: old=null new=C:\Users\JenkinsSlave\workspace\Lucene-Solr-trunk-Windows\solr\build\solr-core\test\J0\.\solrtest-SuggesterTSTTest-1351618641237\index/
[junit4:junit4]   2> 243 T1718 oasc.SolrCore.initIndex WARNING [collection1] Solr index directory 'C:\Users\JenkinsSlave\workspace\Lucene-Solr-trunk-Windows\solr\build\solr-core\test\J0\.\solrtest-SuggesterTSTTest-1351618641237\index' doesn't exist. Creating new index...
[junit4:junit4]   2> 244 T1718 oasc.CachingDirectoryFactory.get return new directory for C:\Users\JenkinsSlave\workspace\Lucene-Solr-trunk-Windows\solr\build\solr-core\test\J0\.\solrtest-SuggesterTSTTest-1351618641237\index forceNew:false
[junit4:junit4]   2> 259 T1718 oasc.SolrDeletionPolicy.onCommit SolrDeletionPolicy.onCommit: commits:num=1
[junit4:junit4]   2> commit{dir=MockDirWrapper(org.apache.lucene.store.SimpleFSDirectory@C:\Users\JenkinsSlave\workspace\Lucene-Solr-trunk-Windows\solr\build\solr-core\test\J0\solrtest-SuggesterTSTTest-1351618641237\index lockFactory=org.apache.lucene.store.NativeFSLockFactory@3da946),segFN=segments_1,generation=1,filenames=[segments_1]
[junit4:junit4]   2> 260 T1718 oasc.SolrDeletionPolicy.updateCommits newest commit = 1[segments_1]
[junit4:junit4]   2> 261 T1718 oasc.CachingDirectoryFactory.close Releasing directory:C:\Users\JenkinsSlave\workspace\Lucene-Solr-trunk-Windows\solr\build\solr-core\test\J0\.\solrtest-SuggesterTSTTest-1351618641237\index
[junit4:junit4]   2> 263 T1718 oasc.RequestHandlers.initHandlersFromConfig created standard: solr.StandardRequestHandler
[junit4:junit4]   2> 265 T1718 oasc.RequestHandlers.initHandlersFromConfig created /suggest: org.apache.solr.handler.component.SearchHandler
[junit4:junit4]   2> 267 T1718 oasc.RequestHandlers.initHandlersFromConfig created /suggest_tst: org.apache.solr.handler.component.SearchHandler
[junit4:junit4]   2> 267 T1718 oasc.RequestHandlers.initHandlersFromConfig created /suggest_fst: org.apache.solr.handler.component.SearchHandler
[junit4:junit4]   2> 268 T1718 oasc.RequestHandlers.initHandlersFromConfig created /suggest_wfst: org.apache.solr.handler.component.SearchHandler
[junit4:junit4]   2> 288 T1718 oasc.CachingDirectoryFactory.close Releasing directory:C:\Users\JenkinsSlave\workspace\Lucene-Solr-trunk-Windows\solr\build\solr-core\test\J0\.\solrtest-SuggesterTSTTest-1351618641237
[junit4:junit4]   2> 291 T1718 oass.SolrIndexSearcher.<init> Opening Searcher@1ea2f96 main
[junit4:junit4]   2> 294 T1718 oasu.CommitTracker.<init> Hard AutoCommit: disabled
[junit4:junit4]   2> 294 T1718 oasu.CommitTracker.<init> Soft AutoCommit: disabled
[junit4:junit4]   2> 294 T1718 oashc.SpellCheckComponent.inform Initializing spell checkers
[junit4:junit4]   2> 295 T1718 oasss.Suggester.init init: {name=suggest,classname=org.apache.solr.spelling.suggest.Suggester,lookupImpl=org.apache.solr.spelling.suggest.jaspell.JaspellLookup,field=suggest,storeDir=suggest,buildOnCommit=true,threshold=0.0}
[junit4:junit4]   2> 295 T1718 oasssj.JaspellLookupFactory.create init: {name=suggest,classname=org.apache.solr.spelling.suggest.Suggester,lookupImpl=org.apache.solr.spelling.suggest.jaspell.JaspellLookup,field=suggest,storeDir=suggest,buildOnCommit=true,threshold=0.0}
[junit4:junit4]   2> 298 T1718 oashc.SpellCheckComponent.inform Registering newSearcher listener for spellchecker: suggest
[junit4:junit4]   2> 300 T1718 oashc.SpellCheckComponent.inform No queryConverter defined, using default converter
[junit4:junit4]   2> 301 T1718 oashc.SpellCheckComponent.inform Initializing spell checkers
[junit4:junit4]   2> 301 T1718 oasss.Suggester.init init: {name=suggest_tst,classname=org.apache.solr.spelling.suggest.Suggester,lookupImpl=org.apache.solr.spelling.suggest.tst.TSTLookup,field=suggest,storeDir=suggest_tst,buildOnCommit=true,threshold=0.0}
[junit4:junit4]   2> 304 T1718 oashc.SpellCheckComponent.inform Registering newSearcher listener for spellchecker: suggest_tst
[junit4:junit4]   2> 305 T1718 oashc.SpellCheckComponent.inform No queryConverter defined, using default converter
[junit4:junit4]   2> 305 T1718 oashc.SpellCheckComponent.inform Initializing spell checkers
[junit4:junit4]   2> 306 T1718 oasss.Suggester.init init: {name=suggest_fst,classname=org.apache.solr.spelling.suggest.Suggester,lookupImpl=org.apache.solr.spelling.suggest.fst.FSTLookup,field=suggest,storeDir=suggest_fst,buildOnCommit=true,weightBuckets=5,exactMatchFirst=true}
[junit4:junit4]   2> 308 T1718 oashc.SpellCheckComponent.inform Registering newSearcher listener for spellchecker: suggest_fst
[junit4:junit4]   2> 309 T1718 oashc.SpellCheckComponent.inform No queryConverter defined, using default converter
[junit4:junit4]   2> 310 T1718 oashc.SpellCheckComponent.inform Initializing spell checkers
[junit4:junit4]   2> 310 T1718 oasss.Suggester.init init: {name=suggest_wfst,classname=org.apache.solr.spelling.suggest.Suggester,lookupImpl=org.apache.solr.spelling.suggest.fst.WFSTLookupFactory,field=suggest,storeDir=suggest_wfst,buildOnCommit=true,exactMatchFirst=true}
[junit4:junit4]   2> 311 T1718 oashc.SpellCheckComponent.inform Registering newSearcher listener for spellchecker: suggest_wfst
[junit4:junit4]   2> 311 T1718 oashc.SpellCheckComponent.inform No queryConverter defined, using default converter
[junit4:junit4]   2> 313 T1718 oashc.HttpShardHandlerFactory.getParameter Setting socketTimeout to: 0
[junit4:junit4]   2> 313 T1718 oashc.HttpShardHandlerFactory.getParameter Setting urlScheme to: http://
[junit4:junit4]   2> 313 T1718 oashc.HttpShardHandlerFactory.getParameter Setting connTimeout to: 0
[junit4:junit4]   2> 313 T1718 oashc.HttpShardHandlerFactory.getParameter Setting maxConnectionsPerHost to: 20
[junit4:junit4]   2> 314 T1718 oashc.HttpShardHandlerFactory.getParameter Setting corePoolSize to: 0
[junit4:junit4]   2> 314 T1718 oashc.HttpShardHandlerFactory.getParameter Setting maximumPoolSize to: 2147483647
[junit4:junit4]   2> 314 T1718 oashc.HttpShardHandlerFactory.getParameter Setting maxThreadIdleTime to: 5
[junit4:junit4]   2> 314 T1718 oashc.HttpShardHandlerFactory.getParameter Setting sizeOfQueue to: -1
[junit4:junit4]   2> 315 T1718 oashc.HttpShardHandlerFactory.getParameter Setting fairnessPolicy to: false
[junit4:junit4]   2> 315 T1718 oascsi.HttpClientUtil.createClient Creating new http client, config:maxConnectionsPerHost=20&maxConnections=10000&socketTimeout=0&connTimeout=0&retry=false
[junit4:junit4]   2> 325 T1718 oasc.CoreContainer.registerCore registering core: collection1
[junit4:junit4]   2> 335 T1718 oas.SolrTestCaseJ4.initCore ####initCore end
[junit4:junit4]   2> 342 T1718 oas.SolrTestCaseJ4.setUp ###Starting testAnalyzer
[junit4:junit4]   2> 343 T1718 oasss.Suggester.init init: {lookupImpl=org.apache.solr.spelling.suggest.tst.TSTLookupFactory}
[junit4:junit4]   2> 343 T1718 oas.SolrTestCaseJ4.tearDown ###Ending testAnalyzer
[junit4:junit4]   2> 347 T1718 oas.SolrTestCaseJ4.setUp ###Starting testRebuild
[junit4:junit4]   2> ASYNC  NEW_CORE C117 name=collection1 org.apache.solr.core.SolrCore@91cdda
[junit4:junit4]   2> 358 T1718 C117 oasc.CachingDirectoryFactory.close Releasing directory:C:\Users\JenkinsSlave\workspace\Lucene-Solr-trunk-Windows\solr\build\solr-core\test\J0\.\solrtest-SuggesterTSTTest-1351618641237
[junit4:junit4]   2> 363 T1718 C117 oasc.SolrDeletionPolicy.onInit SolrDeletionPolicy.onInit: commits:num=1
[junit4:junit4]   2> commit{dir=MockDirWrapper(org.apache.lucene.store.SimpleFSDirectory@C:\Users\JenkinsSlave\workspace\Lucene-Solr-trunk-Windows\solr\build\solr-core\test\J0\solrtest-SuggesterTSTTest-1351618641237\index lockFactory=org.apache.lucene.store.NativeFSLockFactory@3da946),segFN=segments_1,generation=1,filenames=[segments_1]
[junit4:junit4]   2> 366 T1718 C117 oasc.SolrDeletionPolicy.updateCommits newest commit = 1[segments_1]
[junit4:junit4]   2> 369 T1718 C117 UPDATE [collection1] webapp=null path=null params={} {add=[1]} 0 12
[junit4:junit4]   2> 387 T1718 C117 UPDATE [collection1] webapp=null path=null params={} {add=[2]} 0 1
[junit4:junit4]   2> 395 T1718 C117 UPDATE [collection1] webapp=null path=null params={} {add=[3]} 0 2
[junit4:junit4]   2> 402 T1718 C117 oasu.DirectUpdateHandler2.commit start commit{flags=0,_version_=0,optimize=false,openSearcher=true,waitSearcher=true,expungeDeletes=false,softCommit=false}
[junit4:junit4]   2> 419 T1718 C117 oasc.SolrDeletionPolicy.onCommit SolrDeletionPolicy.onCommit: commits:num=2
[junit4:junit4]   2> commit{dir=MockDirWrapper(org.apache.lucene.store.SimpleFSDirectory@C:\Users\JenkinsSlave\workspace\Lucene-Solr-trunk-Windows\solr\build\solr-core\test\J0\solrtest-SuggesterTSTTest-1351618641237\index lockFactory=org.apache.lucene.store.NativeFSLockFactory@3da946),segFN=segments_1,generation=1,filenames=[segments_1]
[junit4:junit4]   2> commit{dir=MockDirWrapper(org.apache.lucene.store.SimpleFSDirectory@C:\Users\JenkinsSlave\workspace\Lucene-Solr-trunk-Windows\solr\build\solr-core\test\J0\solrtest-SuggesterTSTTest-1351618641237\index lockFactory=org.apache.lucene.store.NativeFSLockFactory@3da946),segFN=segments_2,generation=2,filenames=[_0_Lucene41WithOrds_0.tib, _0_NestedPulsing_0.doc, _0.fnm, _0_Lucene41WithOrds_0.doc, _0_Lucene41WithOrds_0.tii, _0_Lucene41WithOrds_0.pos, _0_nrm.cfs, _0_NestedPulsing_0.tip, _0_NestedPulsing_0.tim, _0_NestedPulsing_0.pos, _0_MockRandom_0.sd, _0_MockRandom_0.tip, _0_MockRandom_0.doc, _0_MockRandom_0.pos, _0_nrm.cfe, segments_2, _0.fdx, _0.si, _0_MockRandom_0.tim, _0.fdt]
[junit4:junit4]   2> 420 T1718 C117 oasc.SolrDeletionPolicy.updateCommits newest commit = 2[_0_Lucene41WithOrds_0.tib, _0_NestedPulsing_0.doc, _0.fnm, _0_Lucene41WithOrds_0.doc, _0_Lucene41WithOrds_0.tii, _0_Lucene41WithOrds_0.pos, _0_nrm.cfs, _0_NestedPulsing_0.tip, _0_NestedPulsing_0.tim, _0_NestedPulsing_0.pos, _0_MockRandom_0.sd, _0_MockRandom_0.tip, _0_MockRandom_0.doc, _0_MockRandom_0.pos, _0_nrm.cfe, segments_2, _0.fdx, _0.si, _0_MockRandom_0.tim, _0.fdt]
[junit4:junit4]   2> 420 T1718 C117 oasc.SolrCore.getSearcher WARNING [collection1] PERFORMANCE WARNING: Overlapping onDeckSearchers=2
[junit4:junit4]   2> 422 T1718 C117 oasc.CachingDirectoryFactory.close Releasing directory:C:\Users\JenkinsSlave\workspace\Lucene-Solr-trunk-Windows\solr\build\solr-core\test\J0\.\solrtest-SuggesterTSTTest-1351618641237
[junit4:junit4]   2> 440 T1718 C117 oass.SolrIndexSearcher.<init> Opening Searcher@1ef53c5 main
[junit4:junit4]   2> 440 T1718 C117 oasu.DirectUpdateHandler2.commit end_commit_flush
[junit4:junit4]   2> 442 T1719 oasc.SolrCore.registerSearcher [collection1] Registered new searcher Searcher@1ea2f96 main{StandardDirectoryReader(segments_1:1)}
[junit4:junit4]   2> 442 T1719 oashc.SpellCheckComponent$SpellCheckerListener.newSearcher Loading spell index for spellchecker: suggest
[junit4:junit4]   2> 442 T1719 oasss.Suggester.reload reload()
[junit4:junit4]   2> 443 T1719 oashc.SpellCheckComponent$SpellCheckerListener.newSearcher SEVERE Exception in reloading spell check index for spellchecker: suggest java.io.FileNotFoundException: C:\Users\JenkinsSlave\workspace\Lucene-Solr-trunk-Windows\solr\build\solr-core\test\J0\.\solrtest-SuggesterTSTTest-1351618641237\suggest\jaspell.dat (The system cannot find the file specified)
[junit4:junit4]   2> at java.io.FileInputStream.open(Native Method)
[junit4:junit4]   2> at java.io.FileInputStream.<init>(FileInputStream.java:120)
[junit4:junit4]   2> at org.apache.solr.spelling.suggest.Suggester.reload(Suggester.java:162)
[junit4:junit4]   2> at org.apache.solr.handler.component.SpellCheckComponent$SpellCheckerListener.newSearcher(SpellCheckComponent.java:673)
[junit4:junit4]   2> at org.apache.solr.core.SolrCore$6.call(SolrCore.java:1610)
[junit4:junit4]   2> at java.util.concurrent.FutureTask$Sync.innerRun(FutureTask.java:303)
[junit4:junit4]   2> at java.util.concurrent.FutureTask.run(FutureTask.java:138)
[junit4:junit4]   2> at java.util.concurrent.ThreadPoolExecutor$Worker.runTask(ThreadPoolExecutor.java:886)
[junit4:junit4]   2> at java.util.concurrent.ThreadPoolExecutor$Worker.run(ThreadPoolExecutor.java:908)
[junit4:junit4]   2> at java.lang.Thread.run(Thread.java:662)
[junit4:junit4]   2>
[junit4:junit4]   2> 443 T1719 oashc.SpellCheckComponent$SpellCheckerListener.newSearcher Loading spell index for spellchecker: suggest_tst
[junit4:junit4]   2> 443 T1719 oasss.Suggester.reload reload()
[junit4:junit4]   2> 445 T1719 oashc.SpellCheckComponent$SpellCheckerListener.newSearcher SEVERE Exception in reloading spell check index for spellchecker: suggest_tst java.io.FileNotFoundException: C:\Users\JenkinsSlave\workspace\Lucene-Solr-trunk-Windows\solr\build\solr-core\test\J0\.\solrtest-SuggesterTSTTest-1351618641237\suggest_tst\tst.dat (The system cannot find the file specified)
[junit4:junit4]   2> at java.io.FileInputStream.open(Native Method)
[junit4:junit4]   2> at java.io.FileInputStream.<init>(FileInputStream.java:120)
[junit4:junit4]   2> at org.apache.solr.spelling.suggest.Suggester.reload(Suggester.java:162)
[junit4:junit4]   2> at org.apache.solr.handler.component.SpellCheckComponent$SpellCheckerListener.newSearcher(SpellCheckComponent.java:673)
[junit4:junit4]   2> at org.apache.solr.core.SolrCore$6.call(SolrCore.java:1610)
[junit4:junit4]   2> at java.util.concurrent.FutureTask$Sync.innerRun(FutureTask.java:303)
[junit4:junit4]   2> at java.util.concurrent.FutureTask.run(FutureTask.java:138)
[junit4:junit4]   2> at java.util.concurrent.ThreadPoolExecutor$Worker.runTask(ThreadPoolExecutor.java:886)
[junit4:junit4]   2> at java.util.concurrent.ThreadPoolExecutor$Worker.run(ThreadPoolExecutor.java:908)
[junit4:junit4]   2> at java.lang.Thread.run(Thread.java:662)
[junit4:junit4]   2>
[junit4:junit4]   2> 445 T1719 oashc.SpellCheckComponent$SpellCheckerListener.newSearcher Loading spell index for spellchecker: suggest_fst
[junit4:junit4]   2> 445 T1719 oasss.Suggester.reload reload()
[junit4:junit4]   2> 446 T1719 oashc.SpellCheckComponent$SpellCheckerListener.newSearcher SEVERE Exception in reloading spell check index for spellchecker: suggest_fst java.io.FileNotFoundException: C:\Users\JenkinsSlave\workspace\Lucene-Solr-trunk-Windows\solr\build\solr-core\test\J0\.\solrtest-SuggesterTSTTest-1351618641237\suggest_fst\fst.bin (The system cannot find the file specified)
[junit4:junit4]   2> at java.io.FileInputStream.open(Native Method)
[junit4:junit4]   2> at java.io.FileInputStream.<init>(FileInputStream.java:120)
[junit4:junit4]   2> at org.apache.solr.spelling.suggest.Suggester.reload(Suggester.java:162)
[junit4:junit4]   2> at org.apache.solr.handler.component.SpellCheckComponent$SpellCheckerListener.newSearcher(SpellCheckComponent.java:673)
[junit4:junit4]   2> at org.apache.solr.core.SolrCore$6.call(SolrCore.java:1610)
[junit4:junit4]   2> at java.util.concurrent.FutureTask$Sync.innerRun(FutureTask.java:303)
[junit4:junit4]   2> at java.util.concurrent.FutureTask.run(FutureTask.java:138)
[junit4:junit4]   2> at java.util.concurrent.ThreadPoolExecutor$Worker.runTask(ThreadPoolExecutor.java:886)
[junit4:junit4]   2> at java.util.concurrent.ThreadPoolExecutor$Worker.run(ThreadPoolExecutor.java:908)
[junit4:junit4]   2> at java.lang.Thread.run(Thread.java:662)
[junit4:junit4]   2>
[junit4:junit4]   2> 446 T1719 oashc.SpellCheckComponent$SpellCheckerListener.newSearcher Loading spell index for spellchecker: suggest_wfst
[junit4:junit4]   2> 446 T1719 oasss.Suggester.reload reload()
[junit4:junit4]   2> 447 T1719 oashc.SpellCheckComponent$SpellCheckerListener.newSearcher SEVERE Exception in reloading spell check index for spellchecker: suggest_wfst java.io.FileNotFoundException: C:\Users\JenkinsSlave\workspace\Lucene-Solr-trunk-Windows\solr\build\solr-core\test\J0\.\solrtest-SuggesterTSTTest-1351618641237\suggest_wfst\wfst.bin (The system cannot find the file specified)
[junit4:junit4]   2> at java.io.FileInputStream.open(Native Method)
[junit4:junit4]   2> at java.io.FileInputStream.<init>(FileInputStream.java:120)
[junit4:junit4]   2> at org.apache.solr.spelling.suggest.Suggester.reload(Suggester.java:162)
[junit4:junit4]   2> at org.apache.solr.handler.component.SpellCheckComponent$SpellCheckerListener.newSearcher(SpellCheckComponent.java:673)
[junit4:junit4]   2> at org.apache.solr.core.SolrCore$6.call(SolrCore.java:1610)
[junit4:junit4]   2> at java.util.concurrent.FutureTask$Sync.innerRun(FutureTask.java:303)
[junit4:junit4]   2> at java.util.concurrent.FutureTask.run(FutureTask.java:138)
[junit4:junit4]   2> at java.util.concurrent.ThreadPoolExecutor$Worker.runTask(ThreadPoolExecutor.java:886)
[junit4:junit4]   2> at java.util.concurrent.ThreadPoolExecutor$Worker.run(ThreadPoolExecutor.java:908)
[junit4:junit4]   2> at java.lang.Thread.run(Thread.java:662)
[junit4:junit4]   2>
[junit4:junit4]   2> 448 T1719 oasc.CachingDirectoryFactory.close Releasing directory:C:\Users\JenkinsSlave\workspace\Lucene-Solr-trunk-Windows\solr\build\solr-core\test\J0\.\solrtest-SuggesterTSTTest-1351618641237\index
[junit4:junit4]   2> 448 T1719 oasc.SolrCore.registerSearcher [collection1] Registered new searcher Searcher@1ef53c5 main{StandardDirectoryReader(segments_2:3 _0(5.0):C3)}
[junit4:junit4]   2> 448 T1718 C117 UPDATE [collection1] webapp=null path=null params={} {commit=} 0 46
[junit4:junit4]   2> 455 T1718 C117 REQ [collection1] webapp=null path=null params={q=ac&spellcheck.count=2&qt=/suggest_tst&spellcheck.onlyMorePopular=true} status=0 QTime=0
[junit4:junit4]   2> 458 T1718 oas.SolrTestCaseJ4.assertQ SEVERE REQUEST FAILED: xpath=//lst[@name='spellcheck']/lst[@name='suggestions']/lst[@name='ac']/int[@name='numFound'][.='2']
[junit4:junit4]   2> xml response was: <?xml version="1.0" encoding="UTF-8"?>
[junit4:junit4]   2> <response>
[junit4:junit4]   2> <lst name="responseHeader"><int name="status">0</int><int name="QTime">0</int></lst><lst name="spellcheck"><lst name="suggestions"/></lst>
[junit4:junit4]   2> </response>
[junit4:junit4]   2>
[junit4:junit4]   2> request was:q=ac&spellcheck.count=2&qt=/suggest_tst&spellcheck.onlyMorePopular=true
[junit4:junit4]   2> 460 T1718 oasc.SolrException.log SEVERE REQUEST FAILED: q=ac&spellcheck.count=2&qt=/suggest_tst&spellcheck.onlyMorePopular=true:java.lang.RuntimeException: REQUEST FAILED: xpath=//lst[@name='spellcheck']/lst[@name='suggestions']/lst[@name='ac']/int[@name='numFound'][.='2']
[junit4:junit4]   2> xml response was: <?xml version="1.0" encoding="UTF-8"?>
[junit4:junit4]   2> <response>
[junit4:junit4]   2> <lst name="responseHeader"><int name="status">0</int><int name="QTime">0</int></lst><lst name="spellcheck"><lst name="suggestions"/></lst>
[junit4:junit4]   2> </response>
[junit4:junit4]   2>
[junit4:junit4]   2> request was:q=ac&spellcheck.count=2&qt=/suggest_tst&spellcheck.onlyMorePopular=true
[junit4:junit4]   2> at org.apache.solr.SolrTestCaseJ4.assertQ(SolrTestCaseJ4.java:508)
[junit4:junit4]   2> at org.apache.solr.SolrTestCaseJ4.assertQ(SolrTestCaseJ4.java:482)
[junit4:junit4]   2> at org.apache.solr.spelling.suggest.SuggesterTest.testRebuild(SuggesterTest.java:105)
[junit4:junit4]   2> at sun.reflect.NativeMethodAccessorImpl.invoke0(Native Method)
[junit4:junit4]   2> at sun.reflect.NativeMethodAccessorImpl.invoke(NativeMethodAccessorImpl.java:39)
[junit4:junit4]   2> at sun.reflect.DelegatingMethodAccessorImpl.invoke(DelegatingMethodAccessorImpl.java:25)
[junit4:junit4]   2> at java.lang.reflect.Method.invoke(Method.java:597)
[junit4:junit4]   2> at com.carrotsearch.randomizedtesting.RandomizedRunner.invoke(RandomizedRunner.java:1559)
[junit4:junit4]   2> at com.carrotsearch.randomizedtesting.RandomizedRunner.access$600(RandomizedRunner.java:79)
[junit4:junit4]   2> at com.carrotsearch.randomizedtesting.RandomizedRunner$6.evaluate(RandomizedRunner.java:737)
[junit4:junit4]   2> at com.carrotsearch.randomizedtesting.RandomizedRunner$7.evaluate(RandomizedRunner.java:773)
[junit4:junit4]   2> at com.carrotsearch.randomizedtesting.RandomizedRunner$8.evaluate(RandomizedRunner.java:787)
[junit4:junit4]   2> at com.carrotsearch.randomizedtesting.rules.SystemPropertiesRestoreRule$1.evaluate(SystemPropertiesRestoreRule.java:53)
[junit4:junit4]   2> at org.apache.lucene.util.TestRuleSetupTeardownChained$1.evaluate(TestRuleSetupTeardownChained.java:50)
[junit4:junit4]   2> at org.apache.lucene.util.TestRuleFieldCacheSanity$1.evaluate(TestRuleFieldCacheSanity.java:51)
[junit4:junit4]   2> at org.apache.lucene.util.AbstractBeforeAfterRule$1.evaluate(AbstractBeforeAfterRule.java:45)
[junit4:junit4]   2> at com.carrotsearch.randomizedtesting.rules.SystemPropertiesInvariantRule$1.evaluate(SystemPropertiesInvariantRule.java:55)
[junit4:junit4]   2> at org.apache.lucene.util.TestRuleThreadAndTestName$1.evaluate(TestRuleThreadAndTestName.java:48)
[junit4:junit4]   2> at org.apache.lucene.util.TestRuleIgnoreAfterMaxFailures$1.evaluate(TestRuleIgnoreAfterMaxFailures.java:70)
[junit4:junit4]   2> at org.apache.lucene.util.TestRuleMarkFailure$1.evaluate(TestRuleMarkFailure.java:48)
[junit4:junit4]   2> at com.carrotsearch.randomizedtesting.rules.StatementAdapter.evaluate(StatementAdapter.java:36)
[junit4:junit4]   2> at com.carrotsearch.randomizedtesting.ThreadLeakControl$StatementRunner.run(ThreadLeakControl.java:358)
[junit4:junit4]   2> at com.carrotsearch.randomizedtesting.ThreadLeakControl.forkTimeoutingTask(ThreadLeakControl.java:782)
[junit4:junit4]   2> at com.carrotsearch.randomizedtesting.ThreadLeakControl$3.evaluate(ThreadLeakControl.java:442)
[junit4:junit4]   2> at com.carrotsearch.randomizedtesting.RandomizedRunner.runSingleTest(RandomizedRunner.java:746)
[junit4:junit4]   2> at com.carrotsearch.randomizedtesting.RandomizedRunner$3.evaluate(RandomizedRunner.java:648)
[junit4:junit4]   2> at com.carrotsearch.randomizedtesting.RandomizedRunner$4.evaluate(RandomizedRunner.java:682)
[junit4:junit4]   2> at com.carrotsearch.randomizedtesting.RandomizedRunner$5.evaluate(RandomizedRunner.java:693)
[junit4:junit4]   2> at com.carrotsearch.randomizedtesting.rules.StatementAdapter.evaluate(StatementAdapter.java:36)
[junit4:junit4]   2> at com.carrotsearch.randomizedtesting.rules.SystemPropertiesRestoreRule$1.evaluate(SystemPropertiesRestoreRule.java:53)
[junit4:junit4]   2> at org.apache.lucene.util.AbstractBeforeAfterRule$1.evaluate(AbstractBeforeAfterRule.java:45)
[junit4:junit4]   2> at org.apache.lucene.util.TestRuleStoreClassName$1.evaluate(TestRuleStoreClassName.java:42)
[junit4:junit4]   2> at com.carrotsearch.randomizedtesting.rules.SystemPropertiesInvariantRule$1.evaluate(SystemPropertiesInvariantRule.java:55)
[junit4:junit4]   2> at com.carrotsearch.randomizedtesting.rules.NoShadowingOrOverridesOnMethodsRule$1.evaluate(NoShadowingOrOverridesOnMethodsRule.java:39)
[junit4:junit4]   2> at com.carrotsearch.randomizedtesting.rules.NoShadowingOrOverridesOnMethodsRule$1.evaluate(NoShadowingOrOverridesOnMethodsRule.java:39)
[junit4:junit4]   2> at com.carrotsearch.randomizedtesting.rules.StatementAdapter.evaluate(StatementAdapter.java:36)
[junit4:junit4]   2> at org.apache.lucene.util.TestRuleAssertionsRequired$1.evaluate(TestRuleAssertionsRequired.java:43)
[junit4:junit4]   2> at org.apache.lucene.util.TestRuleMarkFailure$1.evaluate(TestRuleMarkFailure.java:48)
[junit4:junit4]   2> at org.apache.lucene.util.TestRuleIgnoreAfterMaxFailures$1.evaluate(TestRuleIgnoreAfterMaxFailures.java:70)
[junit4:junit4]   2> at org.apache.lucene.util.TestRuleIgnoreTestSuites$1.evaluate(TestRuleIgnoreTestSuites.java:55)
[junit4:junit4]   2> at com.carrotsearch.randomizedtesting.rules.StatementAdapter.evaluate(StatementAdapter.java:36)
[junit4:junit4]   2> at com.carrotsearch.randomizedtesting.ThreadLeakControl$StatementRunner.run(ThreadLeakControl.java:358)
[junit4:junit4]   2> at java.lang.Thread.run(Thread.java:662)
[junit4:junit4]   2>
[junit4:junit4]   2> 462 T1718 oas.SolrTestCaseJ4.tearDown ###Ending testRebuild
[junit4:junit4]   2> NOTE: reproduce with: ant test  -Dtestcase=SuggesterTSTTest -Dtests.method=testRebuild -Dtests.seed=C74E3F67F0A25500 -Dtests.slow=true -Dtests.locale=lv -Dtests.timezone=Asia/Yekaterinburg -Dtests.file.encoding=US-ASCII
[junit4:junit4] ERROR   0.14s | SuggesterTSTTest.testRebuild <<<
[junit4:junit4]    > Throwable #1: java.lang.RuntimeException: Exception during query
[junit4:junit4]    > at __randomizedtesting.SeedInfo.seed([C74E3F67F0A25500:9C6B9D24C4A22F9A]:0)
[junit4:junit4]    > at org.apache.solr.SolrTestCaseJ4.assertQ(SolrTestCaseJ4.java:515)
[junit4:junit4]    > at org.apache.solr.SolrTestCaseJ4.assertQ(SolrTestCaseJ4.java:482)
[junit4:junit4]    > at org.apache.solr.spelling.suggest.SuggesterTest.testRebuild(SuggesterTest.java:105)
[junit4:junit4]    > at sun.reflect.NativeMethodAccessorImpl.invoke0(Native Method)
[junit4:junit4]    > at sun.reflect.NativeMethodAccessorImpl.invoke(NativeMethodAccessorImpl.java:39)
[junit4:junit4]    > at sun.reflect.DelegatingMethodAccessorImpl.invoke(DelegatingMethodAccessorImpl.java:25)
[junit4:junit4]    > at java.lang.reflect.Method.invoke(Method.java:597)
[junit4:junit4]    > at com.carrotsearch.randomizedtesting.RandomizedRunner.invoke(RandomizedRunner.java:1559)
[junit4:junit4]    > at com.carrotsearch.randomizedtesting.RandomizedRunner.access$600(RandomizedRunner.java:79)
[junit4:junit4]    > at com.carrotsearch.randomizedtesting.RandomizedRunner$6.evaluate(RandomizedRunner.java:737)
[junit4:junit4]    > at com.carrotsearch.randomizedtesting.RandomizedRunner$7.evaluate(RandomizedRunner.java:773)
[junit4:junit4]    > at com.carrotsearch.randomizedtesting.RandomizedRunner$8.evaluate(RandomizedRunner.java:787)
[junit4:junit4]    > at com.carrotsearch.randomizedtesting.rules.SystemPropertiesRestoreRule$1.evaluate(SystemPropertiesRestoreRule.java:53)
[junit4:junit4]    > at org.apache.lucene.util.TestRuleSetupTeardownChained$1.evaluate(TestRuleSetupTeardownChained.java:50)
[junit4:junit4]    > at org.apache.lucene.util.TestRuleFieldCacheSanity$1.evaluate(TestRuleFieldCacheSanity.java:51)
[junit4:junit4]    > at org.apache.lucene.util.AbstractBeforeAfterRule$1.evaluate(AbstractBeforeAfterRule.java:45)
[junit4:junit4]    > at com.carrotsearch.randomizedtesting.rules.SystemPropertiesInvariantRule$1.evaluate(SystemPropertiesInvariantRule.java:55)
[junit4:junit4]    > at org.apache.lucene.util.TestRuleThreadAndTestName$1.evaluate(TestRuleThreadAndTestName.java:48)
[junit4:junit4]    > at org.apache.lucene.util.TestRuleIgnoreAfterMaxFailures$1.evaluate(TestRuleIgnoreAfterMaxFailures.java:70)
[junit4:junit4]    > at org.apache.lucene.util.TestRuleMarkFailure$1.evaluate(TestRuleMarkFailure.java:48)
[junit4:junit4]    > at com.carrotsearch.randomizedtesting.rules.StatementAdapter.evaluate(StatementAdapter.java:36)
[junit4:junit4]    > at com.carrotsearch.randomizedtesting.ThreadLeakControl$StatementRunner.run(ThreadLeakControl.java:358)
[junit4:junit4]    > at com.carrotsearch.randomizedtesting.ThreadLeakControl.forkTimeoutingTask(ThreadLeakControl.java:782)
[junit4:junit4]    > at com.carrotsearch.randomizedtesting.ThreadLeakControl$3.evaluate(ThreadLeakControl.java:442)
[junit4:junit4]    > at com.carrotsearch.randomizedtesting.RandomizedRunner.runSingleTest(RandomizedRunner.java:746)
[junit4:junit4]    > at com.carrotsearch.randomizedtesting.RandomizedRunner$3.evaluate(RandomizedRunner.java:648)
[junit4:junit4]    > at com.carrotsearch.randomizedtesting.RandomizedRunner$4.evaluate(RandomizedRunner.java:682)
[junit4:junit4]    > at com.carrotsearch.randomizedtesting.RandomizedRunner$5.evaluate(RandomizedRunner.java:693)
[junit4:junit4]    > at com.carrotsearch.randomizedtesting.rules.StatementAdapter.evaluate(StatementAdapter.java:36)
[junit4:junit4]    > at com.carrotsearch.randomizedtesting.rules.SystemPropertiesRestoreRule$1.evaluate(SystemPropertiesRestoreRule.java:53)
[junit4:junit4]    > at org.apache.lucene.util.AbstractBeforeAfterRule$1.evaluate(AbstractBeforeAfterRule.java:45)
[junit4:junit4]    > at org.apache.lucene.util.TestRuleStoreClassName$1.evaluate(TestRuleStoreClassName.java:42)
[junit4:junit4]    > at com.carrotsearch.randomizedtesting.rules.SystemPropertiesInvariantRule$1.evaluate(SystemPropertiesInvariantRule.java:55)
[junit4:junit4]    > at com.carrotsearch.randomizedtesting.rules.NoShadowingOrOverridesOnMethodsRule$1.evaluate(NoShadowingOrOverridesOnMethodsRule.java:39)
[junit4:junit4]    > at com.carrotsearch.randomizedtesting.rules.NoShadowingOrOverridesOnMethodsRule$1.evaluate(NoShadowingOrOverridesOnMethodsRule.java:39)
[junit4:junit4]    > at com.carrotsearch.randomizedtesting.rules.StatementAdapter.evaluate(StatementAdapter.java:36)
[junit4:junit4]    > at org.apache.lucene.util.TestRuleAssertionsRequired$1.evaluate(TestRuleAssertionsRequired.java:43)
[junit4:junit4]    > at org.apache.lucene.util.TestRuleMarkFailure$1.evaluate(TestRuleMarkFailure.java:48)
[junit4:junit4]    > at org.apache.lucene.util.TestRuleIgnoreAfterMaxFailures$1.evaluate(TestRuleIgnoreAfterMaxFailures.java:70)
[junit4:junit4]    > at org.apache.lucene.util.TestRuleIgnoreTestSuites$1.evaluate(TestRuleIgnoreTestSuites.java:55)
[junit4:junit4]    > at com.carrotsearch.randomizedtesting.rules.StatementAdapter.evaluate(StatementAdapter.java:36)
[junit4:junit4]    > at com.carrotsearch.randomizedtesting.ThreadLeakControl$StatementRunner.run(ThreadLeakControl.java:358)
[junit4:junit4]    > at java.lang.Thread.run(Thread.java:662)
[junit4:junit4]    > Caused by: java.lang.RuntimeException: REQUEST FAILED: xpath=//lst[@name='spellcheck']/lst[@name='suggestions']/lst[@name='ac']/int[@name='numFound'][.='2']
[junit4:junit4]    > xml response was: <?xml version="1.0" encoding="UTF-8"?>
[junit4:junit4]    > <response>
[junit4:junit4]    > <lst name="responseHeader"><int name="status">0</int><int name="QTime">0</int></lst><lst name="spellcheck"><lst name="suggestions"/></lst>
[junit4:junit4]    > </response>
[junit4:junit4]    >
[junit4:junit4]    > request was:q=ac&spellcheck.count=2&qt=/suggest_tst&spellcheck.onlyMorePopular=true
[junit4:junit4]    > at org.apache.solr.SolrTestCaseJ4.assertQ(SolrTestCaseJ4.java:508)
[junit4:junit4]    > ... 42 more
[junit4:junit4]   2> 484 T1718 oas.SolrTestCaseJ4.setUp ###Starting testSuggestions
[junit4:junit4]   2> 490 T1718 C117 UPDATE [collection1] webapp=null path=null params={} {add=[1]} 0 2
[junit4:junit4]   2> 498 T1718 C117 UPDATE [collection1] webapp=null path=null params={} {add=[2]} 0 0
[junit4:junit4]   2> 518 T1718 C117 UPDATE [collection1] webapp=null path=null params={} {add=[3]} 0 1
[junit4:junit4]   2> 525 T1718 C117 oasu.DirectUpdateHandler2.commit start commit{flags=0,_version_=0,optimize=false,openSearcher=true,waitSearcher=true,expungeDeletes=false,softCommit=false}
[junit4:junit4]   2> 593 T1718 C117 oasc.SolrDeletionPolicy.onCommit SolrDeletionPolicy.onCommit: commits:num=2
[junit4:junit4]   2> commit{dir=MockDirWrapper(org.apache.lucene.store.SimpleFSDirectory@C:\Users\JenkinsSlave\workspace\Lucene-Solr-trunk-Windows\solr\build\solr-core\test\J0\solrtest-SuggesterTSTTest-1351618641237\index lockFactory=org.apache.lucene.store.NativeFSLockFactory@3da946),segFN=segments_2,generation=2,filenames=[_0_Lucene41WithOrds_0.tib, _0_NestedPulsing_0.doc, _0.fnm, _0_Lucene41WithOrds_0.doc, _0_Lucene41WithOrds_0.tii, _0_Lucene41WithOrds_0.pos, _0_nrm.cfs, _0_NestedPulsing_0.tip, _0_NestedPulsing_0.tim, _0_NestedPulsing_0.pos, _0_MockRandom_0.sd, _0_MockRandom_0.tip, _0_MockRandom_0.doc, _0_MockRandom_0.pos, _0_nrm.cfe, segments_2, _0.fdx, _0.si, _0_MockRandom_0.tim, _0.fdt]
[junit4:junit4]   2> commit{dir=MockDirWrapper(org.apache.lucene.store.SimpleFSDirectory@C:\Users\JenkinsSlave\workspace\Lucene-Solr-trunk-Windows\solr\build\solr-core\test\J0\solrtest-SuggesterTSTTest-1351618641237\index lockFactory=org.apache.lucene.store.NativeFSLockFactory@3da946),segFN=segments_3,generation=3,filenames=[_1_NestedPulsing_0.tip, _1_nrm.cfs, _1_MockRandom_0.tip, _1_Lucene41WithOrds_0.doc, _1_NestedPulsing_0.pos, _1_Lucene41WithOrds_0.pos, _1_MockRandom_0.sd, _1_MockRandom_0.tim, _1_MockRandom_0.skp, _1.fnm, _1_MockRandom_0.pos, _1_nrm.cfe, _1_NestedPulsing_0.doc, _1.fdx, _1_MockRandom_0.pyl, _1.fdt, _1.si, _1_Lucene41WithOrds_0.tii, _1_Lucene41WithOrds_0.tib, _1_MockRandom_0.doc, _1_MockRandom_0.frq, _1_NestedPulsing_0.tim, segments_3]
[junit4:junit4]   2> 593 T1718 C117 oasc.SolrDeletionPolicy.updateCommits newest commit = 3[_1_NestedPulsing_0.tip, _1_nrm.cfs, _1_MockRandom_0.tip, _1_Lucene41WithOrds_0.doc, _1_NestedPulsing_0.pos, _1_Lucene41WithOrds_0.pos, _1_MockRandom_0.sd, _1_MockRandom_0.tim, _1_MockRandom_0.skp, _1.fnm, _1_MockRandom_0.pos, _1_nrm.cfe, _1_NestedPulsing_0.doc, _1.fdx, _1_MockRandom_0.pyl, _1.fdt, _1.si, _1_Lucene41WithOrds_0.tii, _1_Lucene41WithOrds_0.tib, _1_MockRandom_0.doc, _1_MockRandom_0.frq, _1_NestedPulsing_0.tim, segments_3]
[junit4:junit4]   2> 603 T1718 C117 oasc.CachingDirectoryFactory.close Releasing directory:C:\Users\JenkinsSlave\workspace\Lucene-Solr-trunk-Windows\solr\build\solr-core\test\J0\.\solrtest-SuggesterTSTTest-1351618641237
[junit4:junit4]   2> 625 T1718 C117 oass.SolrIndexSearcher.<init> Opening Searcher@1d3389 main
[junit4:junit4]   2> 627 T1718 C117 oasu.DirectUpdateHandler2.commit end_commit_flush
[junit4:junit4]   2> 628 T1719 oashc.SpellCheckComponent$SpellCheckerListener.buildSpellIndex Building spell index for spell checker: suggest
[junit4:junit4]   2> 628 T1719 oasss.Suggester.build build()
[junit4:junit4]   2> 632 T1719 oasss.Suggester.build Stored suggest data to: C:\Users\JenkinsSlave\workspace\Lucene-Solr-trunk-Windows\solr\build\solr-core\test\J0\.\solrtest-SuggesterTSTTest-1351618641237\suggest\jaspell.dat
[junit4:junit4]   2> 632 T1719 oashc.SpellCheckComponent$SpellCheckerListener.buildSpellIndex Building spell index for spell checker: suggest_tst
[junit4:junit4]   2> 632 T1719 oasss.Suggester.build build()
[junit4:junit4]   2> 648 T1719 oasss.Suggester.build Stored suggest data to: C:\Users\JenkinsSlave\workspace\Lucene-Solr-trunk-Windows\solr\build\solr-core\test\J0\.\solrtest-SuggesterTSTTest-1351618641237\suggest_tst\tst.dat
[junit4:junit4]   2> 649 T1719 oashc.SpellCheckComponent$SpellCheckerListener.buildSpellIndex Building spell index for spell checker: suggest_fst
[junit4:junit4]   2> 649 T1719 oasss.Suggester.build build()
[junit4:junit4]   2> 672 T1719 oasss.Suggester.build Stored suggest data to: C:\Users\JenkinsSlave\workspace\Lucene-Solr-trunk-Windows\solr\build\solr-core\test\J0\.\solrtest-SuggesterTSTTest-1351618641237\suggest_fst\fst.bin
[junit4:junit4]   2> 672 T1719 oashc.SpellCheckComponent$SpellCheckerListener.buildSpellIndex Building spell index for spell checker: suggest_wfst
[junit4:junit4]   2> 672 T1719 oasss.Suggester.build build()
[junit4:junit4]   2> 680 T1719 oasss.Suggester.build Stored suggest data to: C:\Users\JenkinsSlave\workspace\Lucene-Solr-trunk-Windows\solr\build\solr-core\test\J0\.\solrtest-SuggesterTSTTest-1351618641237\suggest_wfst\wfst.bin
[junit4:junit4]   2> 682 T1719 oasc.SolrCore.registerSearcher [collection1] Registered new searcher Searcher@1d3389 main{StandardDirectoryReader(segments_3:7 _1(5.0):C3)}
[junit4:junit4]   2> 682 T1719 oasc.CachingDirectoryFactory.close Releasing directory:C:\Users\JenkinsSlave\workspace\Lucene-Solr-trunk-Windows\solr\build\solr-core\test\J0\.\solrtest-SuggesterTSTTest-1351618641237\index
[junit4:junit4]   2> 682 T1718 C117 UPDATE [collection1] webapp=null path=null params={} {commit=} 0 157
[junit4:junit4]   2> 696 T1718 C117 REQ [collection1] webapp=null path=null params={q=ac&spellcheck.count=2&qt=/suggest_tst&spellcheck.onlyMorePopular=true} status=0 QTime=7
[junit4:junit4]   2> 703 T1718 oas.SolrTestCaseJ4.tearDown ###Ending testSuggestions
[junit4:junit4]   2> 708 T1718 oas.SolrTestCaseJ4.setUp ###Starting testReload
[junit4:junit4]   2> 716 T1718 C117 UPDATE [collection1] webapp=null path=null params={} {add=[1]} 0 3
[junit4:junit4]   2> 723 T1718 C117 UPDATE [collection1] webapp=null path=null params={} {add=[2]} 0 0
[junit4:junit4]   2> 731 T1718 C117 UPDATE [collection1] webapp=null path=null params={} {add=[3]} 0 1
[junit4:junit4]   2> 739 T1718 C117 oasu.DirectUpdateHandler2.commit start commit{flags=0,_version_=0,optimize=false,openSearcher=true,waitSearcher=true,expungeDeletes=false,softCommit=false}
[junit4:junit4]   2> 780 T1718 C117 oasc.SolrDeletionPolicy.onCommit SolrDeletionPolicy.onCommit: commits:num=2
[junit4:junit4]   2> commit{dir=MockDirWrapper(org.apache.lucene.store.SimpleFSDirectory@C:\Users\JenkinsSlave\workspace\Lucene-Solr-trunk-Windows\solr\build\solr-core\test\J0\solrtest-SuggesterTSTTest-1351618641237\index lockFactory=org.apache.lucene.store.NativeFSLockFactory@3da946),segFN=segments_3,generation=3,filenames=[_1_NestedPulsing_0.tip, _1_nrm.cfs, _1_MockRandom_0.tip, _1_Lucene41WithOrds_0.doc, _1_NestedPulsing_0.pos, _1_Lucene41WithOrds_0.pos, _1_MockRandom_0.sd, _1_MockRandom_0.tim, _1_MockRandom_0.skp, _1.fnm, _1_MockRandom_0.pos, _1_nrm.cfe, _1_NestedPulsing_0.doc, _1.fdx, _1_MockRandom_0.pyl, _1.fdt, _1.si, _1_Lucene41WithOrds_0.tii, _1_Lucene41WithOrds_0.tib, _1_MockRandom_0.doc, _1_MockRandom_0.frq, _1_NestedPulsing_0.tim, segments_3]
[junit4:junit4]   2> commit{dir=MockDirWrapper(org.apache.lucene.store.SimpleFSDirectory@C:\Users\JenkinsSlave\workspace\Lucene-Solr-trunk-Windows\solr\build\solr-core\test\J0\solrtest-SuggesterTSTTest-1351618641237\index lockFactory=org.apache.lucene.store.NativeFSLockFactory@3da946),segFN=segments_4,generation=4,filenames=[_2_NestedPulsing_0.tim, _2_Lucene41WithOrds_0.doc, _2.si, _2_Lucene41WithOrds_0.tii, _2_MockRandom_0.tii, _2.fdt, _2_Lucene41WithOrds_0.tib, _2.fdx, _2.fnm, _2_MockRandom_0.sd, _2_nrm.cfe, _2_Lucene41WithOrds_0.pos, _2_NestedPulsing_0.pos, _2_MockRandom_0.tib, _2_MockRandom_0.pos, _2_nrm.cfs, _2_MockRandom_0.doc, _2_NestedPulsing_0.tip, _2_NestedPulsing_0.doc, segments_4]
[junit4:junit4]   2> 781 T1718 C117 oasc.SolrDeletionPolicy.updateCommits newest commit = 4[_2_NestedPulsing_0.tim, _2_Lucene41WithOrds_0.doc, _2.si, _2_Lucene41WithOrds_0.tii, _2_MockRandom_0.tii, _2.fdt, _2_Lucene41WithOrds_0.tib, _2.fdx, _2.fnm, _2_MockRandom_0.sd, _2_nrm.cfe, _2_Lucene41WithOrds_0.pos, _2_NestedPulsing_0.pos, _2_MockRandom_0.tib, _2_MockRandom_0.pos, _2_nrm.cfs, _2_MockRandom_0.doc, _2_NestedPulsing_0.tip, _2_NestedPulsing_0.doc, segments_4]
[junit4:junit4]   2> 793 T1718 C117 oasc.CachingDirectoryFactory.close Releasing directory:C:\Users\JenkinsSlave\workspace\Lucene-Solr-trunk-Windows\solr\build\solr-core\test\J0\.\solrtest-SuggesterTSTTest-1351618641237
[junit4:junit4]   2> 808 T1718 C117 oass.SolrIndexSearcher.<init> Opening Searcher@12bb053 main
[junit4:junit4]   2> 809 T1719 oashc.SpellCheckComponent$SpellCheckerListener.buildSpellIndex Building spell index for spell checker: suggest
[junit4:junit4]   2> 809 T1719 oasss.Suggester.build build()
[junit4:junit4]   2> 809 T1718 C117 oasu.DirectUpdateHandler2.commit end_commit_flush
[junit4:junit4]   2> 817 T1719 oasss.Suggester.build Stored suggest data to: C:\Users\JenkinsSlave\workspace\Lucene-Solr-trunk-Windows\solr\build\solr-core\test\J0\.\solrtest-SuggesterTSTTest-1351618641237\suggest\jaspell.dat
[junit4:junit4]   2> 817 T1719 oashc.SpellCheckComponent$SpellCheckerListener.buildSpellIndex Building spell index for spell checker: suggest_tst
[junit4:junit4]   2> 818 T1719 oasss.Suggester.build build()
[junit4:junit4]   2> 833 T1719 oasss.Suggester.build Stored suggest data to: C:\Users\JenkinsSlave\workspace\Lucene-Solr-trunk-Windows\solr\build\solr-core\test\J0\.\solrtest-SuggesterTSTTest-1351618641237\suggest_tst\tst.dat
[junit4:junit4]   2> 833 T1719 oashc.SpellCheckComponent$SpellCheckerListener.buildSpellIndex Building spell index for spell checker: suggest_fst
[junit4:junit4]   2> 834 T1719 oasss.Suggester.build build()
[junit4:junit4]   2> 854 T1719 oasss.Suggester.build Stored suggest data to: C:\Users\JenkinsSlave\workspace\Lucene-Solr-trunk-Windows\solr\build\solr-core\test\J0\.\solrtest-SuggesterTSTTest-1351618641237\suggest_fst\fst.bin
[junit4:junit4]   2> 854 T1719 oashc.SpellCheckComponent$SpellCheckerListener.buildSpellIndex Building spell index for spell checker: suggest_wfst
[junit4:junit4]   2> 854 T1719 oasss.Suggester.build build()
[junit4:junit4]   2> 871 T1719 oasss.Suggester.build Stored suggest data to: C:\Users\JenkinsSlave\workspace\Lucene-Solr-trunk-Windows\solr\build\solr-core\test\J0\.\solrtest-SuggesterTSTTest-1351618641237\suggest_wfst\wfst.bin
[junit4:junit4]   2> 871 T1719 oasc.SolrCore.registerSearcher [collection1] Registered new searcher Searcher@12bb053 main{StandardDirectoryReader(segments_4:11 _2(5.0):C3)}
[junit4:junit4]   2> 871 T1719 oasc.CachingDirectoryFactory.close Releasing directory:C:\Users\JenkinsSlave\workspace\Lucene-Solr-trunk-Windows\solr\build\solr-core\test\J0\.\solrtest-SuggesterTSTTest-1351618641237\index
[junit4:junit4]   2> 895 T1718 C117 UPDATE [collection1] webapp=null path=null params={} {commit=} 0 157
[junit4:junit4]   2> 900 T1718 oas.SolrTestCaseJ4.deleteCore ###deleteCore
[junit4:junit4]   2> 900 T1718 oasc.CoreContainer.shutdown Shutting down CoreContainer instance=28084046
[junit4:junit4]   2> 902 T1718 oasc.SolrCore.close [collection1]  CLOSING SolrCore org.apache.solr.core.SolrCore@91cdda
[junit4:junit4]   2> 902 T1718 oasu.DirectUpdateHandler2.close closing DirectUpdateHandler2{commits=3,autocommits=0,soft autocommits=0,optimizes=0,rollbacks=0,expungeDeletes=0,docsPending=0,adds=0,deletesById=0,deletesByQuery=0,errors=0,cumulative_adds=9,cumulative_deletesById=0,cumulative_deletesByQuery=0,cumulative_errors=0}
[junit4:junit4]   2> 902 T1718 oasc.SolrCore.decrefSolrCoreState Closing SolrCoreState
[junit4:junit4]   2> 902 T1718 oasu.DefaultSolrCoreState.closeIndexWriter SolrCoreState ref count has reached 0 - closing IndexWriter
[junit4:junit4]   2> 903 T1718 oasu.DefaultSolrCoreState.closeIndexWriter closing IndexWriter with IndexWriterCloser
[junit4:junit4]   2> 916 T1718 C117 oasc.CachingDirectoryFactory.close Releasing directory:C:\Users\JenkinsSlave\workspace\Lucene-Solr-trunk-Windows\solr\build\solr-core\test\J0\.\solrtest-SuggesterTSTTest-1351618641237\index
[junit4:junit4]   2> 918 T1718 oasc.SolrCore.closeSearcher [collection1] Closing main searcher on request.
[junit4:junit4]   2> 918 T1718 oasc.CachingDirectoryFactory.close Releasing directory:C:\Users\JenkinsSlave\workspace\Lucene-Solr-trunk-Windows\solr\build\solr-core\test\J0\.\solrtest-SuggesterTSTTest-1351618641237\index
[junit4:junit4]   2> NOTE: per solr.test.leavedatadir, dataDir will not be removed: C:\Users\JenkinsSlave\workspace\Lucene-Solr-trunk-Windows\solr\build\solr-core\test\J0\.\solrtest-SuggesterTSTTest-1351618641237
[junit4:junit4]   2> 942 T1718 oas.SolrTestCaseJ4.initCore ####initCore
[junit4:junit4]   2> 942 T1718 oasc.SolrResourceLoader.<init> new SolrResourceLoader for directory: 'C:\Users\JenkinsSlave\workspace\Lucene-Solr-trunk-Windows\solr\build\solr-core\test-files\solr\collection1\'
[junit4:junit4]   2> 946 T1718 oasc.SolrResourceLoader.replaceClassLoader Adding 'file:/C:/Users/JenkinsSlave/workspace/Lucene-Solr-trunk-Windows/solr/build/solr-core/test-files/solr/collection1/lib/classes/' to classloader
[junit4:junit4]   2> 947 T1718 oasc.SolrResourceLoader.replaceClassLoader Adding 'file:/C:/Users/JenkinsSlave/workspace/Lucene-Solr-trunk-Windows/solr/build/solr-core/test-files/solr/collection1/lib/README' to classloader
[junit4:junit4]   2> 1011 T1718 oasc.SolrConfig.<init> Using Lucene MatchVersion: LUCENE_50
[junit4:junit4]   2> 1071 T1718 oasc.SolrConfig.<init> Loaded SolrConfig: solrconfig-spellchecker.xml
[junit4:junit4]   2> 1073 T1718 oass.IndexSchema.readSchema Reading Solr Schema
[junit4:junit4]   2> 1081 T1718 oass.IndexSchema.readSchema Schema name=test
[junit4:junit4]   2> 1814 T1718 oass.OpenExchangeRatesOrgProvider.init Initialized with rates=open-exchange-rates.json, refreshInterval=1440.
[junit4:junit4]   2> 1825 T1718 oass.IndexSchema.readSchema default search field in schema is text
[junit4:junit4]   2> 1830 T1718 oass.IndexSchema.readSchema unique key field: id
[junit4:junit4]   2> 1838 T1718 oass.FileExchangeRateProvider.reload Reloading exchange rates from file currency.xml
[junit4:junit4]   2> 1843 T1718 oass.FileExchangeRateProvider.reload Reloading exchange rates from file currency.xml
[junit4:junit4]   2> 1846 T1718 oass.OpenExchangeRatesOrgProvider.reload Reloading exchange rates from open-exchange-rates.json
[junit4:junit4]   2> 1847 T1718 oass.OpenExchangeRatesOrgProvider.reload Reloading exchange rates from open-exchange-rates.json
[junit4:junit4]   2> 1847 T1718 oasc.SolrResourceLoader.locateSolrHome JNDI not configured for solr (NoInitialContextEx)
[junit4:junit4]   2> 1848 T1718 oasc.SolrResourceLoader.locateSolrHome using system property solr.solr.home: C:\Users\JenkinsSlave\workspace\Lucene-Solr-trunk-Windows\solr\build\solr-core\test-files\solr
[junit4:junit4]   2> 1848 T1718 oasc.SolrResourceLoader.<init> new SolrResourceLoader for directory: 'C:\Users\JenkinsSlave\workspace\Lucene-Solr-trunk-Windows\solr\build\solr-core\test-files\solr\'
[junit4:junit4]   2> 1854 T1718 oasc.CoreContainer.<init> New CoreContainer 12251712
[junit4:junit4]   2> 1857 T1718 oasc.SolrCore.<init> [collection1] Opening new SolrCore at C:\Users\JenkinsSlave\workspace\Lucene-Solr-trunk-Windows\solr\build\solr-core\test-files\solr\collection1\, dataDir=C:\Users\JenkinsSlave\workspace\Lucene-Solr-trunk-Windows\solr\build\solr-core\test\J0\.\solrtest-SuggesterTSTTest-1351618641237\
[junit4:junit4]   2> 1857 T1718 oasc.SolrCore.<init> JMX monitoring not detected for core: collection1
[junit4:junit4]   2> 1857 T1718 oasc.SolrCore.initDirectoryFactory org.apache.solr.core.MockFSDirectoryFactory
[junit4:junit4]   2> 1858 T1718 oasc.CachingDirectoryFactory.injectLockFactory WARNING No lockType configured for MockDirWrapper(org.apache.lucene.store.NIOFSDirectory@C:\Users\JenkinsSlave\workspace\Lucene-Solr-trunk-Windows\solr\build\solr-core\test\J0\solrtest-SuggesterTSTTest-1351618641237 lockFactory=org.apache.lucene.store.NativeFSLockFactory@1765daa) assuming 'simple'
[junit4:junit4]   2> 1859 T1718 oasc.CachingDirectoryFactory.get return new directory for C:\Users\JenkinsSlave\workspace\Lucene-Solr-trunk-Windows\solr\build\solr-core\test\J0\.\solrtest-SuggesterTSTTest-1351618641237 forceNew:false
[junit4:junit4]   2> 1859 T1718 oasc.CachingDirectoryFactory.close Releasing directory:C:\Users\JenkinsSlave\workspace\Lucene-Solr-trunk-Windows\solr\build\solr-core\test\J0\.\solrtest-SuggesterTSTTest-1351618641237
[junit4:junit4]   2> 1859 T1718 oasc.SolrCore.getNewIndexDir New index directory detected: old=null new=C:\Users\JenkinsSlave\workspace\Lucene-Solr-trunk-Windows\solr\build\solr-core\test\J0\.\solrtest-SuggesterTSTTest-1351618641237\index/
[junit4:junit4]   2> 1861 T1718 oasc.RequestHandlers.initHandlersFromConfig created standard: solr.StandardRequestHandler
[junit4:junit4]   2> 1863 T1718 oasc.RequestHandlers.initHandlersFromConfig created /suggest: org.apache.solr.handler.component.SearchHandler
[junit4:junit4]   2> 1864 T1718 oasc.RequestHandlers.initHandlersFromConfig created /suggest_tst: org.apache.solr.handler.component.SearchHandler
[junit4:junit4]   2> 1864 T1718 oasc.RequestHandlers.initHandlersFromConfig created /suggest_fst: org.apache.solr.handler.component.SearchHandler
[junit4:junit4]   2> 1865 T1718 oasc.RequestHandlers.initHandlersFromConfig created /suggest_wfst: org.apache.solr.handler.component.SearchHandler
[junit4:junit4]   2> 1869 T1718 oasc.CachingDirectoryFactory.close Releasing directory:C:\Users\JenkinsSlave\workspace\Lucene-Solr-trunk-Windows\solr\build\solr-core\test\J0\.\solrtest-SuggesterTSTTest-1351618641237
[junit4:junit4]   2> 1872 T1718 oasc.CachingDirectoryFactory.get return new directory for C:\Users\JenkinsSlave\workspace\Lucene-Solr-trunk-Windows\solr\build\solr-core\test\J0\.\solrtest-SuggesterTSTTest-1351618641237\index forceNew:false
[junit4:junit4]   2> 1879 T1718 oass.SolrIndexSearcher.<init> Opening Searcher@1e59ecb main
[junit4:junit4]   2> 1880 T1718 oasu.CommitTracker.<init> Hard AutoCommit: disabled
[junit4:junit4]   2> 1880 T1718 oasu.CommitTracker.<init> Soft AutoCommit: disabled
[junit4:junit4]   2> 1881 T1718 oashc.SpellCheckComponent.inform Initializing spell checkers
[junit4:junit4]   2> 1881 T1718 oasss.Suggester.init init: {name=suggest,classname=org.apache.solr.spelling.suggest.Suggester,lookupImpl=org.apache.solr.spelling.suggest.jaspell.JaspellLookup,field=suggest,storeDir=suggest,buildOnCommit=true,threshold=0.0}
[junit4:junit4]   2> 1881 T1718 oasssj.JaspellLookupFactory.create init: {name=suggest,classname=org.apache.solr.spelling.suggest.Suggester,lookupImpl=org.apache.solr.spelling.suggest.jaspell.JaspellLookup,field=suggest,storeDir=suggest,buildOnCommit=true,threshold=0.0}
[junit4:junit4]   2> 1883 T1718 oashc.SpellCheckComponent.inform Registering newSearcher listener for spellchecker: suggest
[junit4:junit4]   2> 1884 T1718 oashc.SpellCheckComponent.inform No queryConverter defined, using default converter
[junit4:junit4]   2> 1884 T1718 oashc.SpellCheckComponent.inform Initializing spell checkers
[junit4:junit4]   2> 1886 T1718 oasss.Suggester.init init: {name=suggest_tst,classname=org.apache.solr.spelling.suggest.Suggester,lookupImpl=org.apache.solr.spelling.suggest.tst.TSTLookup,field=suggest,storeDir=suggest_tst,buildOnCommit=true,threshold=0.0}
[junit4:junit4]   2> 1888 T1718 oashc.SpellCheckComponent.inform Registering newSearcher listener for spellchecker: suggest_tst
[junit4:junit4]   2> 1889 T1718 oashc.SpellCheckComponent.inform No queryConverter defined, using default converter
[junit4:junit4]   2> 1889 T1718 oashc.SpellCheckComponent.inform Initializing spell checkers
[junit4:junit4]   2> 1890 T1718 oasss.Suggester.init init: {name=suggest_fst,classname=org.apache.solr.spelling.suggest.Suggester,lookupImpl=org.apache.solr.spelling.suggest.fst.FSTLookup,field=suggest,storeDir=suggest_fst,buildOnCommit=true,weightBuckets=5,exactMatchFirst=true}
[junit4:junit4]   2> 1892 T1718 oashc.SpellCheckComponent.inform Registering newSearcher listener for spellchecker: suggest_fst
[junit4:junit4]   2> 1892 T1718 oashc.SpellCheckComponent.inform No queryConverter defined, using default converter
[junit4:junit4]   2> 1893 T1718 oashc.SpellCheckComponent.inform Initializing spell checkers
[junit4:junit4]   2> 1893 T1718 oasss.Suggester.init init: {name=suggest_wfst,classname=org.apache.solr.spelling.suggest.Suggester,lookupImpl=org.apache.solr.spelling.suggest.fst.WFSTLookupFactory,field=suggest,storeDir=suggest_wfst,buildOnCommit=true,exactMatchFirst=true}
[junit4:junit4]   2> 1895 T1718 oashc.SpellCheckComponent.inform Registering newSearcher listener for spellchecker: suggest_wfst
[junit4:junit4]   2> 1895 T1718 oashc.SpellCheckComponent.inform No queryConverter defined, using default converter
[junit4:junit4]   2> 1895 T1718 oashc.HttpShardHandlerFactory.getParameter Setting socketTimeout to: 0
[junit4:junit4]   2> 1895 T1718 oashc.HttpShardHandlerFactory.getParameter Setting urlScheme to: http://
[junit4:junit4]   2> 1896 T1718 oashc.HttpShardHandlerFactory.getParameter Setting connTimeout to: 0
[junit4:junit4]   2> 1896 T1718 oashc.HttpShardHandlerFactory.getParameter Setting maxConnectionsPerHost to: 20
[junit4:junit4]   2> 1897 T1718 oashc.HttpShardHandlerFactory.getParameter Setting corePoolSize to: 0
[junit4:junit4]   2> 1897 T1718 oashc.HttpShardHandlerFactory.getParameter Setting maximumPoolSize to: 2147483647
[junit4:junit4]   2> 1897 T1718 oashc.HttpShardHandlerFactory.getParameter Setting maxThreadIdleTime to: 5
[junit4:junit4]   2> 1898 T1718 oashc.HttpShardHandlerFactory.getParameter Setting sizeOfQueue to: -1
[junit4:junit4]   2> 1898 T1718 oashc.HttpShardHandlerFactory.getParameter Setting fairnessPolicy to: false
[junit4:junit4]   2> 1898 T1718 oascsi.HttpClientUtil.createClient Creating new http client, config:maxConnectionsPerHost=20&maxConnections=10000&socketTimeout=0&connTimeout=0&retry=false
[junit4:junit4]   2> 1907 T1720 oasc.SolrCore.registerSearcher [collection1] Registered new searcher Searcher@1e59ecb main{StandardDirectoryReader(segments_4:11 _2(5.0):C3)}
[junit4:junit4]   2> 1907 T1718 oasc.CoreContainer.registerCore registering core: collection1
[junit4:junit4]   2> 1913 T1718 oas.SolrTestCaseJ4.initCore ####initCore end
[junit4:junit4]   2> ASYNC  NEW_CORE C118 name=collection1 org.apache.solr.core.SolrCore@8827f5
[junit4:junit4]   2> 1917 T1718 C118 REQ [collection1] webapp=null path=null params={q=ac&spellcheck.count=2&qt=/suggest_tst&spellcheck.onlyMorePopular=true} status=0 QTime=1
[junit4:junit4]   2> 1924 T1718 oas.SolrTestCaseJ4.tearDown ###Ending testReload
[junit4:junit4]   2> 1925 T1718 oas.SolrTestCaseJ4.deleteCore ###deleteCore
[junit4:junit4]   2> 1925 T1718 oasc.CoreContainer.shutdown Shutting down CoreContainer instance=12251712
[junit4:junit4]   2> 1925 T1718 oasc.SolrCore.close [collection1]  CLOSING SolrCore org.apache.solr.core.SolrCore@8827f5
[junit4:junit4]   2> 1925 T1718 oasu.DirectUpdateHandler2.close closing DirectUpdateHandler2{commits=0,autocommits=0,soft autocommits=0,optimizes=0,rollbacks=0,expungeDeletes=0,docsPending=0,adds=0,deletesById=0,deletesByQuery=0,errors=0,cumulative_adds=0,cumulative_deletesById=0,cumulative_deletesByQuery=0,cumulative_errors=0}
[junit4:junit4]   2> 1926 T1718 oasc.SolrCore.decrefSolrCoreState Closing SolrCoreState
[junit4:junit4]   2> 1926 T1718 oasu.DefaultSolrCoreState.closeIndexWriter SolrCoreState ref count has reached 0 - closing IndexWriter
[junit4:junit4]   2> 1926 T1718 oasu.DefaultSolrCoreState.closeIndexWriter closing IndexWriter with IndexWriterCloser
[junit4:junit4]   2> 1927 T1718 oasc.SolrCore.closeSearcher [collection1] Closing main searcher on request.
[junit4:junit4]   2> 1927 T1718 oasc.CachingDirectoryFactory.close Releasing directory:C:\Users\JenkinsSlave\workspace\Lucene-Solr-trunk-Windows\solr\build\solr-core\test\J0\.\solrtest-SuggesterTSTTest-1351618641237\index
[junit4:junit4]   2> NOTE: test params are: codec=Lucene41: {id=PostingsFormat(name=Lucene41WithOrds), text=PostingsFormat(name=NestedPulsing), suggest=PostingsFormat(name=MockRandom), spell=PostingsFormat(name=MockRandom)}, sim=RandomSimilarityProvider(queryNorm=true,coord=crazy): {}, locale=lv, timezone=Asia/Yekaterinburg
[junit4:junit4]   2> NOTE: Windows 7 6.1 x86/Sun Microsystems Inc. 1.6.0_35 (32-bit)/cpus=2,threads=1,free=92778072,total=276168704
[junit4:junit4]   2> NOTE: All tests run in this JVM: [TestReversedWildcardFilterFactory, PeerSyncTest, SimpleFacetsTest, XsltUpdateRequestHandlerTest, DistanceFunctionTest, SystemInfoHandlerTest, TestIndexSearcher, AutoCommitTest, TermVectorComponentDistributedTest, TestCSVLoader, TestBinaryField, TestSolrIndexConfig, TestFaceting, TestCharFilters, StatelessScriptUpdateProcessorFactoryTest, SoftAutoCommitTest, ZkCLITest, RecoveryZkTest, FileBasedSpellCheckerTest, HighlighterConfigTest, SuggesterFSTTest, TestJoin, StatsComponentTest, RAMDirectoryFactoryTest, UpdateParamsTest, OpenExchangeRatesOrgProviderTest, TestSuggestSpellingConverter, NotRequiredUniqueKeyTest, TestLuceneMatchVersion, TestRealTimeGet, UpdateRequestProcessorFactoryTest, TestUpdate, PathHierarchyTokenizerFactoryTest, SolrCmdDistributorTest, SpellCheckComponentTest, TestRecovery, SampleTest, QueryEqualityTest, TestDistributedSearch, JSONWriterTest, FieldAnalysisRequestHandlerTest, NoCacheHeaderTest, LeaderElectionTest, TestSolrQueryParser, TestDistributedGrouping, CurrencyFieldTest, TestDocumentBuilder, DateFieldTest, WordBreakSolrSpellCheckerTest, TestPHPSerializedResponseWriter, SolrCoreTest, SpellingQueryConverterTest, PrimitiveFieldTypeTest, FullSolrCloudDistribCmdsTest, TestWordDelimiterFilterFactory, TestMergePolicyConfig, TestStressReorder, TestCodecSupport, TestConfig, CircularListTest, SolrCoreCheckLockOnStartupTest, LeaderElectionIntegrationTest, DocumentAnalysisRequestHandlerTest, CSVRequestHandlerTest, IndexSchemaRuntimeFieldTest, TermVectorComponentTest, ShowFileRequestHandlerTest, TestReplicationHandler, TestPhraseSuggestions, TestLazyCores, XmlUpdateRequestHandlerTest, SpellCheckCollatorTest, SuggesterTSTTest]
[junit4:junit4] Completed in 2.05s, 4 tests, 1 error <<< FAILURES!

[...truncated 488 lines...]
BUILD FAILED
C:\Users\JenkinsSlave\workspace\Lucene-Solr-trunk-Windows\build.xml:335: The following error occurred while executing this line:
C:\Users\JenkinsSlave\workspace\Lucene-Solr-trunk-Windows\build.xml:39: The following error occurred while executing this line:
C:\Users\JenkinsSlave\workspace\Lucene-Solr-trunk-Windows\solr\build.xml:178: The following error occurred while executing this line:
C:\Users\JenkinsSlave\workspace\Lucene-Solr-trunk-Windows\lucene\module-build.xml:61: The following error occurred while executing this line:
C:\Users\JenkinsSlave\workspace\Lucene-Solr-trunk-Windows\lucene\common-build.xml:1159: The following error occurred while executing this line:
C:\Users\JenkinsSlave\workspace\Lucene-Solr-trunk-Windows\lucene\common-build.xml:827: There were test failures: 233 suites, 965 tests, 1 error, 12 ignored (7 assumptions)

Total time: 39 minutes 52 seconds
Build step 'Invoke Ant' marked build as failure
Archiving artifacts
Recording test results
Description set: Java: 32bit/jdk1.6.0_35 -server -XX:+UseParallelGC
Email was triggered for: Failure
Sending email for trigger: Failure




---------------------------------------------------------------------
To unsubscribe, e-mail: [hidden email]
For additional commands, e-mail: [hidden email]
Reply | Threaded
Open this post in threaded view
|

Re: [JENKINS] Lucene-Solr-trunk-Windows (64bit/jdk1.7.0_07) - Build # 1370 - Still Failing!

Alan Woodward
In reply to this post by Robert Muir
Thanks, Robert.  I committed that fix.

On 30 Oct 2012, at 17:17, Robert Muir wrote:

> I think it tells you in the exception?
>
> Stack Trace:
> junit.framework.AssertionFailedError: Clean up static fields (in
> @AfterClass?), your test seems to hang on to approximately 11,836,024
> bytes (threshold is 10,485,760). Field reference sizes (counted
> individually):
>  - 12,070,224 bytes, protected static
> org.apache.solr.handler.UpdateRequestHandler
> org.apache.solr.handler.XmlUpdateRequestHandlerTest.handler
>  - 3,792 bytes, private static javax.xml.stream.XMLInputFactory
> org.apache.solr.handler.XmlUpdateRequestHandlerTest.inputFactory
>  - 280 bytes, public static org.junit.rules.TestRule
> org.apache.solr.SolrTestCaseJ4.solrClassRules
>  - 232 bytes, protected static java.lang.String
> org.apache.solr.SolrTestCaseJ4.testSolrHome
>  - 128 bytes, private static java.lang.String
> org.apache.solr.SolrTestCaseJ4.factoryProp
>  - 64 bytes, private static java.lang.String
> org.apache.solr.SolrTestCaseJ4.coreName
>        at __randomizedtesting.SeedInfo.seed([ED1A9C533D68A0C3]:0)
>        at com.carrotsearch.randomizedtesting.rules.StaticFieldsInvariantRule$1.afterAlways(StaticFieldsInvariantRule.java:127)
>        at com.carrotsearch.randomizedtesting.rules.StatementAdapter.evaluate(StatementAdapter.java:43)
>        at org.apache.lucene.util.TestRuleAssertionsRequired$1.evaluate(TestRuleAssertionsRequired.java:43)
>        at org.apache.lucene.util.TestRuleMarkFailure$1.evaluate(TestRuleMarkFailure.java:48)
>        at org.apache.lucene.util.TestRuleIgnoreAfterMaxFailures$1.evaluate(TestRuleIgnoreAfterMaxFailures.java:70)
>        at org.apache.lucene.util.TestRuleIgnoreTestSuites$1.evaluate(TestRuleIgnoreTestSuites.java:55)
>        at com.carrotsearch.randomizedtesting.rules.StatementAdapter.evaluate(StatementAdapter.java:36)
>        at com.carrotsearch.randomizedtesting.ThreadLeakControl$StatementRunner.run(ThreadLeakControl.java:358)
>        at java.lang.Thread.run(Thread.java:722)
>
>
> I would recommend something like this:
> Index: solr/core/src/test/org/apache/solr/handler/XmlUpdateRequestHandlerTest.java
> ===================================================================
> --- solr/core/src/test/org/apache/solr/handler/XmlUpdateRequestHandlerTest.java (revision
> 1403781)
> +++ solr/core/src/test/org/apache/solr/handler/XmlUpdateRequestHandlerTest.java (working
> copy)
> @@ -27,6 +27,7 @@
> import org.apache.solr.update.DeleteUpdateCommand;
> import org.apache.solr.update.processor.BufferingRequestProcessor;
> import org.apache.solr.update.processor.UpdateRequestProcessor;
> +import org.junit.AfterClass;
> import org.junit.BeforeClass;
> import org.junit.Test;
>
> @@ -40,14 +41,21 @@
> import javax.xml.stream.XMLStreamReader;
>
> public class XmlUpdateRequestHandlerTest extends SolrTestCaseJ4 {
> -  private static XMLInputFactory inputFactory = XMLInputFactory.newInstance();
> +  private static XMLInputFactory inputFactory;
>   protected static UpdateRequestHandler handler;
>
>   @BeforeClass
>   public static void beforeTests() throws Exception {
>     initCore("solrconfig.xml","schema.xml");
>     handler = new UpdateRequestHandler();
> +    inputFactory = XMLInputFactory.newInstance();
>   }
> +
> +  @AfterClass
> +  public static void afterTests() throws Exception {
> +    handler = null;
> +    inputFactory = null;
> +  }
>
>   @Test
>   public void testReadDoc() throws Exception
>
>
> On Tue, Oct 30, 2012 at 1:12 PM, Alan Woodward
> <[hidden email]> wrote:
>> I think these failures must be related to the metrics I added in SOLR-1972, which use static fields.  I'm not sure why, though, as the objects involved should be pretty small.
>>
>> Is there a way of getting a more detailed breakdown of which classes/objects are using the memory?
>>
>> On 30 Oct 2012, at 16:30, Policeman Jenkins Server wrote:
>>
>>> Build: http://jenkins.sd-datasolutions.de/job/Lucene-Solr-trunk-Windows/1370/
>>> Java: 64bit/jdk1.7.0_07 -XX:+UseConcMarkSweepGC
>>>
>>> 1 tests failed.
>>> FAILED:  junit.framework.TestSuite.org.apache.solr.handler.XmlUpdateRequestHandlerTest
>>>
>>> Error Message:
>>> Clean up static fields (in @AfterClass?), your test seems to hang on to approximately 11,836,024 bytes (threshold is 10,485,760). Field reference sizes (counted individually):   - 12,070,224 bytes, protected static org.apache.solr.handler.UpdateRequestHandler org.apache.solr.handler.XmlUpdateRequestHandlerTest.handler   - 3,792 bytes, private static javax.xml.stream.XMLInputFactory org.apache.solr.handler.XmlUpdateRequestHandlerTest.inputFactory   - 280 bytes, public static org.junit.rules.TestRule org.apache.solr.SolrTestCaseJ4.solrClassRules   - 232 bytes, protected static java.lang.String org.apache.solr.SolrTestCaseJ4.testSolrHome   - 128 bytes, private static java.lang.String org.apache.solr.SolrTestCaseJ4.factoryProp   - 64 bytes, private static java.lang.String org.apache.solr.SolrTestCaseJ4.coreName
>>>
>>> Stack Trace:
>>> junit.framework.AssertionFailedError: Clean up static fields (in @AfterClass?), your test seems to hang on to approximately 11,836,024 bytes (threshold is 10,485,760). Field reference sizes (counted individually):
>>> - 12,070,224 bytes, protected static org.apache.solr.handler.UpdateRequestHandler org.apache.solr.handler.XmlUpdateRequestHandlerTest.handler
>>> - 3,792 bytes, private static javax.xml.stream.XMLInputFactory org.apache.solr.handler.XmlUpdateRequestHandlerTest.inputFactory
>>> - 280 bytes, public static org.junit.rules.TestRule org.apache.solr.SolrTestCaseJ4.solrClassRules
>>> - 232 bytes, protected static java.lang.String org.apache.solr.SolrTestCaseJ4.testSolrHome
>>> - 128 bytes, private static java.lang.String org.apache.solr.SolrTestCaseJ4.factoryProp
>>> - 64 bytes, private static java.lang.String org.apache.solr.SolrTestCaseJ4.coreName
>>>      at __randomizedtesting.SeedInfo.seed([ED1A9C533D68A0C3]:0)
>>>      at com.carrotsearch.randomizedtesting.rules.StaticFieldsInvariantRule$1.afterAlways(StaticFieldsInvariantRule.java:127)
>>>      at com.carrotsearch.randomizedtesting.rules.StatementAdapter.evaluate(StatementAdapter.java:43)
>>>      at org.apache.lucene.util.TestRuleAssertionsRequired$1.evaluate(TestRuleAssertionsRequired.java:43)
>>>      at org.apache.lucene.util.TestRuleMarkFailure$1.evaluate(TestRuleMarkFailure.java:48)
>>>      at org.apache.lucene.util.TestRuleIgnoreAfterMaxFailures$1.evaluate(TestRuleIgnoreAfterMaxFailures.java:70)
>>>      at org.apache.lucene.util.TestRuleIgnoreTestSuites$1.evaluate(TestRuleIgnoreTestSuites.java:55)
>>>      at com.carrotsearch.randomizedtesting.rules.StatementAdapter.evaluate(StatementAdapter.java:36)
>>>      at com.carrotsearch.randomizedtesting.ThreadLeakControl$StatementRunner.run(ThreadLeakControl.java:358)
>>>      at java.lang.Thread.run(Thread.java:722)
>>>
>>>
>>>
>>>
>>> Build Log:
>>> [...truncated 8847 lines...]
>>> [junit4:junit4] Suite: org.apache.solr.handler.XmlUpdateRequestHandlerTest
>>> [junit4:junit4]   2> 1 T3303 oas.SolrTestCaseJ4.initCore ####initCore
>>> [junit4:junit4]   2> Creating dataDir: C:\Users\JenkinsSlave\workspace\Lucene-Solr-trunk-Windows\solr\build\solr-core\test\J0\.\solrtest-XmlUpdateRequestHandlerTest-1351614363016
>>> [junit4:junit4]   2> 3 T3303 oasc.SolrResourceLoader.<init> new SolrResourceLoader for directory: 'C:\Users\JenkinsSlave\workspace\Lucene-Solr-trunk-Windows\solr\build\solr-core\test-files\solr\collection1\'
>>> [junit4:junit4]   2> 4 T3303 oasc.SolrResourceLoader.replaceClassLoader Adding 'file:/C:/Users/JenkinsSlave/workspace/Lucene-Solr-trunk-Windows/solr/build/solr-core/test-files/solr/collection1/lib/classes/' to classloader
>>> [junit4:junit4]   2> 5 T3303 oasc.SolrResourceLoader.replaceClassLoader Adding 'file:/C:/Users/JenkinsSlave/workspace/Lucene-Solr-trunk-Windows/solr/build/solr-core/test-files/solr/collection1/lib/README' to classloader
>>> [junit4:junit4]   2> 73 T3303 oasc.SolrConfig.<init> Using Lucene MatchVersion: LUCENE_50
>>> [junit4:junit4]   2> 139 T3303 oasc.SolrConfig.<init> Loaded SolrConfig: solrconfig.xml
>>> [junit4:junit4]   2> 140 T3303 oass.IndexSchema.readSchema Reading Solr Schema
>>> [junit4:junit4]   2> 144 T3303 oass.IndexSchema.readSchema Schema name=test
>>> [junit4:junit4]   2> 719 T3303 oass.OpenExchangeRatesOrgProvider.init Initialized with rates=open-exchange-rates.json, refreshInterval=1440.
>>> [junit4:junit4]   2> 732 T3303 oass.IndexSchema.readSchema default search field in schema is text
>>> [junit4:junit4]   2> 738 T3303 oass.IndexSchema.readSchema unique key field: id
>>> [junit4:junit4]   2> 746 T3303 oass.FileExchangeRateProvider.reload Reloading exchange rates from file currency.xml
>>> [junit4:junit4]   2> 751 T3303 oass.FileExchangeRateProvider.reload Reloading exchange rates from file currency.xml
>>> [junit4:junit4]   2> 755 T3303 oass.OpenExchangeRatesOrgProvider.reload Reloading exchange rates from open-exchange-rates.json
>>> [junit4:junit4]   2> 756 T3303 oass.OpenExchangeRatesOrgProvider.reload Reloading exchange rates from open-exchange-rates.json
>>> [junit4:junit4]   2> 756 T3303 oasc.SolrResourceLoader.locateSolrHome JNDI not configured for solr (NoInitialContextEx)
>>> [junit4:junit4]   2> 757 T3303 oasc.SolrResourceLoader.locateSolrHome using system property solr.solr.home: C:\Users\JenkinsSlave\workspace\Lucene-Solr-trunk-Windows\solr\build\solr-core\test-files\solr
>>> [junit4:junit4]   2> 757 T3303 oasc.SolrResourceLoader.<init> new SolrResourceLoader for directory: 'C:\Users\JenkinsSlave\workspace\Lucene-Solr-trunk-Windows\solr\build\solr-core\test-files\solr\'
>>> [junit4:junit4]   2> 768 T3303 oasc.CoreContainer.<init> New CoreContainer 974373728
>>> [junit4:junit4]   2> 768 T3303 oasc.SolrCore.<init> [collection1] Opening new SolrCore at C:\Users\JenkinsSlave\workspace\Lucene-Solr-trunk-Windows\solr\build\solr-core\test-files\solr\collection1\, dataDir=C:\Users\JenkinsSlave\workspace\Lucene-Solr-trunk-Windows\solr\build\solr-core\test\J0\.\solrtest-XmlUpdateRequestHandlerTest-1351614363016\
>>> [junit4:junit4]   2> 769 T3303 oasc.JmxMonitoredMap.<init> JMX monitoring is enabled. Adding Solr mbeans to JMX Server: com.sun.jmx.mbeanserver.JmxMBeanServer@49dbfd4d
>>> [junit4:junit4]   2> 769 T3303 oasc.SolrCore.initDirectoryFactory org.apache.solr.core.MockDirectoryFactory
>>> [junit4:junit4]   2> 770 T3303 oasc.CachingDirectoryFactory.injectLockFactory WARNING No lockType configured for MockDirWrapper(org.apache.lucene.store.RAMDirectory@c25995 lockFactory=org.apache.lucene.store.SingleInstanceLockFactory@57874596) assuming 'simple'
>>> [junit4:junit4]   2> 771 T3303 oasc.CachingDirectoryFactory.get return new directory for C:\Users\JenkinsSlave\workspace\Lucene-Solr-trunk-Windows\solr\build\solr-core\test\J0\.\solrtest-XmlUpdateRequestHandlerTest-1351614363016 forceNew:false
>>> [junit4:junit4]   2> 771 T3303 oasc.CachingDirectoryFactory.close Releasing directory:C:\Users\JenkinsSlave\workspace\Lucene-Solr-trunk-Windows\solr\build\solr-core\test\J0\.\solrtest-XmlUpdateRequestHandlerTest-1351614363016
>>> [junit4:junit4]   2> 771 T3303 oasc.SolrCore.getNewIndexDir New index directory detected: old=null new=C:\Users\JenkinsSlave\workspace\Lucene-Solr-trunk-Windows\solr\build\solr-core\test\J0\.\solrtest-XmlUpdateRequestHandlerTest-1351614363016\index/
>>> [junit4:junit4]   2> 772 T3303 oasc.SolrCore.initIndex WARNING [collection1] Solr index directory 'C:\Users\JenkinsSlave\workspace\Lucene-Solr-trunk-Windows\solr\build\solr-core\test\J0\.\solrtest-XmlUpdateRequestHandlerTest-1351614363016\index' doesn't exist. Creating new index...
>>> [junit4:junit4]   2> 773 T3303 oasc.CachingDirectoryFactory.get return new directory for C:\Users\JenkinsSlave\workspace\Lucene-Solr-trunk-Windows\solr\build\solr-core\test\J0\.\solrtest-XmlUpdateRequestHandlerTest-1351614363016\index forceNew:false
>>> [junit4:junit4]   2> 775 T3303 oasc.SolrDeletionPolicy.onCommit SolrDeletionPolicy.onCommit: commits:num=1
>>> [junit4:junit4]   2>          commit{dir=MockDirWrapper(org.apache.lucene.store.RAMDirectory@54c7d1ee lockFactory=org.apache.lucene.store.NativeFSLockFactory@7dc76c68),segFN=segments_1,generation=1,filenames=[segments_1]
>>> [junit4:junit4]   2> 775 T3303 oasc.SolrDeletionPolicy.updateCommits newest commit = 1[segments_1]
>>> [junit4:junit4]   2> 776 T3303 oasc.CachingDirectoryFactory.close Releasing directory:C:\Users\JenkinsSlave\workspace\Lucene-Solr-trunk-Windows\solr\build\solr-core\test\J0\.\solrtest-XmlUpdateRequestHandlerTest-1351614363016\index
>>> [junit4:junit4]   2> 776 T3303 oasc.SolrCore.initWriters created xml: solr.XMLResponseWriter
>>> [junit4:junit4]   2> 778 T3303 oasup.UpdateRequestProcessorChain.init inserting DistributedUpdateProcessorFactory into updateRequestProcessorChain "dedupe"
>>> [junit4:junit4]   2> 778 T3303 oasup.UpdateRequestProcessorChain.init inserting DistributedUpdateProcessorFactory into updateRequestProcessorChain "dedupe-allfields"
>>> [junit4:junit4]   2> 779 T3303 oasup.UpdateRequestProcessorChain.init inserting DistributedUpdateProcessorFactory into updateRequestProcessorChain "stored_sig"
>>> [junit4:junit4]   2> 779 T3303 oasup.UpdateRequestProcessorChain.init inserting DistributedUpdateProcessorFactory into updateRequestProcessorChain "uniq-fields"
>>> [junit4:junit4]   2> 780 T3303 oasup.UpdateRequestProcessorChain.init inserting DistributedUpdateProcessorFactory into updateRequestProcessorChain "distrib-dup-test-chain-implicit"
>>> [junit4:junit4]   2> 780 T3303 oasc.RequestHandlers.initHandlersFromConfig adding lazy requestHandler: solr.ReplicationHandler
>>> [junit4:junit4]   2> 780 T3303 oasc.RequestHandlers.initHandlersFromConfig created /replication: solr.ReplicationHandler
>>> [junit4:junit4]   2> 781 T3303 oasc.RequestHandlers.initHandlersFromConfig created standard: solr.StandardRequestHandler
>>> [junit4:junit4]   2> 782 T3303 oasc.RequestHandlers.initHandlersFromConfig created /get: solr.RealTimeGetHandler
>>> [junit4:junit4]   2> 783 T3303 oasc.RequestHandlers.initHandlersFromConfig created dismax: solr.SearchHandler
>>> [junit4:junit4]   2> 783 T3303 oasc.RequestHandlers.initHandlersFromConfig created mock: org.apache.solr.core.MockQuerySenderListenerReqHandler
>>> [junit4:junit4]   2> 784 T3303 oasc.RequestHandlers.initHandlersFromConfig created /admin/: org.apache.solr.handler.admin.AdminHandlers
>>> [junit4:junit4]   2> 785 T3303 oasc.RequestHandlers.initHandlersFromConfig created defaults: solr.StandardRequestHandler
>>> [junit4:junit4]   2> 785 T3303 oasc.RequestHandlers.initHandlersFromConfig adding lazy requestHandler: solr.StandardRequestHandler
>>> [junit4:junit4]   2> 785 T3303 oasc.RequestHandlers.initHandlersFromConfig created lazy: solr.StandardRequestHandler
>>> [junit4:junit4]   2> 786 T3303 oasc.RequestHandlers.initHandlersFromConfig created /update: solr.UpdateRequestHandler
>>> [junit4:junit4]   2> 787 T3303 oasc.RequestHandlers.initHandlersFromConfig created /terms: org.apache.solr.handler.component.SearchHandler
>>> [junit4:junit4]   2> 788 T3303 oasc.RequestHandlers.initHandlersFromConfig created spellCheckCompRH: org.apache.solr.handler.component.SearchHandler
>>> [junit4:junit4]   2> 788 T3303 oasc.RequestHandlers.initHandlersFromConfig created spellCheckCompRH_Direct: org.apache.solr.handler.component.SearchHandler
>>> [junit4:junit4]   2> 789 T3303 oasc.RequestHandlers.initHandlersFromConfig created spellCheckWithWordbreak: org.apache.solr.handler.component.SearchHandler
>>> [junit4:junit4]   2> 790 T3303 oasc.RequestHandlers.initHandlersFromConfig created spellCheckWithWordbreak_Direct: org.apache.solr.handler.component.SearchHandler
>>> [junit4:junit4]   2> 791 T3303 oasc.RequestHandlers.initHandlersFromConfig created spellCheckCompRH1: org.apache.solr.handler.component.SearchHandler
>>> [junit4:junit4]   2> 792 T3303 oasc.RequestHandlers.initHandlersFromConfig created tvrh: org.apache.solr.handler.component.SearchHandler
>>> [junit4:junit4]   2> 792 T3303 oasc.RequestHandlers.initHandlersFromConfig created /mlt: solr.MoreLikeThisHandler
>>> [junit4:junit4]   2> 793 T3303 oasc.RequestHandlers.initHandlersFromConfig created /debug/dump: solr.DumpRequestHandler
>>> [junit4:junit4]   2> 804 T3303 oashl.XMLLoader.init xsltCacheLifetimeSeconds=60
>>> [junit4:junit4]   2> 810 T3303 oasc.SolrCore.initDeprecatedSupport WARNING solrconfig.xml uses deprecated <admin/gettableFiles>, Please update your config to use the ShowFileRequestHandler.
>>> [junit4:junit4]   2> 813 T3303 oasc.SolrCore.initDeprecatedSupport WARNING adding ShowFileRequestHandler with hidden files: [THROW.ERROR.ON.ADD.UPDATEPROCESSOR.JS, SOLRCONFIG-HIGHLIGHT.XML, SCHEMA-REQUIRED-FIELDS.XML, TRIVIAL.UPDATEPROCESSOR1.JS, BAD-SCHEMA-DUP-DYNAMICFIELD.XML, SCHEMA-MINIMAL.XML, SCHEMA-REPLICATION2.XML, SOLRCONFIG-CACHING.XML, SOLRCONFIG-REPEATER.XML, CURRENCY.XML, BAD-SCHEMA-NONTEXT-ANALYZER.XML, SOLRCONFIG-MERGEPOLICY.XML, SOLRCONFIG-TLOG.XML, SOLRCONFIG-MASTER.XML, BAD-SCHEMA-UNIQUEKEY-MULTIVALUED.XML, SCHEMA11.XML, SOLRCONFIG-BASIC.XML, DA_COMPOUNDDICTIONARY.TXT, MISSLEADING.EXTENSION.UPDATEPROCESSOR.JS.TXT, SCHEMA-COPYFIELD-TEST.XML, SOLRCONFIG-SLAVE.XML, SOLRCONFIG-PROPINJECT-INDEXDEFAULT.XML, ELEVATE.XML, TRIVIAL.UPDATEPROCESSOR0.JS, BAD-SOLRCONFIG-BOGUS-SCRIPTENGINE-NAME.XML, SCHEMA-CHARFILTERS.XML, SCHEMA-IB.XML, SOLRCONFIG-QUERYSENDER.XML, SOLRCONFIG-SNIPPET-PROCESSOR.XML, DA_UTF8.XML, SCHEMA-REPLICATION1.XML, CONDITIONAL.UPDATEPROCESSOR.JS, MISSING.FUNCTIONS.UPDATEPROCESSOR.JS, HYPHENATION.DTD, SOLRCONFIG-ENABLEPLUGIN.XML, STEMDICT.TXT, SCHEMA-PHRASESUGGEST.XML, HUNSPELL-TEST.AFF, SCHEMA-SNIPPET-TYPE.XML, STOPTYPES-1.TXT, STOPWORDSWRONGENCODING.TXT, SCHEMA-NUMERIC.XML, SOLRCONFIG-TRANSFORMERS.XML, SOLRCONFIG-PROPINJECT.XML, BAD-SCHEMA-NOT-INDEXED-BUT-TF.XML, SOLRCONFIG-SIMPLELOCK.XML, WDFTYPES.TXT, STOPTYPES-2.TXT, SCHEMA-REVERSED.XML, BAD-SCHEMA-CURRENCY-FT-MULTIVALUED.XML, SOLRCONFIG-SPELLCHECKCOMPONENT.XML, SOLRCONFIG-PHRASESUGGEST.XML, BAD-SCHEMA-CURRENCY-MULTIVALUED.XML, SCHEMA-DFR.XML, BAD-SCHEMA-NOT-INDEXED-BUT-POS.XML, KEEP-1.TXT, OPEN-EXCHANGE-RATES.JSON, SCHEMA-SPATIAL.XML, STOPWITHBOM.TXT, SOLRCONFIG-SPELLCHECKER.XML, SCHEMA-BINARYFIELD.XML, SOLRCONFIG-UPDATE-PROCESSOR-CHAINS.XML, BAD-SCHEMA-OMIT-TF-BUT-NOT-POS.XML, BAD-SCHEMA-DUP-FIELDTYPE.XML, SCHEMA-XINCLUDE.XML, SOLRCONFIG-MASTER1.XML, SYNONYMS.TXT, BAD-SCHEMA-CURRENCY-DYNAMIC-MULTIVALUED.XML, SCHEMA.XML, SCHEMA_CODEC.XML, SOLRCONFIG-SOLR-749.XML, SOLRCONFIG-MASTER1-KEEPONEBACKUP.XML, STOP-2.TXT, SOLRCONFIG-FUNCTIONQUERY.XML, SOLRCONFIG-TERMINDEX.XML, SCHEMA-LMDIRICHLET.XML, SOLRCONFIG-ELEVATE.XML, STOPWORDS.TXT, SCHEMA-FOLDING.XML, SCHEMA-STOP-KEEP.XML, BAD-SCHEMA-NOT-INDEXED-BUT-NORMS.XML, SOLRCONFIG-SOLCOREPROPERTIES.XML, STOP-1.TXT, SOLRCONFIG-MASTER2.XML, SCHEMA-SPELLCHECKER.XML, SOLRCONFIG-RESPONSE-LOG-COMPONENT.XML, SOLRCONFIG-LAZYWRITER.XML, SCHEMA-LUCENEMATCHVERSION.XML, FRENCHARTICLES.TXT, BAD-MP-SOLRCONFIG.XML, SCHEMA15.XML, SOLRCONFIG-REQHANDLER.INCL, SCHEMASURROUND.XML, SOLRCONFIG-MASTER3.XML, HUNSPELL-TEST.DIC, SOLRCONFIG-XINCLUDE.XML, BAD-SCHEMA-CODEC-GLOBAL-VS-FT-MISMATCH.XML, SOLRCONFIG-SLAVE1.XML, SOLRCONFIG-DELPOLICY1.XML, SCHEMA-SIM.XML, SCHEMA-SNIPPET-FIELD.XML, SCHEMA-COLLATE.XML, STOP-SNOWBALL.TXT, BAD-SCHEMA-SIM-GLOBAL-VS-FT-MISMATCH.XML, PROTWORDS.TXT, SCHEMA-TRIE.XML, SOLRCONFIG_CODEC.XML, BAD-SOLRCONFIG-INVALID-SCRIPTFILE.XML, JASUGGEST.TXT, SCHEMA-TFIDF.XML, SOLRCONFIG-SCRIPT-UPDATEPROCESSOR.XML, SCHEMA-LMJELINEKMERCER.XML, PHRASESUGGEST.TXT, BAD-SOLRCONFIG-MISSING-SCRIPTFILE.XML, BAD-SCHEMA-UNIQUEKEY-USES-DEFAULT.XML, OLD_SYNONYMS.TXT, SOLRCONFIG-DELPOLICY2.XML, XSLT, SOLRCONFIG-NATIVELOCK.XML, BAD-SCHEMA-DUP-FIELD.XML, SOLRCONFIG-NOCACHE.XML, SCHEMA-BM25.XML, ADDFIELDS.UPDATEPROCESSOR.JS, SOLRCONFIG-QUERYSENDER-NOQUERY.XML, SOLRCONFIG-ALTDIRECTORY.XML, COMPOUNDDICTIONARY.TXT, SOLRCONFIG_PERF.XML, SOLRCONFIG-INDEXCONFIG.XML, BAD-SCHEMA-ANALYZER-CLASS-AND-NESTED.XML, SCHEMA-NOT-REQUIRED-UNIQUE-KEY.XML, KEEP-2.TXT, BAD-SCHEMA-UNIQUEKEY-IS-COPYFIELD-DEST.XML, SCHEMA12.XML, MAPPING-ISOLATIN1ACCENT.TXT, BAD_SOLRCONFIG.XML, BAD-SCHEMA-EXTERNAL-FILEFIELD.XML]
>>> [junit4:junit4]   2> 815 T3303 oasc.CachingDirectoryFactory.close Releasing directory:C:\Users\JenkinsSlave\workspace\Lucene-Solr-trunk-Windows\solr\build\solr-core\test\J0\.\solrtest-XmlUpdateRequestHandlerTest-1351614363016
>>> [junit4:junit4]   2> 815 T3303 oass.SolrIndexSearcher.<init> Opening Searcher@77103877 main
>>> [junit4:junit4]   2> 816 T3303 oasu.CommitTracker.<init> Hard AutoCommit: disabled
>>> [junit4:junit4]   2> 816 T3303 oasu.CommitTracker.<init> Soft AutoCommit: disabled
>>> [junit4:junit4]   2> 817 T3303 oashc.SpellCheckComponent.inform Initializing spell checkers
>>> [junit4:junit4]   2> 827 T3303 oass.DirectSolrSpellChecker.init init: {name=direct,classname=DirectSolrSpellChecker,field=lowerfilt,minQueryLength=3}
>>> [junit4:junit4]   2> 882 T3303 oashc.HttpShardHandlerFactory.getParameter Setting socketTimeout to: 0
>>> [junit4:junit4]   2> 883 T3303 oashc.HttpShardHandlerFactory.getParameter Setting urlScheme to: http://
>>> [junit4:junit4]   2> 883 T3303 oashc.HttpShardHandlerFactory.getParameter Setting connTimeout to: 0
>>> [junit4:junit4]   2> 883 T3303 oashc.HttpShardHandlerFactory.getParameter Setting maxConnectionsPerHost to: 20
>>> [junit4:junit4]   2> 884 T3303 oashc.HttpShardHandlerFactory.getParameter Setting corePoolSize to: 0
>>> [junit4:junit4]   2> 884 T3303 oashc.HttpShardHandlerFactory.getParameter Setting maximumPoolSize to: 2147483647
>>> [junit4:junit4]   2> 884 T3303 oashc.HttpShardHandlerFactory.getParameter Setting maxThreadIdleTime to: 5
>>> [junit4:junit4]   2> 884 T3303 oashc.HttpShardHandlerFactory.getParameter Setting sizeOfQueue to: -1
>>> [junit4:junit4]   2> 884 T3303 oashc.HttpShardHandlerFactory.getParameter Setting fairnessPolicy to: false
>>> [junit4:junit4]   2> 885 T3303 oascsi.HttpClientUtil.createClient Creating new http client, config:maxConnectionsPerHost=20&maxConnections=10000&socketTimeout=0&connTimeout=0&retry=false
>>> [junit4:junit4]   2> 897 T3304 oasc.SolrCore.registerSearcher [collection1] Registered new searcher Searcher@77103877 main{StandardDirectoryReader(segments_1:1)}
>>> [junit4:junit4]   2> 899 T3303 oasc.CoreContainer.registerCore registering core: collection1
>>> [junit4:junit4]   2> 909 T3303 oas.SolrTestCaseJ4.initCore ####initCore end
>>> [junit4:junit4]   2> 913 T3303 oas.SolrTestCaseJ4.setUp ###Starting testNamedEntity
>>> [junit4:junit4]   2> ASYNC  NEW_CORE C257 name=collection1 org.apache.solr.core.SolrCore@677ff169
>>> [junit4:junit4]   2> 1006 T3303 C257 oasc.CachingDirectoryFactory.close Releasing directory:C:\Users\JenkinsSlave\workspace\Lucene-Solr-trunk-Windows\solr\build\solr-core\test\J0\.\solrtest-XmlUpdateRequestHandlerTest-1351614363016
>>> [junit4:junit4]   2> 1010 T3303 C257 oasc.SolrDeletionPolicy.onInit SolrDeletionPolicy.onInit: commits:num=1
>>> [junit4:junit4]   2>          commit{dir=MockDirWrapper(org.apache.lucene.store.RAMDirectory@54c7d1ee lockFactory=org.apache.lucene.store.NativeFSLockFactory@7dc76c68),segFN=segments_1,generation=1,filenames=[segments_1]
>>> [junit4:junit4]   2> 1010 T3303 C257 oasc.SolrDeletionPolicy.updateCommits newest commit = 1[segments_1]
>>> [junit4:junit4]   2> 1011 T3303 C257 UPDATE [collection1] webapp=null path=null params={} {add=[1]} 0 91
>>> [junit4:junit4]   2> 1032 T3303 C257 oasu.DirectUpdateHandler2.commit start commit{flags=0,_version_=0,optimize=false,openSearcher=true,waitSearcher=true,expungeDeletes=false,softCommit=false}
>>> [junit4:junit4]   2> 1035 T3303 C257 oasc.SolrDeletionPolicy.onCommit SolrDeletionPolicy.onCommit: commits:num=2
>>> [junit4:junit4]   2>          commit{dir=MockDirWrapper(org.apache.lucene.store.RAMDirectory@54c7d1ee lockFactory=org.apache.lucene.store.NativeFSLockFactory@7dc76c68),segFN=segments_1,generation=1,filenames=[segments_1]
>>> [junit4:junit4]   2>          commit{dir=MockDirWrapper(org.apache.lucene.store.RAMDirectory@54c7d1ee lockFactory=org.apache.lucene.store.NativeFSLockFactory@7dc76c68),segFN=segments_2,generation=2,filenames=[_0_Lucene41WithOrds_0.tib, _0.fnm, _0_Lucene41WithOrds_0.doc, _0_MockVariableIntBlock_0.doc, _0_Lucene41WithOrds_0.tii, _0_Lucene41WithOrds_0.pos, _0_nrm.cfs, _0_MockVariableIntBlock_0.skp, _0_Direct_0.doc, _0_MockVariableIntBlock_0.pyl, _0_MockVariableIntBlock_0.tib, _0_MockVariableIntBlock_0.frq, _0_SimpleText_0.pst, _0_nrm.cfe, _0_MockVariableIntBlock_0.pos, _0_Direct_0.pos, segments_2, _0.fdx, _0_Direct_0.tip, _0.si, _0_Direct_0.tim, _0.fdt, _0_MockVariableIntBlock_0.tii]
>>> [junit4:junit4]   2> 1035 T3303 C257 oasc.SolrDeletionPolicy.updateCommits newest commit = 2[_0_Lucene41WithOrds_0.tib, _0.fnm, _0_Lucene41WithOrds_0.doc, _0_MockVariableIntBlock_0.doc, _0_Lucene41WithOrds_0.tii, _0_Lucene41WithOrds_0.pos, _0_nrm.cfs, _0_MockVariableIntBlock_0.skp, _0_Direct_0.doc, _0_MockVariableIntBlock_0.pyl, _0_MockVariableIntBlock_0.tib, _0_MockVariableIntBlock_0.frq, _0_SimpleText_0.pst, _0_nrm.cfe, _0_MockVariableIntBlock_0.pos, _0_Direct_0.pos, segments_2, _0.fdx, _0_Direct_0.tip, _0.si, _0_Direct_0.tim, _0.fdt, _0_MockVariableIntBlock_0.tii]
>>> [junit4:junit4]   2> 1036 T3303 C257 oasc.CachingDirectoryFactory.close Releasing directory:C:\Users\JenkinsSlave\workspace\Lucene-Solr-trunk-Windows\solr\build\solr-core\test\J0\.\solrtest-XmlUpdateRequestHandlerTest-1351614363016
>>> [junit4:junit4]   2> 1037 T3303 C257 oass.SolrIndexSearcher.<init> Opening Searcher@4992bebc main
>>> [junit4:junit4]   2> 1037 T3303 C257 oasu.DirectUpdateHandler2.commit end_commit_flush
>>> [junit4:junit4]   2> 1037 T3304 oasc.SolrCore.registerSearcher [collection1] Registered new searcher Searcher@4992bebc main{StandardDirectoryReader(segments_2:3 _0(5.0):C1)}
>>> [junit4:junit4]   2> 1038 T3304 oasc.CachingDirectoryFactory.close Releasing directory:C:\Users\JenkinsSlave\workspace\Lucene-Solr-trunk-Windows\solr\build\solr-core\test\J0\.\solrtest-XmlUpdateRequestHandlerTest-1351614363016\index
>>> [junit4:junit4]   2> 1039 T3303 C257 UPDATE [collection1] webapp=null path=null params={} {commit=} 0 7
>>> [junit4:junit4]   2> 1040 T3303 C257 REQ [collection1] webapp=null path=null params={start=0&q=foo_s:zzz&qt=standard&rows=20&version=2.2} hits=1 status=0 QTime=0
>>> [junit4:junit4]   2> 1042 T3303 oas.SolrTestCaseJ4.tearDown ###Ending testNamedEntity
>>> [junit4:junit4]   2> 1044 T3303 oas.SolrTestCaseJ4.setUp ###Starting testRequestParams
>>> [junit4:junit4]   2> 1051 T3303 oas.SolrTestCaseJ4.tearDown ###Ending testRequestParams
>>> [junit4:junit4]   2> 1056 T3303 oas.SolrTestCaseJ4.setUp ###Starting testReadDelete
>>> [junit4:junit4]   2> 1072 T3303 oas.SolrTestCaseJ4.tearDown ###Ending testReadDelete
>>> [junit4:junit4]   2> 1074 T3303 oas.SolrTestCaseJ4.setUp ###Starting testReadDoc
>>> [junit4:junit4]   2> 1075 T3303 oas.SolrTestCaseJ4.tearDown ###Ending testReadDoc
>>> [junit4:junit4]   2> 1077 T3303 oas.SolrTestCaseJ4.setUp ###Starting testExternalEntities
>>> [junit4:junit4]   2> 1083 T3303 oas.SolrTestCaseJ4.tearDown ###Ending testExternalEntities
>>> [junit4:junit4]   2> 1083 T3303 oas.SolrTestCaseJ4.deleteCore ###deleteCore
>>> [junit4:junit4]   2> 1084 T3303 oasc.CoreContainer.shutdown Shutting down CoreContainer instance=974373728
>>> [junit4:junit4]   2> 1084 T3303 oasc.SolrCore.close [collection1]  CLOSING SolrCore org.apache.solr.core.SolrCore@677ff169
>>> [junit4:junit4]   2> 1087 T3303 oasu.DirectUpdateHandler2.close closing DirectUpdateHandler2{commits=1,autocommits=0,soft autocommits=0,optimizes=0,rollbacks=0,expungeDeletes=0,docsPending=0,adds=0,deletesById=0,deletesByQuery=0,errors=0,cumulative_adds=1,cumulative_deletesById=0,cumulative_deletesByQuery=0,cumulative_errors=0}
>>> [junit4:junit4]   2> 1087 T3303 oasc.SolrCore.decrefSolrCoreState Closing SolrCoreState
>>> [junit4:junit4]   2> 1087 T3303 oasu.DefaultSolrCoreState.closeIndexWriter SolrCoreState ref count has reached 0 - closing IndexWriter
>>> [junit4:junit4]   2> 1089 T3303 oasu.DefaultSolrCoreState.closeIndexWriter closing IndexWriter with IndexWriterCloser
>>> [junit4:junit4]   2> 1089 T3303 C257 oasc.CachingDirectoryFactory.close Releasing directory:C:\Users\JenkinsSlave\workspace\Lucene-Solr-trunk-Windows\solr\build\solr-core\test\J0\.\solrtest-XmlUpdateRequestHandlerTest-1351614363016\index
>>> [junit4:junit4]   2> 1090 T3303 oasc.SolrCore.closeSearcher [collection1] Closing main searcher on request.
>>> [junit4:junit4]   2> 1090 T3303 oasc.CachingDirectoryFactory.close Releasing directory:C:\Users\JenkinsSlave\workspace\Lucene-Solr-trunk-Windows\solr\build\solr-core\test\J0\.\solrtest-XmlUpdateRequestHandlerTest-1351614363016\index
>>> [junit4:junit4]   2> NOTE: test params are: codec=Lucene41: {timestamp=PostingsFormat(name=Lucene41WithOrds), range_facet_l=PostingsFormat(name=Lucene41WithOrds), id=PostingsFormat(name=SimpleText), range_facet_sl=PostingsFormat(name=Direct), range_facet_si=MockVariableIntBlock(baseBlockSize=34), foo_s=PostingsFormat(name=Lucene41WithOrds), multiDefault=MockVariableIntBlock(baseBlockSize=34), intDefault=PostingsFormat(name=Lucene41WithOrds)}, sim=DefaultSimilarity, locale=mk_MK, timezone=Asia/Sakhalin
>>> [junit4:junit4]   2> NOTE: Windows 7 6.1 amd64/Oracle Corporation 1.7.0_07 (64-bit)/cpus=2,threads=1,free=153683832,total=432218112
>>> [junit4:junit4]   2> NOTE: All tests run in this JVM: [TestSolrIndexConfig, PreAnalyzedFieldTest, OpenExchangeRatesOrgProviderTest, TestCSVLoader, RequestHandlersTest, TestCharFilters, URLClassifyProcessorTest, LoggingHandlerTest, TestSolrQueryParser, TestNumberUtils, TestSolrDeletionPolicy1, FileUtilsTest, TestPropInjectDefaults, DistributedSpellCheckComponentTest, TestPHPSerializedResponseWriter, SolrCmdDistributorTest, TestStressLucene, DefaultValueUpdateProcessorTest, TestReplicationHandler, XsltUpdateRequestHandlerTest, ZkNodePropsTest, LeaderElectionTest, TestPerFieldSimilarity, DateFieldTest, BasicDistributedZkTest, DocumentAnalysisRequestHandlerTest, TestElisionMultitermQuery, TestSurroundQueryParser, AlternateDirectoryTest, FieldAnalysisRequestHandlerTest, TestLazyCores, TestFaceting, TestIndexSearcher, SuggesterTSTTest, MBeansHandlerTest, TestDefaultSimilarityFactory, TestSolrDeletionPolicy2, TimeZoneUtilsTest, TestQueryTypes, TestReversedWildcardFilterFactory, NoCacheHeaderTest, SpellPossibilityIteratorTest, LeaderElectionIntegrationTest, TestReload, TestSolrCoreProperties, RequiredFieldsTest, TestSort, FileBasedSpellCheckerTest, CoreContainerCoreInitFailuresTest, DistributedTermsComponentTest, TestIBSimilarityFactory, TestSearchPerf, DirectUpdateHandlerOptimizeTest, TestFunctionQuery, JsonLoaderTest, DistributedQueryElevationComponentTest, ResourceLoaderTest, DebugComponentTest, AnalysisAfterCoreReloadTest, TestSuggestSpellingConverter, TestRecovery, TestLFUCache, TestFastLRUCache, FullSolrCloudDistribCmdsTest, TestStressVersions, CSVRequestHandlerTest, TestWordDelimiterFilterFactory, TestLMDirichletSimilarityFactory, AutoCommitTest, PluginInfoTest, SolrRequestParserTest, TestQuerySenderNoQuery, TestPropInject, TestCollationField, StatsComponentTest, BadComponentTest, TestJmxMonitoredMap, DisMaxRequestHandlerTest, TestJoin, SolrInfoMBeanTest, TestDFRSimilarityFactory, CoreAdminHandlerTest, ZkSolrClientTest, RAMDirectoryFactoryTest, BinaryUpdateRequestHandlerTest, TestPhraseSuggestions, MinimalSchemaTest, SearchHandlerTest, TestLuceneMatchVersion, QueryEqualityTest, TestDistributedSearch, TestStressRecovery, StatelessScriptUpdateProcessorFactoryTest, ClusterStateUpdateTest, TestWriterPerf, WordBreakSolrSpellCheckerTest, TestFastOutputStream, TestRandomFaceting, SolrCoreCheckLockOnStartupTest, TestIndexingPerformance, TestUpdate, TestCodecSupport, ClusterStateTest, DocumentBuilderTest, ConvertedLegacyTest, TestCoreContainer, DistanceFunctionTest, SystemInfoHandlerTest, SolrCoreTest, CircularListTest, SpellCheckComponentTest, OverseerTest, RecoveryZkTest, TestRealTimeGet, ZkControllerTest, TestDistributedGrouping, SpellCheckCollatorTest, TestExtendedDismaxParser, SoftAutoCommitTest, BasicZkTest, TestHashPartitioner, IndexBasedSpellCheckerTest, TestRangeQuery, DirectUpdateHandlerTest, TestMultiCoreConfBootstrap, SimpleFacetsTest, LukeRequestHandlerTest, TestGroupingSearch, DirectSolrSpellCheckerTest, TestFiltering, PeerSyncTest, QueryElevationComponentTest, SortByFunctionTest, BasicFunctionalityTest, SignatureUpdateProcessorFactoryTest, TestBinaryResponseWriter, TestJmxIntegration, SampleTest, HighlighterTest, TestTrie, DirectSolrConnectionTest, TestRemoteStreaming, CacheHeaderTest, PolyFieldTest, SpatialFilterTest, TestCSVResponseWriter, MoreLikeThisHandlerTest, CurrencyFieldTest, TestPseudoReturnFields, IndexSchemaTest, QueryParsingTest, TermsComponentTest, StandardRequestHandlerTest, XmlUpdateRequestHandlerTest]
>>> [junit4:junit4]   2> NOTE: reproduce with: ant test  -Dtestcase=XmlUpdateRequestHandlerTest -Dtests.seed=ED1A9C533D68A0C3 -Dtests.slow=true -Dtests.locale=mk_MK -Dtests.timezone=Asia/Sakhalin -Dtests.file.encoding=Cp1252
>>> [junit4:junit4] ERROR   0.00s | XmlUpdateRequestHandlerTest (suite) <<<
>>> [junit4:junit4]    > Throwable #1: junit.framework.AssertionFailedError: Clean up static fields (in @AfterClass?), your test seems to hang on to approximately 11,836,024 bytes (threshold is 10,485,760). Field reference sizes (counted individually):
>>> [junit4:junit4]    >   - 12,070,224 bytes, protected static org.apache.solr.handler.UpdateRequestHandler org.apache.solr.handler.XmlUpdateRequestHandlerTest.handler
>>> [junit4:junit4]    >   - 3,792 bytes, private static javax.xml.stream.XMLInputFactory org.apache.solr.handler.XmlUpdateRequestHandlerTest.inputFactory
>>> [junit4:junit4]    >   - 280 bytes, public static org.junit.rules.TestRule org.apache.solr.SolrTestCaseJ4.solrClassRules
>>> [junit4:junit4]    >   - 232 bytes, protected static java.lang.String org.apache.solr.SolrTestCaseJ4.testSolrHome
>>> [junit4:junit4]    >   - 128 bytes, private static java.lang.String org.apache.solr.SolrTestCaseJ4.factoryProp
>>> [junit4:junit4]    >   - 64 bytes, private static java.lang.String org.apache.solr.SolrTestCaseJ4.coreName
>>> [junit4:junit4]    >  at __randomizedtesting.SeedInfo.seed([ED1A9C533D68A0C3]:0)
>>> [junit4:junit4]    >  at com.carrotsearch.randomizedtesting.rules.StaticFieldsInvariantRule$1.afterAlways(StaticFieldsInvariantRule.java:127)
>>> [junit4:junit4]    >  at com.carrotsearch.randomizedtesting.rules.StatementAdapter.evaluate(StatementAdapter.java:43)
>>> [junit4:junit4]    >  at org.apache.lucene.util.TestRuleAssertionsRequired$1.evaluate(TestRuleAssertionsRequired.java:43)
>>> [junit4:junit4]    >  at org.apache.lucene.util.TestRuleMarkFailure$1.evaluate(TestRuleMarkFailure.java:48)
>>> [junit4:junit4]    >  at org.apache.lucene.util.TestRuleIgnoreAfterMaxFailures$1.evaluate(TestRuleIgnoreAfterMaxFailures.java:70)
>>> [junit4:junit4]    >  at org.apache.lucene.util.TestRuleIgnoreTestSuites$1.evaluate(TestRuleIgnoreTestSuites.java:55)
>>> [junit4:junit4]    >  at com.carrotsearch.randomizedtesting.rules.StatementAdapter.evaluate(StatementAdapter.java:36)
>>> [junit4:junit4]    >  at com.carrotsearch.randomizedtesting.ThreadLeakControl$StatementRunner.run(ThreadLeakControl.java:358)
>>> [junit4:junit4]    >  at java.lang.Thread.run(Thread.java:722)
>>> [junit4:junit4] Completed in 1.54s, 5 tests, 1 failure <<< FAILURES!
>>>
>>> [...truncated 232 lines...]
>>> BUILD FAILED
>>> C:\Users\JenkinsSlave\workspace\Lucene-Solr-trunk-Windows\build.xml:335: The following error occurred while executing this line:
>>> C:\Users\JenkinsSlave\workspace\Lucene-Solr-trunk-Windows\build.xml:39: The following error occurred while executing this line:
>>> C:\Users\JenkinsSlave\workspace\Lucene-Solr-trunk-Windows\solr\build.xml:178: The following error occurred while executing this line:
>>> C:\Users\JenkinsSlave\workspace\Lucene-Solr-trunk-Windows\lucene\module-build.xml:61: The following error occurred while executing this line:
>>> C:\Users\JenkinsSlave\workspace\Lucene-Solr-trunk-Windows\lucene\common-build.xml:1159: The following error occurred while executing this line:
>>> C:\Users\JenkinsSlave\workspace\Lucene-Solr-trunk-Windows\lucene\common-build.xml:827: There were test failures: 233 suites, 965 tests, 1 suite-level error, 12 ignored (7 assumptions)
>>>
>>> Total time: 37 minutes 54 seconds
>>> Build step 'Invoke Ant' marked build as failure
>>> Archiving artifacts
>>> Recording test results
>>> Description set: Java: 64bit/jdk1.7.0_07 -XX:+UseConcMarkSweepGC
>>> Email was triggered for: Failure
>>> Sending email for trigger: Failure
>>>
>>>
>>>
>>> ---------------------------------------------------------------------
>>> To unsubscribe, e-mail: [hidden email]
>>> For additional commands, e-mail: [hidden email]
>>
>>
>> ---------------------------------------------------------------------
>> To unsubscribe, e-mail: [hidden email]
>> For additional commands, e-mail: [hidden email]
>>
>
> ---------------------------------------------------------------------
> To unsubscribe, e-mail: [hidden email]
> For additional commands, e-mail: [hidden email]
>


---------------------------------------------------------------------
To unsubscribe, e-mail: [hidden email]
For additional commands, e-mail: [hidden email]

Reply | Threaded
Open this post in threaded view
|

Re: [JENKINS] Lucene-Solr-trunk-Windows (64bit/jdk1.7.0_07) - Build # 1370 - Still Failing!

Dawid Weiss
In reply to this post by Alan Woodward
Sorry for chiming in a bit late, Alan --

> I think these failures must be related to the metrics I added in SOLR-1972, which use static fields.  I'm not sure why, though, as the objects involved should be pretty small.

it's very likely that something indirectly reachable from that
reference holds to a Thread instance; from there it gets nasty because
of thread locals etc.

> Is there a way of getting a more detailed breakdown of which classes/objects are using the memory?

Yes and no. You could dump it with a method like this one:
https://github.com/dweiss/java-sizeof/blob/master/src/main/java/com/carrotsearch/sizeof/ObjectTree.java#L31

but it typically is pretty noisy -- that's why I decided not to
include it by default. Use @BeforeClass and @AfterClass to clean up
static fields; this is what these hooks are for. Arguably, if you
leave statics around they're indeed a potential memory leak.

Dawid

---------------------------------------------------------------------
To unsubscribe, e-mail: [hidden email]
For additional commands, e-mail: [hidden email]