[JENKINS] Lucene-Solr-trunk-Windows (64bit/jdk1.8.0_45) - Build # 4979 - Failure!

classic Classic list List threaded Threaded
2 messages Options
Reply | Threaded
Open this post in threaded view
|

[JENKINS] Lucene-Solr-trunk-Windows (64bit/jdk1.8.0_45) - Build # 4979 - Failure!

Policeman Jenkins Server-2
Build: http://jenkins.thetaphi.de/job/Lucene-Solr-trunk-Windows/4979/
Java: 64bit/jdk1.8.0_45 -XX:-UseCompressedOops -XX:+UseConcMarkSweepGC

1 tests failed.
FAILED:  org.apache.solr.cloud.TestRandomRequestDistribution.testRequestTracking

Error Message:
Shard a1x2_shard1_replica1 received all 10 requests

Stack Trace:
java.lang.AssertionError: Shard a1x2_shard1_replica1 received all 10 requests
        at __randomizedtesting.SeedInfo.seed([91A74DC39822159C:D99B14036C29040A]:0)
        at org.junit.Assert.fail(Assert.java:93)
        at org.junit.Assert.assertTrue(Assert.java:43)
        at org.apache.solr.cloud.TestRandomRequestDistribution.testRequestTracking(TestRandomRequestDistribution.java:109)
        at sun.reflect.NativeMethodAccessorImpl.invoke0(Native Method)
        at sun.reflect.NativeMethodAccessorImpl.invoke(NativeMethodAccessorImpl.java:62)
        at sun.reflect.DelegatingMethodAccessorImpl.invoke(DelegatingMethodAccessorImpl.java:43)
        at java.lang.reflect.Method.invoke(Method.java:497)
        at com.carrotsearch.randomizedtesting.RandomizedRunner.invoke(RandomizedRunner.java:1627)
        at com.carrotsearch.randomizedtesting.RandomizedRunner$6.evaluate(RandomizedRunner.java:836)
        at com.carrotsearch.randomizedtesting.RandomizedRunner$7.evaluate(RandomizedRunner.java:872)
        at com.carrotsearch.randomizedtesting.RandomizedRunner$8.evaluate(RandomizedRunner.java:886)
        at org.apache.solr.BaseDistributedSearchTestCase$ShardsRepeatRule$ShardsFixedStatement.callStatement(BaseDistributedSearchTestCase.java:960)
        at org.apache.solr.BaseDistributedSearchTestCase$ShardsRepeatRule$ShardsStatement.evaluate(BaseDistributedSearchTestCase.java:935)
        at com.carrotsearch.randomizedtesting.rules.SystemPropertiesRestoreRule$1.evaluate(SystemPropertiesRestoreRule.java:57)
        at org.apache.lucene.util.TestRuleSetupTeardownChained$1.evaluate(TestRuleSetupTeardownChained.java:50)
        at org.apache.lucene.util.AbstractBeforeAfterRule$1.evaluate(AbstractBeforeAfterRule.java:46)
        at org.apache.lucene.util.TestRuleThreadAndTestName$1.evaluate(TestRuleThreadAndTestName.java:49)
        at org.apache.lucene.util.TestRuleIgnoreAfterMaxFailures$1.evaluate(TestRuleIgnoreAfterMaxFailures.java:65)
        at org.apache.lucene.util.TestRuleMarkFailure$1.evaluate(TestRuleMarkFailure.java:48)
        at com.carrotsearch.randomizedtesting.rules.StatementAdapter.evaluate(StatementAdapter.java:36)
        at com.carrotsearch.randomizedtesting.ThreadLeakControl$StatementRunner.run(ThreadLeakControl.java:365)
        at com.carrotsearch.randomizedtesting.ThreadLeakControl.forkTimeoutingTask(ThreadLeakControl.java:798)
        at com.carrotsearch.randomizedtesting.ThreadLeakControl$3.evaluate(ThreadLeakControl.java:458)
        at com.carrotsearch.randomizedtesting.RandomizedRunner.runSingleTest(RandomizedRunner.java:845)
        at com.carrotsearch.randomizedtesting.RandomizedRunner$3.evaluate(RandomizedRunner.java:747)
        at com.carrotsearch.randomizedtesting.RandomizedRunner$4.evaluate(RandomizedRunner.java:781)
        at com.carrotsearch.randomizedtesting.RandomizedRunner$5.evaluate(RandomizedRunner.java:792)
        at com.carrotsearch.randomizedtesting.rules.StatementAdapter.evaluate(StatementAdapter.java:36)
        at com.carrotsearch.randomizedtesting.rules.SystemPropertiesRestoreRule$1.evaluate(SystemPropertiesRestoreRule.java:57)
        at org.apache.lucene.util.AbstractBeforeAfterRule$1.evaluate(AbstractBeforeAfterRule.java:46)
        at com.carrotsearch.randomizedtesting.rules.StatementAdapter.evaluate(StatementAdapter.java:36)
        at org.apache.lucene.util.TestRuleStoreClassName$1.evaluate(TestRuleStoreClassName.java:42)
        at com.carrotsearch.randomizedtesting.rules.NoShadowingOrOverridesOnMethodsRule$1.evaluate(NoShadowingOrOverridesOnMethodsRule.java:39)
        at com.carrotsearch.randomizedtesting.rules.NoShadowingOrOverridesOnMethodsRule$1.evaluate(NoShadowingOrOverridesOnMethodsRule.java:39)
        at com.carrotsearch.randomizedtesting.rules.StatementAdapter.evaluate(StatementAdapter.java:36)
        at com.carrotsearch.randomizedtesting.rules.StatementAdapter.evaluate(StatementAdapter.java:36)
        at com.carrotsearch.randomizedtesting.rules.StatementAdapter.evaluate(StatementAdapter.java:36)
        at org.apache.lucene.util.TestRuleAssertionsRequired$1.evaluate(TestRuleAssertionsRequired.java:54)
        at org.apache.lucene.util.TestRuleMarkFailure$1.evaluate(TestRuleMarkFailure.java:48)
        at org.apache.lucene.util.TestRuleIgnoreAfterMaxFailures$1.evaluate(TestRuleIgnoreAfterMaxFailures.java:65)
        at org.apache.lucene.util.TestRuleIgnoreTestSuites$1.evaluate(TestRuleIgnoreTestSuites.java:55)
        at com.carrotsearch.randomizedtesting.rules.StatementAdapter.evaluate(StatementAdapter.java:36)
        at com.carrotsearch.randomizedtesting.ThreadLeakControl$StatementRunner.run(ThreadLeakControl.java:365)
        at java.lang.Thread.run(Thread.java:745)




Build Log:
[...truncated 10240 lines...]
   [junit4] Suite: org.apache.solr.cloud.TestRandomRequestDistribution
   [junit4]   2> Creating dataDir: C:\Users\JenkinsSlave\workspace\Lucene-Solr-trunk-Windows\solr\build\solr-core\test\J0\temp\solr.cloud.TestRandomRequestDistribution_91A74DC39822159C-001\init-core-data-001
   [junit4]   2> 1284552 INFO  (SUITE-TestRandomRequestDistribution-seed#[91A74DC39822159C]-worker) [    ] o.a.s.BaseDistributedSearchTestCase Setting hostContext system property: /fnfj/hk
   [junit4]   2> 1284554 INFO  (TEST-TestRandomRequestDistribution.testRequestTracking-seed#[91A74DC39822159C]) [    ] o.a.s.c.ZkTestServer STARTING ZK TEST SERVER
   [junit4]   2> 1284555 INFO  (Thread-2586) [    ] o.a.s.c.ZkTestServer client port:0.0.0.0/0.0.0.0:0
   [junit4]   2> 1284555 INFO  (Thread-2586) [    ] o.a.s.c.ZkTestServer Starting server
   [junit4]   2> 1284644 INFO  (TEST-TestRandomRequestDistribution.testRequestTracking-seed#[91A74DC39822159C]) [    ] o.a.s.c.ZkTestServer start zk server on port:64542
   [junit4]   2> 1284644 INFO  (TEST-TestRandomRequestDistribution.testRequestTracking-seed#[91A74DC39822159C]) [    ] o.a.s.c.c.SolrZkClient Using default ZkCredentialsProvider
   [junit4]   2> 1284645 INFO  (TEST-TestRandomRequestDistribution.testRequestTracking-seed#[91A74DC39822159C]) [    ] o.a.s.c.c.ConnectionManager Waiting for client to connect to ZooKeeper
   [junit4]   2> 1284648 INFO  (zkCallback-1492-thread-1) [    ] o.a.s.c.c.ConnectionManager Watcher org.apache.solr.common.cloud.ConnectionManager@190d1389 name:ZooKeeperConnection Watcher:127.0.0.1:64542 got event WatchedEvent state:SyncConnected type:None path:null path:null type:None
   [junit4]   2> 1284648 INFO  (TEST-TestRandomRequestDistribution.testRequestTracking-seed#[91A74DC39822159C]) [    ] o.a.s.c.c.ConnectionManager Client is connected to ZooKeeper
   [junit4]   2> 1284648 INFO  (TEST-TestRandomRequestDistribution.testRequestTracking-seed#[91A74DC39822159C]) [    ] o.a.s.c.c.SolrZkClient Using default ZkACLProvider
   [junit4]   2> 1284648 INFO  (TEST-TestRandomRequestDistribution.testRequestTracking-seed#[91A74DC39822159C]) [    ] o.a.s.c.c.SolrZkClient makePath: /solr
   [junit4]   2> 1284651 WARN  (NIOServerCxn.Factory:0.0.0.0/0.0.0.0:0) [    ] o.a.z.s.NIOServerCnxn caught end of stream exception
   [junit4]   2> EndOfStreamException: Unable to read additional data from client sessionid 0x14e3eda256a0000, likely client has closed socket
   [junit4]   2> at org.apache.zookeeper.server.NIOServerCnxn.doIO(NIOServerCnxn.java:228)
   [junit4]   2> at org.apache.zookeeper.server.NIOServerCnxnFactory.run(NIOServerCnxnFactory.java:208)
   [junit4]   2> at java.lang.Thread.run(Thread.java:745)
   [junit4]   2> 1284651 INFO  (TEST-TestRandomRequestDistribution.testRequestTracking-seed#[91A74DC39822159C]) [    ] o.a.s.c.c.SolrZkClient Using default ZkCredentialsProvider
   [junit4]   2> 1284653 INFO  (TEST-TestRandomRequestDistribution.testRequestTracking-seed#[91A74DC39822159C]) [    ] o.a.s.c.c.ConnectionManager Waiting for client to connect to ZooKeeper
   [junit4]   2> 1284654 INFO  (zkCallback-1493-thread-1) [    ] o.a.s.c.c.ConnectionManager Watcher org.apache.solr.common.cloud.ConnectionManager@1351b7b8 name:ZooKeeperConnection Watcher:127.0.0.1:64542/solr got event WatchedEvent state:SyncConnected type:None path:null path:null type:None
   [junit4]   2> 1284654 INFO  (TEST-TestRandomRequestDistribution.testRequestTracking-seed#[91A74DC39822159C]) [    ] o.a.s.c.c.ConnectionManager Client is connected to ZooKeeper
   [junit4]   2> 1284654 INFO  (TEST-TestRandomRequestDistribution.testRequestTracking-seed#[91A74DC39822159C]) [    ] o.a.s.c.c.SolrZkClient Using default ZkACLProvider
   [junit4]   2> 1284654 INFO  (TEST-TestRandomRequestDistribution.testRequestTracking-seed#[91A74DC39822159C]) [    ] o.a.s.c.c.SolrZkClient makePath: /collections/collection1
   [junit4]   2> 1284656 INFO  (TEST-TestRandomRequestDistribution.testRequestTracking-seed#[91A74DC39822159C]) [    ] o.a.s.c.c.SolrZkClient makePath: /collections/collection1/shards
   [junit4]   2> 1284658 INFO  (TEST-TestRandomRequestDistribution.testRequestTracking-seed#[91A74DC39822159C]) [    ] o.a.s.c.c.SolrZkClient makePath: /collections/control_collection
   [junit4]   2> 1284660 INFO  (TEST-TestRandomRequestDistribution.testRequestTracking-seed#[91A74DC39822159C]) [    ] o.a.s.c.c.SolrZkClient makePath: /collections/control_collection/shards
   [junit4]   2> 1284662 INFO  (TEST-TestRandomRequestDistribution.testRequestTracking-seed#[91A74DC39822159C]) [    ] o.a.s.c.AbstractZkTestCase put C:\Users\JenkinsSlave\workspace\Lucene-Solr-trunk-Windows\solr\core\src\test-files\solr\collection1\conf\solrconfig-tlog.xml to /configs/conf1/solrconfig.xml
   [junit4]   2> 1284662 INFO  (TEST-TestRandomRequestDistribution.testRequestTracking-seed#[91A74DC39822159C]) [    ] o.a.s.c.c.SolrZkClient makePath: /configs/conf1/solrconfig.xml
   [junit4]   2> 1284665 INFO  (TEST-TestRandomRequestDistribution.testRequestTracking-seed#[91A74DC39822159C]) [    ] o.a.s.c.AbstractZkTestCase put C:\Users\JenkinsSlave\workspace\Lucene-Solr-trunk-Windows\solr\core\src\test-files\solr\collection1\conf\schema.xml to /configs/conf1/schema.xml
   [junit4]   2> 1284665 INFO  (TEST-TestRandomRequestDistribution.testRequestTracking-seed#[91A74DC39822159C]) [    ] o.a.s.c.c.SolrZkClient makePath: /configs/conf1/schema.xml
   [junit4]   2> 1284667 INFO  (TEST-TestRandomRequestDistribution.testRequestTracking-seed#[91A74DC39822159C]) [    ] o.a.s.c.AbstractZkTestCase put C:\Users\JenkinsSlave\workspace\Lucene-Solr-trunk-Windows\solr\core\src\test-files\solr\collection1\conf\solrconfig.snippet.randomindexconfig.xml to /configs/conf1/solrconfig.snippet.randomindexconfig.xml
   [junit4]   2> 1284667 INFO  (TEST-TestRandomRequestDistribution.testRequestTracking-seed#[91A74DC39822159C]) [    ] o.a.s.c.c.SolrZkClient makePath: /configs/conf1/solrconfig.snippet.randomindexconfig.xml
   [junit4]   2> 1284668 INFO  (TEST-TestRandomRequestDistribution.testRequestTracking-seed#[91A74DC39822159C]) [    ] o.a.s.c.AbstractZkTestCase put C:\Users\JenkinsSlave\workspace\Lucene-Solr-trunk-Windows\solr\core\src\test-files\solr\collection1\conf\stopwords.txt to /configs/conf1/stopwords.txt
   [junit4]   2> 1284668 INFO  (TEST-TestRandomRequestDistribution.testRequestTracking-seed#[91A74DC39822159C]) [    ] o.a.s.c.c.SolrZkClient makePath: /configs/conf1/stopwords.txt
   [junit4]   2> 1284675 INFO  (TEST-TestRandomRequestDistribution.testRequestTracking-seed#[91A74DC39822159C]) [    ] o.a.s.c.AbstractZkTestCase put C:\Users\JenkinsSlave\workspace\Lucene-Solr-trunk-Windows\solr\core\src\test-files\solr\collection1\conf\protwords.txt to /configs/conf1/protwords.txt
   [junit4]   2> 1284676 INFO  (TEST-TestRandomRequestDistribution.testRequestTracking-seed#[91A74DC39822159C]) [    ] o.a.s.c.c.SolrZkClient makePath: /configs/conf1/protwords.txt
   [junit4]   2> 1284678 INFO  (TEST-TestRandomRequestDistribution.testRequestTracking-seed#[91A74DC39822159C]) [    ] o.a.s.c.AbstractZkTestCase put C:\Users\JenkinsSlave\workspace\Lucene-Solr-trunk-Windows\solr\core\src\test-files\solr\collection1\conf\currency.xml to /configs/conf1/currency.xml
   [junit4]   2> 1284678 INFO  (TEST-TestRandomRequestDistribution.testRequestTracking-seed#[91A74DC39822159C]) [    ] o.a.s.c.c.SolrZkClient makePath: /configs/conf1/currency.xml
   [junit4]   2> 1284680 INFO  (TEST-TestRandomRequestDistribution.testRequestTracking-seed#[91A74DC39822159C]) [    ] o.a.s.c.AbstractZkTestCase put C:\Users\JenkinsSlave\workspace\Lucene-Solr-trunk-Windows\solr\core\src\test-files\solr\collection1\conf\enumsConfig.xml to /configs/conf1/enumsConfig.xml
   [junit4]   2> 1284680 INFO  (TEST-TestRandomRequestDistribution.testRequestTracking-seed#[91A74DC39822159C]) [    ] o.a.s.c.c.SolrZkClient makePath: /configs/conf1/enumsConfig.xml
   [junit4]   2> 1284682 INFO  (TEST-TestRandomRequestDistribution.testRequestTracking-seed#[91A74DC39822159C]) [    ] o.a.s.c.AbstractZkTestCase put C:\Users\JenkinsSlave\workspace\Lucene-Solr-trunk-Windows\solr\core\src\test-files\solr\collection1\conf\open-exchange-rates.json to /configs/conf1/open-exchange-rates.json
   [junit4]   2> 1284682 INFO  (TEST-TestRandomRequestDistribution.testRequestTracking-seed#[91A74DC39822159C]) [    ] o.a.s.c.c.SolrZkClient makePath: /configs/conf1/open-exchange-rates.json
   [junit4]   2> 1284685 INFO  (TEST-TestRandomRequestDistribution.testRequestTracking-seed#[91A74DC39822159C]) [    ] o.a.s.c.AbstractZkTestCase put C:\Users\JenkinsSlave\workspace\Lucene-Solr-trunk-Windows\solr\core\src\test-files\solr\collection1\conf\mapping-ISOLatin1Accent.txt to /configs/conf1/mapping-ISOLatin1Accent.txt
   [junit4]   2> 1284685 INFO  (TEST-TestRandomRequestDistribution.testRequestTracking-seed#[91A74DC39822159C]) [    ] o.a.s.c.c.SolrZkClient makePath: /configs/conf1/mapping-ISOLatin1Accent.txt
   [junit4]   2> 1284689 INFO  (TEST-TestRandomRequestDistribution.testRequestTracking-seed#[91A74DC39822159C]) [    ] o.a.s.c.AbstractZkTestCase put C:\Users\JenkinsSlave\workspace\Lucene-Solr-trunk-Windows\solr\core\src\test-files\solr\collection1\conf\old_synonyms.txt to /configs/conf1/old_synonyms.txt
   [junit4]   2> 1284690 INFO  (TEST-TestRandomRequestDistribution.testRequestTracking-seed#[91A74DC39822159C]) [    ] o.a.s.c.c.SolrZkClient makePath: /configs/conf1/old_synonyms.txt
   [junit4]   2> 1284693 INFO  (TEST-TestRandomRequestDistribution.testRequestTracking-seed#[91A74DC39822159C]) [    ] o.a.s.c.AbstractZkTestCase put C:\Users\JenkinsSlave\workspace\Lucene-Solr-trunk-Windows\solr\core\src\test-files\solr\collection1\conf\synonyms.txt to /configs/conf1/synonyms.txt
   [junit4]   2> 1284693 INFO  (TEST-TestRandomRequestDistribution.testRequestTracking-seed#[91A74DC39822159C]) [    ] o.a.s.c.c.SolrZkClient makePath: /configs/conf1/synonyms.txt
   [junit4]   2> 1284695 WARN  (NIOServerCxn.Factory:0.0.0.0/0.0.0.0:0) [    ] o.a.z.s.NIOServerCnxn caught end of stream exception
   [junit4]   2> EndOfStreamException: Unable to read additional data from client sessionid 0x14e3eda256a0001, likely client has closed socket
   [junit4]   2> at org.apache.zookeeper.server.NIOServerCnxn.doIO(NIOServerCnxn.java:228)
   [junit4]   2> at org.apache.zookeeper.server.NIOServerCnxnFactory.run(NIOServerCnxnFactory.java:208)
   [junit4]   2> at java.lang.Thread.run(Thread.java:745)
   [junit4]   2> 1285085 INFO  (TEST-TestRandomRequestDistribution.testRequestTracking-seed#[91A74DC39822159C]) [    ] o.a.s.SolrTestCaseJ4 Writing core.properties file to C:\Users\JenkinsSlave\workspace\Lucene-Solr-trunk-Windows\solr\build\solr-core\test\J0\temp\solr.cloud.TestRandomRequestDistribution_91A74DC39822159C-001\control-001\cores\collection1
   [junit4]   2> 1285089 INFO  (TEST-TestRandomRequestDistribution.testRequestTracking-seed#[91A74DC39822159C]) [    ] o.e.j.s.Server jetty-9.2.11.v20150529
   [junit4]   2> 1285100 INFO  (TEST-TestRandomRequestDistribution.testRequestTracking-seed#[91A74DC39822159C]) [    ] o.e.j.s.h.ContextHandler Started o.e.j.s.ServletContextHandler@404be5f4{/fnfj/hk,null,AVAILABLE}
   [junit4]   2> 1285105 INFO  (TEST-TestRandomRequestDistribution.testRequestTracking-seed#[91A74DC39822159C]) [    ] o.e.j.s.ServerConnector Started ServerConnector@1a06b260{HTTP/1.1}{127.0.0.1:64552}
   [junit4]   2> 1285105 INFO  (TEST-TestRandomRequestDistribution.testRequestTracking-seed#[91A74DC39822159C]) [    ] o.e.j.s.Server Started @1283895ms
   [junit4]   2> 1285105 INFO  (TEST-TestRandomRequestDistribution.testRequestTracking-seed#[91A74DC39822159C]) [    ] o.a.s.c.s.e.JettySolrRunner Jetty properties: {solr.data.dir=C:\Users\JenkinsSlave\workspace\Lucene-Solr-trunk-Windows\solr\build\solr-core\test\J0\temp\solr.cloud.TestRandomRequestDistribution_91A74DC39822159C-001\tempDir-001/control/data, hostContext=/fnfj/hk, hostPort=64552, coreRootDirectory=C:\Users\JenkinsSlave\workspace\Lucene-Solr-trunk-Windows\solr\build\solr-core\test\J0\temp\solr.cloud.TestRandomRequestDistribution_91A74DC39822159C-001\control-001\cores}
   [junit4]   2> 1285105 INFO  (TEST-TestRandomRequestDistribution.testRequestTracking-seed#[91A74DC39822159C]) [    ] o.a.s.s.SolrDispatchFilter SolrDispatchFilter.init(): sun.misc.Launcher$AppClassLoader@4e0e2f2a
   [junit4]   2> 1285105 INFO  (TEST-TestRandomRequestDistribution.testRequestTracking-seed#[91A74DC39822159C]) [    ] o.a.s.c.SolrResourceLoader new SolrResourceLoader for directory: 'C:\Users\JenkinsSlave\workspace\Lucene-Solr-trunk-Windows\solr\build\solr-core\test\J0\temp\solr.cloud.TestRandomRequestDistribution_91A74DC39822159C-001\control-001\'
   [junit4]   2> 1285124 INFO  (TEST-TestRandomRequestDistribution.testRequestTracking-seed#[91A74DC39822159C]) [    ] o.a.s.c.SolrXmlConfig Loading container configuration from C:\Users\JenkinsSlave\workspace\Lucene-Solr-trunk-Windows\solr\build\solr-core\test\J0\temp\solr.cloud.TestRandomRequestDistribution_91A74DC39822159C-001\control-001\solr.xml
   [junit4]   2> 1285130 INFO  (TEST-TestRandomRequestDistribution.testRequestTracking-seed#[91A74DC39822159C]) [    ] o.a.s.c.CoresLocator Config-defined core root directory: C:\Users\JenkinsSlave\workspace\Lucene-Solr-trunk-Windows\solr\build\solr-core\test\J0\temp\solr.cloud.TestRandomRequestDistribution_91A74DC39822159C-001\control-001\cores
   [junit4]   2> 1285130 INFO  (TEST-TestRandomRequestDistribution.testRequestTracking-seed#[91A74DC39822159C]) [    ] o.a.s.c.CoreContainer New CoreContainer 1606791328
   [junit4]   2> 1285130 INFO  (TEST-TestRandomRequestDistribution.testRequestTracking-seed#[91A74DC39822159C]) [    ] o.a.s.c.CoreContainer Loading cores into CoreContainer [instanceDir=C:\Users\JenkinsSlave\workspace\Lucene-Solr-trunk-Windows\solr\build\solr-core\test\J0\temp\solr.cloud.TestRandomRequestDistribution_91A74DC39822159C-001\control-001\]
   [junit4]   2> 1285130 INFO  (TEST-TestRandomRequestDistribution.testRequestTracking-seed#[91A74DC39822159C]) [    ] o.a.s.c.CoreContainer loading shared library: C:\Users\JenkinsSlave\workspace\Lucene-Solr-trunk-Windows\solr\build\solr-core\test\J0\temp\solr.cloud.TestRandomRequestDistribution_91A74DC39822159C-001\control-001\lib
   [junit4]   2> 1285130 WARN  (TEST-TestRandomRequestDistribution.testRequestTracking-seed#[91A74DC39822159C]) [    ] o.a.s.c.SolrResourceLoader Can't find (or read) directory to add to classloader: lib (resolved as: C:\Users\JenkinsSlave\workspace\Lucene-Solr-trunk-Windows\solr\build\solr-core\test\J0\temp\solr.cloud.TestRandomRequestDistribution_91A74DC39822159C-001\control-001\lib).
   [junit4]   2> 1285138 INFO  (TEST-TestRandomRequestDistribution.testRequestTracking-seed#[91A74DC39822159C]) [    ] o.a.s.h.c.HttpShardHandlerFactory created with socketTimeout : 90000,urlScheme : ,connTimeout : 15000,maxConnectionsPerHost : 20,maxConnections : 10000,corePoolSize : 0,maximumPoolSize : 2147483647,maxThreadIdleTime : 5,sizeOfQueue : -1,fairnessPolicy : false,useRetries : false,
   [junit4]   2> 1285140 INFO  (TEST-TestRandomRequestDistribution.testRequestTracking-seed#[91A74DC39822159C]) [    ] o.a.s.u.UpdateShardHandler Creating UpdateShardHandler HTTP client with params: socketTimeout=340000&connTimeout=45000&retry=true
   [junit4]   2> 1285141 INFO  (TEST-TestRandomRequestDistribution.testRequestTracking-seed#[91A74DC39822159C]) [    ] o.a.s.l.LogWatcher SLF4J impl is org.slf4j.impl.Log4jLoggerFactory
   [junit4]   2> 1285141 INFO  (TEST-TestRandomRequestDistribution.testRequestTracking-seed#[91A74DC39822159C]) [    ] o.a.s.l.LogWatcher Registering Log Listener [Log4j (org.slf4j.impl.Log4jLoggerFactory)]
   [junit4]   2> 1285141 INFO  (TEST-TestRandomRequestDistribution.testRequestTracking-seed#[91A74DC39822159C]) [    ] o.a.s.c.ZkContainer Zookeeper client=127.0.0.1:64542/solr
   [junit4]   2> 1285141 INFO  (TEST-TestRandomRequestDistribution.testRequestTracking-seed#[91A74DC39822159C]) [    ] o.a.s.c.ZkController zkHost includes chroot
   [junit4]   2> 1285141 INFO  (TEST-TestRandomRequestDistribution.testRequestTracking-seed#[91A74DC39822159C]) [    ] o.a.s.c.c.SolrZkClient Using default ZkCredentialsProvider
   [junit4]   2> 1285143 INFO  (TEST-TestRandomRequestDistribution.testRequestTracking-seed#[91A74DC39822159C]) [    ] o.a.s.c.c.ConnectionManager Waiting for client to connect to ZooKeeper
   [junit4]   2> 1285143 INFO  (zkCallback-1495-thread-1) [    ] o.a.s.c.c.ConnectionManager Watcher org.apache.solr.common.cloud.ConnectionManager@7cd9b82e name:ZooKeeperConnection Watcher:127.0.0.1:64542 got event WatchedEvent state:SyncConnected type:None path:null path:null type:None
   [junit4]   2> 1285144 INFO  (TEST-TestRandomRequestDistribution.testRequestTracking-seed#[91A74DC39822159C]) [    ] o.a.s.c.c.ConnectionManager Client is connected to ZooKeeper
   [junit4]   2> 1285144 INFO  (TEST-TestRandomRequestDistribution.testRequestTracking-seed#[91A74DC39822159C]) [    ] o.a.s.c.c.SolrZkClient Using default ZkACLProvider
   [junit4]   2> 1285146 INFO  (TEST-TestRandomRequestDistribution.testRequestTracking-seed#[91A74DC39822159C]) [n:127.0.0.1:64552_fnfj%2Fhk    ] o.a.s.c.c.ConnectionManager Waiting for client to connect to ZooKeeper
   [junit4]   2> 1285147 INFO  (zkCallback-1496-thread-1-processing-n:127.0.0.1:64552_fnfj%2Fhk) [n:127.0.0.1:64552_fnfj%2Fhk    ] o.a.s.c.c.ConnectionManager Watcher org.apache.solr.common.cloud.ConnectionManager@69fa8c2f name:ZooKeeperConnection Watcher:127.0.0.1:64542/solr got event WatchedEvent state:SyncConnected type:None path:null path:null type:None
   [junit4]   2> 1285147 INFO  (TEST-TestRandomRequestDistribution.testRequestTracking-seed#[91A74DC39822159C]) [n:127.0.0.1:64552_fnfj%2Fhk    ] o.a.s.c.c.ConnectionManager Client is connected to ZooKeeper
   [junit4]   2> 1285148 INFO  (TEST-TestRandomRequestDistribution.testRequestTracking-seed#[91A74DC39822159C]) [n:127.0.0.1:64552_fnfj%2Fhk    ] o.a.s.c.c.SolrZkClient makePath: /overseer/queue
   [junit4]   2> 1285149 INFO  (TEST-TestRandomRequestDistribution.testRequestTracking-seed#[91A74DC39822159C]) [n:127.0.0.1:64552_fnfj%2Fhk    ] o.a.s.c.c.SolrZkClient makePath: /overseer/collection-queue-work
   [junit4]   2> 1285151 INFO  (TEST-TestRandomRequestDistribution.testRequestTracking-seed#[91A74DC39822159C]) [n:127.0.0.1:64552_fnfj%2Fhk    ] o.a.s.c.c.SolrZkClient makePath: /overseer/collection-map-running
   [junit4]   2> 1285154 INFO  (TEST-TestRandomRequestDistribution.testRequestTracking-seed#[91A74DC39822159C]) [n:127.0.0.1:64552_fnfj%2Fhk    ] o.a.s.c.c.SolrZkClient makePath: /overseer/collection-map-completed
   [junit4]   2> 1285156 INFO  (TEST-TestRandomRequestDistribution.testRequestTracking-seed#[91A74DC39822159C]) [n:127.0.0.1:64552_fnfj%2Fhk    ] o.a.s.c.c.SolrZkClient makePath: /overseer/collection-map-failure
   [junit4]   2> 1285158 INFO  (TEST-TestRandomRequestDistribution.testRequestTracking-seed#[91A74DC39822159C]) [n:127.0.0.1:64552_fnfj%2Fhk    ] o.a.s.c.c.SolrZkClient makePath: /live_nodes
   [junit4]   2> 1285160 INFO  (TEST-TestRandomRequestDistribution.testRequestTracking-seed#[91A74DC39822159C]) [n:127.0.0.1:64552_fnfj%2Fhk    ] o.a.s.c.c.SolrZkClient makePath: /aliases.json
   [junit4]   2> 1285161 INFO  (TEST-TestRandomRequestDistribution.testRequestTracking-seed#[91A74DC39822159C]) [n:127.0.0.1:64552_fnfj%2Fhk    ] o.a.s.c.c.SolrZkClient makePath: /clusterstate.json
   [junit4]   2> 1285162 INFO  (TEST-TestRandomRequestDistribution.testRequestTracking-seed#[91A74DC39822159C]) [n:127.0.0.1:64552_fnfj%2Fhk    ] o.a.s.c.ZkController Register node as live in ZooKeeper:/live_nodes/127.0.0.1:64552_fnfj%2Fhk
   [junit4]   2> 1285163 INFO  (TEST-TestRandomRequestDistribution.testRequestTracking-seed#[91A74DC39822159C]) [n:127.0.0.1:64552_fnfj%2Fhk    ] o.a.s.c.c.SolrZkClient makePath: /live_nodes/127.0.0.1:64552_fnfj%2Fhk
   [junit4]   2> 1285164 INFO  (TEST-TestRandomRequestDistribution.testRequestTracking-seed#[91A74DC39822159C]) [n:127.0.0.1:64552_fnfj%2Fhk    ] o.a.s.c.c.SolrZkClient makePath: /overseer_elect
   [junit4]   2> 1285165 INFO  (TEST-TestRandomRequestDistribution.testRequestTracking-seed#[91A74DC39822159C]) [n:127.0.0.1:64552_fnfj%2Fhk    ] o.a.s.c.c.SolrZkClient makePath: /overseer_elect/election
   [junit4]   2> 1285167 INFO  (TEST-TestRandomRequestDistribution.testRequestTracking-seed#[91A74DC39822159C]) [n:127.0.0.1:64552_fnfj%2Fhk    ] o.a.s.c.Overseer Overseer (id=null) closing
   [junit4]   2> 1285167 INFO  (TEST-TestRandomRequestDistribution.testRequestTracking-seed#[91A74DC39822159C]) [n:127.0.0.1:64552_fnfj%2Fhk    ] o.a.s.c.LeaderElector Joined leadership election with path: /overseer_elect/election/94081748872855555-127.0.0.1:64552_fnfj%2Fhk-n_0000000000
   [junit4]   2> 1285168 INFO  (TEST-TestRandomRequestDistribution.testRequestTracking-seed#[91A74DC39822159C]) [n:127.0.0.1:64552_fnfj%2Fhk    ] o.a.s.c.OverseerElectionContext I am going to be the leader 127.0.0.1:64552_fnfj%2Fhk
   [junit4]   2> 1285168 INFO  (TEST-TestRandomRequestDistribution.testRequestTracking-seed#[91A74DC39822159C]) [n:127.0.0.1:64552_fnfj%2Fhk    ] o.a.s.c.c.SolrZkClient makePath: /overseer_elect/leader
   [junit4]   2> 1285169 INFO  (TEST-TestRandomRequestDistribution.testRequestTracking-seed#[91A74DC39822159C]) [n:127.0.0.1:64552_fnfj%2Fhk    ] o.a.s.c.Overseer Overseer (id=94081748872855555-127.0.0.1:64552_fnfj%2Fhk-n_0000000000) starting
   [junit4]   2> 1285171 INFO  (TEST-TestRandomRequestDistribution.testRequestTracking-seed#[91A74DC39822159C]) [n:127.0.0.1:64552_fnfj%2Fhk    ] o.a.s.c.c.SolrZkClient makePath: /overseer/queue-work
   [junit4]   2> 1285177 INFO  (TEST-TestRandomRequestDistribution.testRequestTracking-seed#[91A74DC39822159C]) [n:127.0.0.1:64552_fnfj%2Fhk    ] o.a.s.c.OverseerAutoReplicaFailoverThread Starting OverseerAutoReplicaFailoverThread autoReplicaFailoverWorkLoopDelay=10000 autoReplicaFailoverWaitAfterExpiration=30000 autoReplicaFailoverBadNodeExpiration=60000
   [junit4]   2> 1285178 INFO  (TEST-TestRandomRequestDistribution.testRequestTracking-seed#[91A74DC39822159C]) [n:127.0.0.1:64552_fnfj%2Fhk    ] o.a.s.c.c.ZkStateReader Updating cluster state from ZooKeeper...
   [junit4]   2> 1285178 INFO  (OverseerStateUpdate-94081748872855555-127.0.0.1:64552_fnfj%2Fhk-n_0000000000) [n:127.0.0.1:64552_fnfj%2Fhk    ] o.a.s.c.Overseer Starting to work on the main queue
   [junit4]   2> 1285178 INFO  (OverseerCollectionProcessor-94081748872855555-127.0.0.1:64552_fnfj%2Fhk-n_0000000000) [n:127.0.0.1:64552_fnfj%2Fhk    ] o.a.s.c.OverseerCollectionProcessor Process current queue of collection creations
   [junit4]   2> 1285182 INFO  (TEST-TestRandomRequestDistribution.testRequestTracking-seed#[91A74DC39822159C]) [n:127.0.0.1:64552_fnfj%2Fhk    ] o.a.s.c.CoreContainer No authentication plugin used.
   [junit4]   2> 1285182 INFO  (TEST-TestRandomRequestDistribution.testRequestTracking-seed#[91A74DC39822159C]) [n:127.0.0.1:64552_fnfj%2Fhk    ] o.a.s.c.CoreContainer Security conf doesn't exist. Skipping setup for authorization module.
   [junit4]   2> 1285182 INFO  (TEST-TestRandomRequestDistribution.testRequestTracking-seed#[91A74DC39822159C]) [n:127.0.0.1:64552_fnfj%2Fhk    ] o.a.s.c.CoresLocator Looking for core definitions underneath C:\Users\JenkinsSlave\workspace\Lucene-Solr-trunk-Windows\solr\build\solr-core\test\J0\temp\solr.cloud.TestRandomRequestDistribution_91A74DC39822159C-001\control-001\cores
   [junit4]   2> 1285183 INFO  (TEST-TestRandomRequestDistribution.testRequestTracking-seed#[91A74DC39822159C]) [n:127.0.0.1:64552_fnfj%2Fhk    ] o.a.s.c.SolrCore Created CoreDescriptor: {name=collection1, config=solrconfig.xml, transient=false, schema=schema.xml, loadOnStartup=true, instanceDir=C:\Users\JenkinsSlave\workspace\Lucene-Solr-trunk-Windows\solr\build\solr-core\test\J0\temp\solr.cloud.TestRandomRequestDistribution_91A74DC39822159C-001\control-001\cores\collection1, collection=control_collection, absoluteInstDir=C:\Users\JenkinsSlave\workspace\Lucene-Solr-trunk-Windows\solr\build\solr-core\test\J0\temp\solr.cloud.TestRandomRequestDistribution_91A74DC39822159C-001\control-001\cores\collection1\, coreNodeName=, dataDir=data\, shard=}
   [junit4]   2> 1285183 INFO  (TEST-TestRandomRequestDistribution.testRequestTracking-seed#[91A74DC39822159C]) [n:127.0.0.1:64552_fnfj%2Fhk    ] o.a.s.c.CoresLocator Found core collection1 in C:\Users\JenkinsSlave\workspace\Lucene-Solr-trunk-Windows\solr\build\solr-core\test\J0\temp\solr.cloud.TestRandomRequestDistribution_91A74DC39822159C-001\control-001\cores\collection1\
   [junit4]   2> 1285183 INFO  (TEST-TestRandomRequestDistribution.testRequestTracking-seed#[91A74DC39822159C]) [n:127.0.0.1:64552_fnfj%2Fhk    ] o.a.s.c.CoresLocator Found 1 core definitions
   [junit4]   2> 1285184 INFO  (coreLoadExecutor-3053-thread-1-processing-n:127.0.0.1:64552_fnfj%2Fhk) [n:127.0.0.1:64552_fnfj%2Fhk c:control_collection   x:collection1] o.a.s.c.ZkController publishing state=down
   [junit4]   2> 1285184 INFO  (coreLoadExecutor-3053-thread-1-processing-n:127.0.0.1:64552_fnfj%2Fhk) [n:127.0.0.1:64552_fnfj%2Fhk c:control_collection   x:collection1] o.a.s.c.ZkController numShards not found on descriptor - reading it from system property
   [junit4]   2> 1285185 INFO  (TEST-TestRandomRequestDistribution.testRequestTracking-seed#[91A74DC39822159C]) [n:127.0.0.1:64552_fnfj%2Fhk    ] o.a.s.s.SolrDispatchFilter user.dir=C:\Users\JenkinsSlave\workspace\Lucene-Solr-trunk-Windows\solr\build\solr-core\test\J0
   [junit4]   2> 1285185 INFO  (TEST-TestRandomRequestDistribution.testRequestTracking-seed#[91A74DC39822159C]) [n:127.0.0.1:64552_fnfj%2Fhk    ] o.a.s.s.SolrDispatchFilter SolrDispatchFilter.init() done
   [junit4]   2> 1285185 INFO  (zkCallback-1496-thread-1-processing-n:127.0.0.1:64552_fnfj%2Fhk) [n:127.0.0.1:64552_fnfj%2Fhk    ] o.a.s.c.DistributedQueue NodeChildrenChanged fired on path /overseer/queue state SyncConnected
   [junit4]   2> 1285186 INFO  (coreLoadExecutor-3053-thread-1-processing-n:127.0.0.1:64552_fnfj%2Fhk) [n:127.0.0.1:64552_fnfj%2Fhk c:control_collection   x:collection1] o.a.s.c.ZkController look for our core node name
   [junit4]   2> 1285186 INFO  (OverseerStateUpdate-94081748872855555-127.0.0.1:64552_fnfj%2Fhk-n_0000000000) [n:127.0.0.1:64552_fnfj%2Fhk    ] o.a.s.c.Overseer processMessage: queueSize: 1, message = {
   [junit4]   2>   "core":"collection1",
   [junit4]   2>   "roles":null,
   [junit4]   2>   "base_url":"http://127.0.0.1:64552/fnfj/hk",
   [junit4]   2>   "node_name":"127.0.0.1:64552_fnfj%2Fhk",
   [junit4]   2>   "numShards":"1",
   [junit4]   2>   "state":"down",
   [junit4]   2>   "shard":null,
   [junit4]   2>   "collection":"control_collection",
   [junit4]   2>   "operation":"state"} current state version: 0
   [junit4]   2> 1285187 INFO  (OverseerStateUpdate-94081748872855555-127.0.0.1:64552_fnfj%2Fhk-n_0000000000) [n:127.0.0.1:64552_fnfj%2Fhk    ] o.a.s.c.o.ReplicaMutator Update state numShards=1 message={
   [junit4]   2>   "core":"collection1",
   [junit4]   2>   "roles":null,
   [junit4]   2>   "base_url":"http://127.0.0.1:64552/fnfj/hk",
   [junit4]   2>   "node_name":"127.0.0.1:64552_fnfj%2Fhk",
   [junit4]   2>   "numShards":"1",
   [junit4]   2>   "state":"down",
   [junit4]   2>   "shard":null,
   [junit4]   2>   "collection":"control_collection",
   [junit4]   2>   "operation":"state"}
   [junit4]   2> 1285187 INFO  (OverseerStateUpdate-94081748872855555-127.0.0.1:64552_fnfj%2Fhk-n_0000000000) [n:127.0.0.1:64552_fnfj%2Fhk    ] o.a.s.c.o.ClusterStateMutator building a new cName: control_collection
   [junit4]   2> 1285187 INFO  (OverseerStateUpdate-94081748872855555-127.0.0.1:64552_fnfj%2Fhk-n_0000000000) [n:127.0.0.1:64552_fnfj%2Fhk    ] o.a.s.c.o.ReplicaMutator Assigning new node to shard shard=shard1
   [junit4]   2> 1285188 INFO  (zkCallback-1496-thread-1-processing-n:127.0.0.1:64552_fnfj%2Fhk) [n:127.0.0.1:64552_fnfj%2Fhk    ] o.a.s.c.c.ZkStateReader A cluster state change: WatchedEvent state:SyncConnected type:NodeDataChanged path:/clusterstate.json, has occurred - updating... (live nodes size: 1)
   [junit4]   2> 1285189 INFO  (zkCallback-1496-thread-1-processing-n:127.0.0.1:64552_fnfj%2Fhk) [n:127.0.0.1:64552_fnfj%2Fhk    ] o.a.s.c.c.ZkStateReader Updated cluster state version to 1
   [junit4]   2> 1286072 INFO  (coreLoadExecutor-3053-thread-1-processing-n:127.0.0.1:64552_fnfj%2Fhk) [n:127.0.0.1:64552_fnfj%2Fhk c:control_collection   x:collection1] o.a.s.c.ZkController waiting to find shard id in clusterstate for collection1
   [junit4]   2> 1286072 INFO  (coreLoadExecutor-3053-thread-1-processing-n:127.0.0.1:64552_fnfj%2Fhk) [n:127.0.0.1:64552_fnfj%2Fhk c:control_collection   x:collection1] o.a.s.c.ZkController Check for collection zkNode:control_collection
   [junit4]   2> 1286072 INFO  (coreLoadExecutor-3053-thread-1-processing-n:127.0.0.1:64552_fnfj%2Fhk) [n:127.0.0.1:64552_fnfj%2Fhk c:control_collection   x:collection1] o.a.s.c.ZkController Collection zkNode exists
   [junit4]   2> 1286073 INFO  (coreLoadExecutor-3053-thread-1-processing-n:127.0.0.1:64552_fnfj%2Fhk) [n:127.0.0.1:64552_fnfj%2Fhk c:control_collection   x:collection1] o.a.s.c.c.ZkStateReader Load collection config from:/collections/control_collection
   [junit4]   2> 1286073 INFO  (coreLoadExecutor-3053-thread-1-processing-n:127.0.0.1:64552_fnfj%2Fhk) [n:127.0.0.1:64552_fnfj%2Fhk c:control_collection   x:collection1] o.a.s.c.c.ZkStateReader path=/collections/control_collection configName=conf1 specified config exists in ZooKeeper
   [junit4]   2> 1286074 INFO  (coreLoadExecutor-3053-thread-1-processing-n:127.0.0.1:64552_fnfj%2Fhk) [n:127.0.0.1:64552_fnfj%2Fhk c:control_collection   x:collection1] o.a.s.c.SolrResourceLoader new SolrResourceLoader for directory: 'C:\Users\JenkinsSlave\workspace\Lucene-Solr-trunk-Windows\solr\build\solr-core\test\J0\temp\solr.cloud.TestRandomRequestDistribution_91A74DC39822159C-001\control-001\cores\collection1\'
   [junit4]   2> 1286088 INFO  (coreLoadExecutor-3053-thread-1-processing-n:127.0.0.1:64552_fnfj%2Fhk) [n:127.0.0.1:64552_fnfj%2Fhk c:control_collection   x:collection1] o.a.s.c.Config loaded config solrconfig.xml with version 0
   [junit4]   2> 1286094 INFO  (coreLoadExecutor-3053-thread-1-processing-n:127.0.0.1:64552_fnfj%2Fhk) [n:127.0.0.1:64552_fnfj%2Fhk c:control_collection   x:collection1] o.a.s.c.SolrConfig current version of requestparams : -1
   [junit4]   2> 1286096 INFO  (coreLoadExecutor-3053-thread-1-processing-n:127.0.0.1:64552_fnfj%2Fhk) [n:127.0.0.1:64552_fnfj%2Fhk c:control_collection   x:collection1] o.a.s.c.SolrConfig Using Lucene MatchVersion: 6.0.0
   [junit4]   2> 1286101 INFO  (coreLoadExecutor-3053-thread-1-processing-n:127.0.0.1:64552_fnfj%2Fhk) [n:127.0.0.1:64552_fnfj%2Fhk c:control_collection   x:collection1] o.a.s.c.Config Loaded SolrConfig: solrconfig.xml
   [junit4]   2> 1286103 INFO  (coreLoadExecutor-3053-thread-1-processing-n:127.0.0.1:64552_fnfj%2Fhk) [n:127.0.0.1:64552_fnfj%2Fhk c:control_collection   x:collection1] o.a.s.s.IndexSchema Reading Solr Schema from /configs/conf1/schema.xml
   [junit4]   2> 1286106 INFO  (coreLoadExecutor-3053-thread-1-processing-n:127.0.0.1:64552_fnfj%2Fhk) [n:127.0.0.1:64552_fnfj%2Fhk c:control_collection   x:collection1] o.a.s.s.IndexSchema [collection1] Schema name=test
   [junit4]   2> 1286170 INFO  (coreLoadExecutor-3053-thread-1-processing-n:127.0.0.1:64552_fnfj%2Fhk) [n:127.0.0.1:64552_fnfj%2Fhk c:control_collection   x:collection1] o.a.s.s.OpenExchangeRatesOrgProvider Initialized with rates=open-exchange-rates.json, refreshInterval=1440.
   [junit4]   2> 1286177 INFO  (coreLoadExecutor-3053-thread-1-processing-n:127.0.0.1:64552_fnfj%2Fhk) [n:127.0.0.1:64552_fnfj%2Fhk c:control_collection   x:collection1] o.a.s.s.IndexSchema default search field in schema is text
   [junit4]   2> 1286178 INFO  (coreLoadExecutor-3053-thread-1-processing-n:127.0.0.1:64552_fnfj%2Fhk) [n:127.0.0.1:64552_fnfj%2Fhk c:control_collection   x:collection1] o.a.s.s.IndexSchema unique key field: id
   [junit4]   2> 1286190 INFO  (coreLoadExecutor-3053-thread-1-processing-n:127.0.0.1:64552_fnfj%2Fhk) [n:127.0.0.1:64552_fnfj%2Fhk c:control_collection   x:collection1] o.a.s.s.FileExchangeRateProvider Reloading exchange rates from file currency.xml
   [junit4]   2> 1286193 INFO  (coreLoadExecutor-3053-thread-1-processing-n:127.0.0.1:64552_fnfj%2Fhk) [n:127.0.0.1:64552_fnfj%2Fhk c:control_collection   x:collection1] o.a.s.s.FileExchangeRateProvider Reloading exchange rates from file currency.xml
   [junit4]   2> 1286194 INFO  (coreLoadExecutor-3053-thread-1-processing-n:127.0.0.1:64552_fnfj%2Fhk) [n:127.0.0.1:64552_fnfj%2Fhk c:control_collection   x:collection1] o.a.s.s.OpenExchangeRatesOrgProvider Reloading exchange rates from open-exchange-rates.json
   [junit4]   2> 1286196 WARN  (coreLoadExecutor-3053-thread-1-processing-n:127.0.0.1:64552_fnfj%2Fhk) [n:127.0.0.1:64552_fnfj%2Fhk c:control_collection   x:collection1] o.a.s.s.OpenExchangeRatesOrgProvider Unknown key IMPORTANT NOTE
   [junit4]   2> 1286196 WARN  (coreLoadExecutor-3053-thread-1-processing-n:127.0.0.1:64552_fnfj%2Fhk) [n:127.0.0.1:64552_fnfj%2Fhk c:control_collection   x:collection1] o.a.s.s.OpenExchangeRatesOrgProvider Expected key, got STRING
   [junit4]   2> 1286197 INFO  (coreLoadExecutor-3053-thread-1-processing-n:127.0.0.1:64552_fnfj%2Fhk) [n:127.0.0.1:64552_fnfj%2Fhk c:control_collection   x:collection1] o.a.s.s.OpenExchangeRatesOrgProvider Reloading exchange rates from open-exchange-rates.json
   [junit4]   2> 1286200 WARN  (coreLoadExecutor-3053-thread-1-processing-n:127.0.0.1:64552_fnfj%2Fhk) [n:127.0.0.1:64552_fnfj%2Fhk c:control_collection   x:collection1] o.a.s.s.OpenExchangeRatesOrgProvider Unknown key IMPORTANT NOTE
   [junit4]   2> 1286200 WARN  (coreLoadExecutor-3053-thread-1-processing-n:127.0.0.1:64552_fnfj%2Fhk) [n:127.0.0.1:64552_fnfj%2Fhk c:control_collection   x:collection1] o.a.s.s.OpenExchangeRatesOrgProvider Expected key, got STRING
   [junit4]   2> 1286200 INFO  (coreLoadExecutor-3053-thread-1-processing-n:127.0.0.1:64552_fnfj%2Fhk) [n:127.0.0.1:64552_fnfj%2Fhk c:control_collection   x:collection1] o.a.s.c.CoreContainer Creating SolrCore 'collection1' using configuration from collection control_collection
   [junit4]   2> 1286200 INFO  (coreLoadExecutor-3053-thread-1-processing-n:127.0.0.1:64552_fnfj%2Fhk) [n:127.0.0.1:64552_fnfj%2Fhk c:control_collection s:shard1 r:core_node1 x:collection1] o.a.s.c.SolrCore org.apache.solr.core.MockDirectoryFactory
   [junit4]   2> 1286200 INFO  (coreLoadExecutor-3053-thread-1-processing-n:127.0.0.1:64552_fnfj%2Fhk) [n:127.0.0.1:64552_fnfj%2Fhk c:control_collection s:shard1 r:core_node1 x:collection1] o.a.s.c.SolrCore [[collection1] ] Opening new SolrCore at [C:\Users\JenkinsSlave\workspace\Lucene-Solr-trunk-Windows\solr\build\solr-core\test\J0\temp\solr.cloud.TestRandomRequestDistribution_91A74DC39822159C-001\control-001\cores\collection1\], dataDir=[null]
   [junit4]   2> 1286200 INFO  (coreLoadExecutor-3053-thread-1-processing-n:127.0.0.1:64552_fnfj%2Fhk) [n:127.0.0.1:64552_fnfj%2Fhk c:control_collection s:shard1 r:core_node1 x:collection1] o.a.s.c.JmxMonitoredMap JMX monitoring is enabled. Adding Solr mbeans to JMX Server: com.sun.jmx.mbeanserver.JmxMBeanServer@23a0fd92
   [junit4]   2> 1286200 INFO  (coreLoadExecutor-3053-thread-1-processing-n:127.0.0.1:64552_fnfj%2Fhk) [n:127.0.0.1:64552_fnfj%2Fhk c:control_collection s:shard1 r:core_node1 x:collection1] o.a.s.c.CachingDirectoryFactory return new directory for C:\Users\JenkinsSlave\workspace\Lucene-Solr-trunk-Windows\solr\build\solr-core\test\J0\temp\solr.cloud.TestRandomRequestDistribution_91A74DC39822159C-001\control-001\cores\collection1\data\
   [junit4]   2> 1286200 INFO  (coreLoadExecutor-3053-thread-1-processing-n:127.0.0.1:64552_fnfj%2Fhk) [n:127.0.0.1:64552_fnfj%2Fhk c:control_collection s:shard1 r:core_node1 x:collection1] o.a.s.c.SolrCore New index directory detected: old=null new=C:\Users\JenkinsSlave\workspace\Lucene-Solr-trunk-Windows\solr\build\solr-core\test\J0\temp\solr.cloud.TestRandomRequestDistribution_91A74DC39822159C-001\control-001\cores\collection1\data\index/
   [junit4]   2> 1286200 WARN  (coreLoadExecutor-3053-thread-1-processing-n:127.0.0.1:64552_fnfj%2Fhk) [n:127.0.0.1:64552_fnfj%2Fhk c:control_collection s:shard1 r:core_node1 x:collection1] o.a.s.c.SolrCore [collection1] Solr index directory 'C:\Users\JenkinsSlave\workspace\Lucene-Solr-trunk-Windows\solr\build\solr-core\test\J0\temp\solr.cloud.TestRandomRequestDistribution_91A74DC39822159C-001\control-001\cores\collection1\data\index' doesn't exist. Creating new index...
   [junit4]   2> 1286201 INFO  (coreLoadExecutor-3053-thread-1-processing-n:127.0.0.1:64552_fnfj%2Fhk) [n:127.0.0.1:64552_fnfj%2Fhk c:control_collection s:shard1 r:core_node1 x:collection1] o.a.s.c.CachingDirectoryFactory return new directory for C:\Users\JenkinsSlave\workspace\Lucene-Solr-trunk-Windows\solr\build\solr-core\test\J0\temp\solr.cloud.TestRandomRequestDistribution_91A74DC39822159C-001\control-001\cores\collection1\data\index
   [junit4]   2> 1286202 INFO  (coreLoadExecutor-3053-thread-1-processing-n:127.0.0.1:64552_fnfj%2Fhk) [n:127.0.0.1:64552_fnfj%2Fhk c:control_collection s:shard1 r:core_node1 x:collection1] o.a.s.u.RandomMergePolicy RandomMergePolicy wrapping class org.apache.lucene.index.TieredMergePolicy: [TieredMergePolicy: maxMergeAtOnce=45, maxMergeAtOnceExplicit=13, maxMergedSegmentMB=53.4697265625, floorSegmentMB=0.2802734375, forceMergeDeletesPctAllowed=28.24203996738607, segmentsPerTier=48.0, maxCFSSegmentSizeMB=8.796093022207999E12, noCFSRatio=0.2973786302493764
   [junit4]   2> 1286202 INFO  (coreLoadExecutor-3053-thread-1-processing-n:127.0.0.1:64552_fnfj%2Fhk) [n:127.0.0.1:64552_fnfj%2Fhk c:control_collection s:shard1 r:core_node1 x:collection1] o.a.s.c.SolrCore SolrDeletionPolicy.onCommit: commits: num=1
   [junit4]   2> commit{dir=MockDirectoryWrapper(RAMDirectory@5c44c1a1 lockFactory=org.apache.lucene.store.SingleInstanceLockFactory@6aceecce),segFN=segments_1,generation=1}
   [junit4]   2> 1286202 INFO  (coreLoadExecutor-3053-thread-1-processing-n:127.0.0.1:64552_fnfj%2Fhk) [n:127.0.0.1:64552_fnfj%2Fhk c:control_collection s:shard1 r:core_node1 x:collection1] o.a.s.c.SolrCore newest commit generation = 1
   [junit4]   2> 1286206 INFO  (coreLoadExecutor-3053-thread-1-processing-n:127.0.0.1:64552_fnfj%2Fhk) [n:127.0.0.1:64552_fnfj%2Fhk c:control_collection s:shard1 r:core_node1 x:collection1] o.a.s.u.p.UpdateRequestProcessorChain creating updateRequestProcessorChain "nodistrib"
   [junit4]   2> 1286206 INFO  (coreLoadExecutor-3053-thread-1-processing-n:127.0.0.1:64552_fnfj%2Fhk) [n:127.0.0.1:64552_fnfj%2Fhk c:control_collection s:shard1 r:core_node1 x:collection1] o.a.s.u.p.UpdateRequestProcessorChain creating updateRequestProcessorChain "dedupe"
   [junit4]   2> 1286206 INFO  (coreLoadExecutor-3053-thread-1-processing-n:127.0.0.1:64552_fnfj%2Fhk) [n:127.0.0.1:64552_fnfj%2Fhk c:control_collection s:shard1 r:core_node1 x:collection1] o.a.s.u.p.UpdateRequestProcessorChain inserting DistributedUpdateProcessorFactory into updateRequestProcessorChain "dedupe"
   [junit4]   2> 1286206 INFO  (OldIndexDirectoryCleanupThreadForCore-collection1) [n:127.0.0.1:64552_fnfj%2Fhk c:control_collection s:shard1 r:core_node1 x:collection1] o.a.s.c.SolrCore Looking for old index directories to cleanup for core collection1 in C:\Users\JenkinsSlave\workspace\Lucene-Solr-trunk-Windows\solr\build\solr-core\test\J0\temp\solr.cloud.TestRandomRequestDistribution_91A74DC39822159C-001\control-001\cores\collection1\data\
   [junit4]   2> 1286207 INFO  (coreLoadExecutor-3053-thread-1-processing-n:127.0.0.1:64552_fnfj%2Fhk) [n:127.0.0.1:64552_fnfj%2Fhk c:control_collection s:shard1 r:core_node1 x:collection1] o.a.s.u.p.UpdateRequestProcessorChain creating updateRequestProcessorChain "stored_sig"
   [junit4]   2> 1286209 INFO  (coreLoadExecutor-3053-thread-1-processing-n:127.0.0.1:64552_fnfj%2Fhk) [n:127.0.0.1:64552_fnfj%2Fhk c:control_collection s:shard1 r:core_node1 x:collection1] o.a.s.u.p.UpdateRequestProcessorChain inserting DistributedUpdateProcessorFactory into updateRequestProcessorChain "stored_sig"
   [junit4]   2> 1286210 INFO  (coreLoadExecutor-3053-thread-1-processing-n:127.0.0.1:64552_fnfj%2Fhk) [n:127.0.0.1:64552_fnfj%2Fhk c:control_collection s:shard1 r:core_node1 x:collection1] o.a.s.u.p.UpdateRequestProcessorChain creating updateRequestProcessorChain "distrib-dup-test-chain-explicit"
   [junit4]   2> 1286210 WARN  (OldIndexDirectoryCleanupThreadForCore-collection1) [n:127.0.0.1:64552_fnfj%2Fhk c:control_collection s:shard1 r:core_node1 x:collection1] o.a.s.c.DirectoryFactory C:\Users\JenkinsSlave\workspace\Lucene-Solr-trunk-Windows\solr\build\solr-core\test\J0\temp\solr.cloud.TestRandomRequestDistribution_91A74DC39822159C-001\control-001\cores\collection1\data\ does not point to a valid data directory; skipping clean-up of old index directories.
   [junit4]   2> 1286210 INFO  (coreLoadExecutor-3053-thread-1-processing-n:127.0.0.1:64552_fnfj%2Fhk) [n:127.0.0.1:64552_fnfj%2Fhk c:control_collection s:shard1 r:core_node1 x:collection1] o.a.s.u.p.UpdateRequestProcessorChain creating updateRequestProcessorChain "distrib-dup-test-chain-implicit"
   [junit4]   2> 1286210 INFO  (coreLoadExecutor-3053-thread-1-processing-n:127.0.0.1:64552_fnfj%2Fhk) [n:127.0.0.1:64552_fnfj%2Fhk c:control_collection s:shard1 r:core_node1 x:collection1] o.a.s.u.p.UpdateRequestProcessorChain inserting DistributedUpdateProcessorFactory into updateRequestProcessorChain "distrib-dup-test-chain-implicit"
   [junit4]   2> 1286210 INFO  (coreLoadExecutor-3053-thread-1-processing-n:127.0.0.1:64552_fnfj%2Fhk) [n:127.0.0.1:64552_fnfj%2Fhk c:control_collection s:shard1 r:core_node1 x:collection1] o.a.s.c.SolrCore no updateRequestProcessorChain defined as default, creating implicit default
   [junit4]   2> 1286215 INFO  (coreLoadExecutor-3053-thread-1-processing-n:127.0.0.1:64552_fnfj%2Fhk) [n:127.0.0.1:64552_fnfj%2Fhk c:control_collection s:shard1 r:core_node1 x:collection1] o.a.s.h.l.XMLLoader xsltCacheLifetimeSeconds=60
   [junit4]   2> 1286216 INFO  (coreLoadExecutor-3053-thread-1-processing-n:127.0.0.1:64552_fnfj%2Fhk) [n:127.0.0.1:64552_fnfj%2Fhk c:control_collection s:shard1 r:core_node1 x:collection1] o.a.s.h.l.XMLLoader xsltCacheLifetimeSeconds=60
   [junit4]   2> 1286217 INFO  (coreLoadExecutor-3053-thread-1-processing-n:127.0.0.1:64552_fnfj%2Fhk) [n:127.0.0.1:64552_fnfj%2Fhk c:control_collection s:shard1 r:core_node1 x:collection1] o.a.s.h.l.XMLLoader xsltCacheLifetimeSeconds=60
   [junit4]   2> 1286218 INFO  (coreLoadExecutor-3053-thread-1-processing-n:127.0.0.1:64552_fnfj%2Fhk) [n:127.0.0.1:64552_fnfj%2Fhk c:control_collection s:shard1 r:core_node1 x:collection1] o.a.s.h.l.XMLLoader xsltCacheLifetimeSeconds=60
   [junit4]   2> 1286220 INFO  (coreLoadExecutor-3053-thread-1-processing-n:127.0.0.1:64552_fnfj%2Fhk) [n:127.0.0.1:64552_fnfj%2Fhk c:control_collection s:shard1 r:core_node1 x:collection1] o.a.s.c.RequestHandlers Registered paths: /admin/mbeans,standard,/update/csv,/update/json/docs,/admin/luke,/admin/segments,/get,/admin/system,/replication,/admin/properties,/config,/schema,/admin/plugins,/admin/logging,/update/json,/admin/threads,/admin/ping,/update,/admin/file
   [junit4]   2> 1286220 INFO  (coreLoadExecutor-3053-thread-1-processing-n:127.0.0.1:64552_fnfj%2Fhk) [n:127.0.0.1:64552_fnfj%2Fhk c:control_collection s:shard1 r:core_node1 x:collection1] o.a.s.c.SolrCore Using default statsCache cache: org.apache.solr.search.stats.LocalStatsCache
   [junit4]   2> 1286221 INFO  (coreLoadExecutor-3053-thread-1-processing-n:127.0.0.1:64552_fnfj%2Fhk) [n:127.0.0.1:64552_fnfj%2Fhk c:control_collection s:shard1 r:core_node1 x:collection1] o.a.s.u.UpdateHandler Using UpdateLog implementation: org.apache.solr.update.UpdateLog
   [junit4]   2> 1286221 INFO  (coreLoadExecutor-3053-thread-1-processing-n:127.0.0.1:64552_fnfj%2Fhk) [n:127.0.0.1:64552_fnfj%2Fhk c:control_collection s:shard1 r:core_node1 x:collection1] o.a.s.u.UpdateLog Initializing UpdateLog: dataDir= defaultSyncLevel=FLUSH numRecordsToKeep=100 maxNumLogsToKeep=10 numVersionBuckets=65536
   [junit4]   2> 1286222 INFO  (coreLoadExecutor-3053-thread-1-processing-n:127.0.0.1:64552_fnfj%2Fhk) [n:127.0.0.1:64552_fnfj%2Fhk c:control_collection s:shard1 r:core_node1 x:collection1] o.a.s.c.SolrCore Hard AutoCommit: disabled
   [junit4]   2> 1286223 INFO  (coreLoadExecutor-3053-thread-1-processing-n:127.0.0.1:64552_fnfj%2Fhk) [n:127.0.0.1:64552_fnfj%2Fhk c:control_collection s:shard1 r:core_node1 x:collection1] o.a.s.c.SolrCore Soft AutoCommit: disabled
   [junit4]   2> 1286223 INFO  (coreLoadExecutor-3053-thread-1-processing-n:127.0.0.1:64552_fnfj%2Fhk) [n:127.0.0.1:64552_fnfj%2Fhk c:control_collection s:shard1 r:core_node1 x:collection1] o.a.s.u.RandomMergePolicy RandomMergePolicy wrapping class org.apache.lucene.index.LogByteSizeMergePolicy: [LogByteSizeMergePolicy: minMergeSize=1677721, mergeFactor=28, maxMergeSize=2147483648, maxMergeSizeForForcedMerge=9223372036854775807, calibrateSizeByDeletes=false, maxMergeDocs=2147483647, maxCFSSegmentSizeMB=8.796093022207999E12, noCFSRatio=0.7533735558681536]
   [junit4]   2> 1286223 INFO  (coreLoadExecutor-3053-thread-1-processing-n:127.0.0.1:64552_fnfj%2Fhk) [n:127.0.0.1:64552_fnfj%2Fhk c:control_collection s:shard1 r:core_node1 x:collection1] o.a.s.c.SolrCore SolrDeletionPolicy.onInit: commits: num=1
   [junit4]   2> commit{dir=MockDirectoryWrapper(RAMDirectory@5c44c1a1 lockFactory=org.apache.lucene.store.SingleInstanceLockFactory@6aceecce),segFN=segments_1,generation=1}
   [junit4]   2> 1286224 INFO  (coreLoadExecutor-3053-thread-1-processing-n:127.0.0.1:64552_fnfj%2Fhk) [n:127.0.0.1:64552_fnfj%2Fhk c:control_collection s:shard1 r:core_node1 x:collection1] o.a.s.c.SolrCore newest commit generation = 1
   [junit4]   2> 1286224 INFO  (coreLoadExecutor-3053-thread-1-processing-n:127.0.0.1:64552_fnfj%2Fhk) [n:127.0.0.1:64552_fnfj%2Fhk c:control_collection s:shard1 r:core_node1 x:collection1] o.a.s.s.SolrIndexSearcher Opening Searcher@504b7221[collection1] main
   [junit4]   2> 1286224 INFO  (coreLoadExecutor-3053-thread-1-processing-n:127.0.0.1:64552_fnfj%2Fhk) [n:127.0.0.1:64552_fnfj%2Fhk c:control_collection s:shard1 r:core_node1 x:collection1] o.a.s.c.c.ZkStateReader Load collection config from:/collections/control_collection
   [junit4]   2> 1286225 INFO  (coreLoadExecutor-3053-thread-1-processing-n:127.0.0.1:64552_fnfj%2Fhk) [n:127.0.0.1:64552_fnfj%2Fhk c:control_collection s:shard1 r:core_node1 x:collection1] o.a.s.c.c.ZkStateReader path=/collections/control_collection configName=conf1 specified config exists in ZooKeeper
   [junit4]   2> 1286225 INFO  (coreLoadExecutor-3053-thread-1-processing-n:127.0.0.1:64552_fnfj%2Fhk) [n:127.0.0.1:64552_fnfj%2Fhk c:control_collection s:shard1 r:core_node1 x:collection1] o.a.s.r.ManagedResourceStorage Setting up ZooKeeper-based storage for the RestManager with znodeBase: /configs/conf1
   [junit4]   2> 1286225 INFO  (coreLoadExecutor-3053-thread-1-processing-n:127.0.0.1:64552_fnfj%2Fhk) [n:127.0.0.1:64552_fnfj%2Fhk c:control_collection s:shard1 r:core_node1 x:collection1] o.a.s.r.ManagedResourceStorage Configured ZooKeeperStorageIO with znodeBase: /configs/conf1
   [junit4]   2> 1286225 INFO  (coreLoadExecutor-3053-thread-1-processing-n:127.0.0.1:64552_fnfj%2Fhk) [n:127.0.0.1:64552_fnfj%2Fhk c:control_collection s:shard1 r:core_node1 x:collection1] o.a.s.r.RestManager Initializing RestManager with initArgs: {}
   [junit4]   2> 1286225 INFO  (coreLoadExecutor-3053-thread-1-processing-n:127.0.0.1:64552_fnfj%2Fhk) [n:127.0.0.1:64552_fnfj%2Fhk c:control_collection s:shard1 r:core_node1 x:collection1] o.a.s.r.ManagedResourceStorage Reading _rest_managed.json using ZooKeeperStorageIO:path=/configs/conf1
   [junit4]   2> 1286225 INFO  (coreLoadExecutor-3053-thread-1-processing-n:127.0.0.1:64552_fnfj%2Fhk) [n:127.0.0.1:64552_fnfj%2Fhk c:control_collection s:shard1 r:core_node1 x:collection1] o.a.s.r.ManagedResourceStorage No data found for znode /configs/conf1/_rest_managed.json
   [junit4]   2> 1286225 INFO  (coreLoadExecutor-3053-thread-1-processing-n:127.0.0.1:64552_fnfj%2Fhk) [n:127.0.0.1:64552_fnfj%2Fhk c:control_collection s:shard1 r:core_node1 x:collection1] o.a.s.r.ManagedResourceStorage Loaded null at path _rest_managed.json using ZooKeeperStorageIO:path=/configs/conf1
   [junit4]   2> 1286226 INFO  (coreLoadExecutor-3053-thread-1-processing-n:127.0.0.1:64552_fnfj%2Fhk) [n:127.0.0.1:64552_fnfj%2Fhk c:control_collection s:shard1 r:core_node1 x:collection1] o.a.s.r.RestManager Initializing 0 registered ManagedResources
   [junit4]   2> 1286226 INFO  (coreLoadExecutor-3053-thread-1-processing-n:127.0.0.1:64552_fnfj%2Fhk) [n:127.0.0.1:64552_fnfj%2Fhk c:control_collection s:shard1 r:core_node1 x:collection1] o.a.s.h.ReplicationHandler Commits will be reserved for  10000
   [junit4]   2> 1286226 INFO  (searcherExecutor-3054-thread-1-processing-n:127.0.0.1:64552_fnfj%2Fhk x:collection1 s:shard1 c:control_collection r:core_node1) [n:127.0.0.1:64552_fnfj%2Fhk c:control_collection s:shard1 r:core_node1 x:collection1] o.a.s.c.SolrCore [collection1] Registered new searcher Searcher@504b7221[collection1] main{ExitableDirectoryReader(UninvertingDirectoryReader())}
   [junit4]   2> 1286226 INFO  (coreLoadExecutor-3053-thread-1-processing-n:127.0.0.1:64552_fnfj%2Fhk) [n:127.0.0.1:64552_fnfj%2Fhk c:control_collection s:shard1 r:core_node1 x:collection1] o.a.s.u.UpdateLog Looking up max value of version field to seed version buckets
   [junit4]   2> 1286226 INFO  (coreLoadExecutor-3053-thread-1-processing-n:127.0.0.1:64552_fnfj%2Fhk) [n:127.0.0.1:64552_fnfj%2Fhk c:control_collection s:shard1 r:core_node1 x:collection1] o.a.s.u.VersionInfo Refreshing highest value of _version_ for 65536 version buckets from index
   [junit4]   2> 1286227 INFO  (coreLoadExecutor-3053-thread-1-processing-n:127.0.0.1:64552_fnfj%2Fhk) [n:127.0.0.1:64552_fnfj%2Fhk c:control_collection s:shard1 r:core_node1 x:collection1] o.a.s.u.VersionInfo No terms found for _version_, cannot seed version bucket highest value from index
   [junit4]   2> 1286227 INFO  (coreLoadExecutor-3053-thread-1-processing-n:127.0.0.1:64552_fnfj%2Fhk) [n:127.0.0.1:64552_fnfj%2Fhk c:control_collection s:shard1 r:core_node1 x:collection1] o.a.s.u.UpdateLog Could not find max version in index or recent updates, using new clock 1505307983714713600
   [junit4]   2> 1286229 INFO  (coreLoadExecutor-3053-thread-1-processing-n:127.0.0.1:64552_fnfj%2Fhk) [n:127.0.0.1:64552_fnfj%2Fhk c:control_collection s:shard1 r:core_node1 x:collection1] o.a.s.u.UpdateLog Took 3 ms to seed version buckets with highest version 1505307983714713600
   [junit4]   2> 1286229 INFO  (coreLoadExecutor-3053-thread-1-processing-n:127.0.0.1:64552_fnfj%2Fhk) [n:127.0.0.1:64552_fnfj%2Fhk c:control_collection s:shard1 r:core_node1 x:collection1] o.a.s.c.ZkController watch zkdir /configs/conf1
   [junit4]   2> 1286230 INFO  (coreLoadExecutor-3053-thread-1-processing-n:127.0.0.1:64552_fnfj%2Fhk) [n:127.0.0.1:64552_fnfj%2Fhk c:control_collection s:shard1 r:core_node1 x:collection1] o.a.s.c.CoreContainer registering core: collection1
   [junit4]   2> 1286230 INFO  (coreZkRegister-3047-thread-1-processing-n:127.0.0.1:64552_fnfj%2Fhk x:collection1 s:shard1 c:control_collection r:core_node1) [n:127.0.0.1:64552_fnfj%2Fhk c:control_collection s:shard1 r:core_node1 x:collection1] o.a.s.c.ZkController Register replica - core:collection1 address:http://127.0.0.1:64552/fnfj/hk collection:control_collection shard:shard1
   [junit4]   2> 1286232 INFO  (coreZkRegister-3047-thread-1-processing-n:127.0.0.1:64552_fnfj%2Fhk x:collection1 s:shard1 c:control_collection r:core_node1) [n:127.0.0.1:64552_fnfj%2Fhk c:control_collection s:shard1 r:core_node1 x:collection1] o.a.s.c.c.SolrZkClient makePath: /collections/control_collection/leader_elect/shard1/election
   [junit4]   2> 1286235 INFO  (coreZkRegister-3047-thread-1-processing-n:127.0.0.1:64552_fnfj%2Fhk x:collection1 s:shard1 c:control_collection r:core_node1) [n:127.0.0.1:64552_fnfj%2Fhk c:control_collection s:shard1 r:core_node1 x:collection1] o.a.s.c.LeaderElector Joined leadership election with path: /collections/control_collection/leader_elect/shard1/election/94081748872855555-core_node1-n_0000000000
   [junit4]   2> 1286236 INFO  (coreZkRegister-3047-thread-1-processing-n:127.0.0.1:64552_fnfj%2Fhk x:collection1 s:shard1 c:control_collection r:core_node1) [n:127.0.0.1:64552_fnfj%2Fhk c:control_collection s:shard1 r:core_node1 x:collection1] o.a.s.c.ShardLeaderElectionContext Running the leader process for shard shard1
   [junit4]   2> 1286238 INFO  (zkCallback-1496-thread-1-processing-n:127.0.0.1:64552_fnfj%2Fhk) [n:127.0.0.1:64552_fnfj%2Fhk    ] o.a.s.c.DistributedQueue NodeChildrenChanged fired on path /overseer/queue state SyncConnected
   [junit4]   2> 1286238 INFO  (coreZkRegister-3047-thread-1-processing-n:127.0.0.1:64552_fnfj%2Fhk x:collection1 s:shard1 c:control_collection r:core_node1) [n:127.0.0.1:64552_fnfj%2Fhk c:control_collection s:shard1 r:core_node1 x:collection1] o.a.s.c.ShardLeaderElectionContext Enough replicas found to continue.
   [junit4]   2> 1286238 INFO  (coreZkRegister-3047-thread-1-processing-n:127.0.0.1:64552_fnfj%2Fhk x:collection1 s:shard1 c:control_collection r:core_node1) [n:127.0.0.1:64552_fnfj%2Fhk c:control_collection s:shard1 r:core_node1 x:collection1] o.a.s.c.ShardLeaderElectionContext I may be the new leader - try and sync
   [junit4]   2> 1286238 INFO  (coreZkRegister-3047-thread-1-processing-n:127.0.0.1:64552_fnfj%2Fhk x:collection1 s:shard1 c:control_collection r:core_node1) [n:127.0.0.1:64552_fnfj%2Fhk c:control_collection s:shard1 r:core_node1 x:collection1] o.a.s.c.SyncStrategy Sync replicas to http://127.0.0.1:64552/fnfj/hk/collection1/
   [junit4]   2> 1286238 INFO  (coreZkRegister-3047-thread-1-processing-n:127.0.0.1:64552_fnfj%2Fhk x:collection1 s:shard1 c:control_collection r:core_node1) [n:127.0.0.1:64552_fnfj%2Fhk c:control_collection s:shard1 r:core_node1 x:collection1] o.a.s.c.SyncStrategy Sync Success - now sync replicas to me
   [junit4]   2> 1286238 INFO  (OverseerStateUpdate-94081748872855555-127.0.0.1:64552_fnfj%2Fhk-n_0000000000) [n:127.0.0.1:64552_fnfj%2Fhk    ] o.a.s.c.Overseer processMessage: queueSize: 1, message = {
   [junit4]   2>   "operation":"leader",
   [junit4]   2>   "shard":"shard1",
   [junit4]   2>   "collection":"control_collection"} current state version: 1
   [junit4]   2> 1286238 INFO  (coreZkRegister-3047-thread-1-processing-n:127.0.0.1:64552_fnfj%2Fhk x:collection1 s:shard1 c:control_collection r:core_node1) [n:127.0.0.1:64552_fnfj%2Fhk c:control_collection s:shard1 r:core_node1 x:collection1] o.a.s.c.SyncStrategy http://127.0.0.1:64552/fnfj/hk/collection1/ has no replicas
   [junit4]   2> 1286239 INFO  (coreZkRegister-3047-thread-1-processing-n:127.0.0.1:64552_fnfj%2Fhk x:collection1 s:shard1 c:control_collection r:core_node1) [n:127.0.0.1:64552_fnfj%2Fhk c:control_collection s:shard1 r:core_node1 x:collection1] o.a.s.c.ShardLeaderElectionContext I am the new leader: http://127.0.0.1:64552/fnfj/hk/collection1/ shard1
   [junit4]   2> 1286239 INFO  (coreZkRegister-3047-thread-1-processing-n:127.0.0.1:64552_fnfj%2Fhk x:collection1 s:shard1 c:control_collection r:core_node1) [n:127.0.0.1:64552_fnfj%2Fhk c:control_collection s:shard1 r:core_node1 x:collection1] o.a.s.c.c.SolrZkClient makePath: /collections/control_collection/leaders/shard1
   [junit4]   2> 1286244 INFO  (zkCallback-1496-thread-1-processing-n:127.0.0.1:64552_fnfj%2Fhk) [n:127.0.0.1:64552_fnfj%2Fhk    ] o.a.s.c.DistributedQueue NodeChildrenChanged fired on path /overseer/queue state SyncConnected
   [junit4]   2> 1286245 INFO  (OverseerStateUpdate-94081748872855555-127.0.0.1:64552_fnfj%2Fhk-n_0000000000) [n:127.0.0.1:64552_fnfj%2Fhk    ] o.a.s.c.Overseer processMessage: queueSize: 1, message = {
   [junit4]   2>   "operation":"leader",
   [junit4]   2>   "shard":"shard1",
   [junit4]   2>   "collection":"control_collection",
   [junit4]   2>   "base_url":"http://127.0.0.1:64552/fnfj/hk",
   [junit4]   2>   "core":"collection1",
   [junit4]   2>   "state":"active"} current state version: 1
   [junit4]   2> 1286340 INFO  (zkCallback-1496-thread-1-processing-n:127.0.0.1:64552_fnfj%2Fhk) [n:127.0.0.1:64552_fnfj%2Fhk    ] o.a.s.c.c.ZkStateReader A cluster state change: WatchedEvent state:SyncConnected type:NodeDataChanged path:/clusterstate.json, has occurred - updating... (live nodes size: 1)
   [junit4]   2> 1286341 INFO  (zkCallback-1496-thread-1-processing-n:127.0.0.1:64552_fnfj%2Fhk) [n:127.0.0.1:64552_fnfj%2Fhk    ] o.a.s.c.c.ZkStateReader Updated cluster state version to 2
   [junit4]   2> 1286380 INFO  (coreZkRegister-3047-thread-1-processing-n:127.0.0.1:64552_fnfj%2Fhk x:collection1 s:shard1 c:control_collection r:core_node1) [n:127.0.0.1:64552_fnfj%2Fhk c:control_collection s:shard1 r:core_node1 x:collection1] o.a.s.c.ZkController We are http://127.0.0.1:64552/fnfj/hk/collection1/ and leader is http://127.0.0.1:64552/fnfj/hk/collection1/
   [junit4]   2> 1286380 INFO  (coreZkRegister-3047-thread-1-processing-n:127.0.0.1:64552_fnfj%2Fhk x:collection1 s:shard1 c:control_collection r:core_node1) [n:127.0.0.1:64552_fnfj%2Fhk c:control_collection s:shard1 r:core_node1 x:collection1] o.a.s.c.ZkController No LogReplay needed for core=collection1 baseURL=http://127.0.0.1:64552/fnfj/hk
   [junit4]   2> 1286380 INFO  (coreZkRegister-3047-thread-1-processing-n:127.0.0.1:64552_fnfj%2Fhk x:collection1 s:shard1 c:control_collection r:core_node1) [n:127.0.0.1:64552_fnfj%2Fhk c:control_collection s:shard1 r:core_node1 x:collection1] o.a.s.c.ZkController I am the leader, no recovery necessary
   [junit4]   2> 1286380 INFO  (coreZkRegister-3047-thread-1-processing-n:127.0.0.1:64552_fnfj%2Fhk x:collection1 s:shard1 c:control_collection r:core_node1) [n:127.0.0.1:64552_fnfj%2Fhk c:control_collection s:shard1 r:core_node1 x:collection1] o.a.s.c.ZkController publishing state=active
   [junit4]   2> 1286380 INFO  (coreZkRegister-3047-thread-1-processing-n:127.0.0.1:64552_fnfj%2Fhk x:collection1 s:shard1 c:control_collection r:core_node1) [n:127.0.0.1:64552_fnfj%2Fhk c:control_collection s:shard1 r:core_node1 x:collection1] o.a.s.c.ZkController numShards not found on descriptor - reading it from system property
   [junit4]   2> 1286381 INFO  (zkCallback-1496-thread-1-processing-n:127.0.0.1:64552_fnfj%2Fhk) [n:127.0.0.1:64552_fnfj%2Fhk    ] o.a.s.c.DistributedQueue NodeChildrenChanged fired on path /overseer/queue state SyncConnected
   [junit4]   2> 1286386 INFO  (OverseerStateUpdate-94081748872855555-127.0.0.1:64552_fnfj%2Fhk-n_0000000000) [n:127.0.0.1:64552_fnfj%2Fhk    ] o.a.s.c.Overseer processMessage: queueSize: 1, message = {
   [junit4]   2>   "core":"collection1",
   [junit4]   2>   "core_node_name":"core_node1",
   [junit4]   2>   "roles":null,
   [junit4]   2>   "base_url":"http://127.0.0.1:64552/fnfj/hk",
   [junit4]   2>   "node_name":"127.0.0.1:64552_fnfj%2Fhk",
   [junit4]   2>   "numShards":"1",
   [junit4]   2>   "state":"active",
   [junit4]   2>   "shard":"shard1",
   [junit4]   2>   "collection":"control_collection",
   [junit4]   2>   "operation":"state"} current state version: 2
   [junit4]   2> 1286386 INFO  (OverseerStateUpdate-94081748872855555-127.0.0.1:64552_fnfj%2Fhk-n_0000000000) [n:127.0.0.1:64552_fnfj%2Fhk    ] o.a.s.c.o.ReplicaMutator Update state numShards=1 message={
   [junit4]   2>   "core":"collection1",
   [junit4]   2>   "core_node_name":"core_node1",
   [junit4]   2>   "roles":null,
   [junit4]   2>   "base_url":"http://127.0.0.1:64552/fnfj/hk",
   [junit4]   2>   "node_name":"127.0.0.1:64552_fnfj%2Fhk",
   [junit4]   2>   "numShards":"1",
   [junit4]   2>   "state":"active",
   [junit4]   2>   "shard":"shard1",
   [junit4]   2>   "collection":"control_collection",
   [junit4]   2>   "operation":"state"}
   [junit4]   2> 1286477 INFO  (zkCallback-1496-thread-1-processing-n:127.0.0.1:64552_fnfj%2Fhk) [n:127.0.0.1:64552_fnfj%2Fhk    ] o.a.s.c.c.ZkStateReader A cluster state change: WatchedEvent state:SyncConnected type:NodeDataChanged path:/clusterstate.json, has occurred - updating... (live nodes size: 1)
   [junit4]   2> 1286479 INFO  (zkCallback-1496-thread-1-processing-n:127.0.0.1:64552_fnfj%2Fhk) [n:127.0.0.1:64552_fnfj%2Fhk    ] o.a.s.c.c.ZkStateReader Updated cluster state version to 3
   [junit4]   2> 1286515 INFO  (TEST-TestRandomRequestDistribution.testRequestTracking-seed#[91A74DC39822159C]) [    ] o.a.s.c.c.SolrZkClient Using default ZkCredentialsProvider
   [junit4]   2> 1286516 INFO  (TEST-TestRandomRequestDistribution.testRequestTracking-seed#[91A74DC39822159C]) [    ] o.a.s.c.c.ConnectionManager Waiting for client to connect to ZooKeeper
   [junit4]   2> 1286518 INFO  (zkCallback-1498-thread-1) [    ] o.a.s.c.c.ConnectionManager Watcher org.apache.solr.common.cloud.ConnectionManager@3f235e73 name:ZooKeeperConnection Watcher:127.0.0.1:64542/solr got event WatchedEvent state:SyncConnected type:None path:null path:null type:None
   [junit4]   2> 1286518 INFO  (TEST-TestRandomRequestDistribution.testRequestTracking-seed#[91A74DC39822159C]) [    ] o.a.s.c.c.ConnectionManager Client is connected to ZooKeeper
   [junit4]   2> 1286518 INFO  (TEST-TestRandomRequestDistribution.testRequestTracking-seed#[91A74DC39822159C]) [    ] o.a.s.c.c.SolrZkClient Using default ZkACLProvider
   [junit4]   2> 1286518 INFO  (TEST-TestRandomRequestDistribution.testRequestTracking-seed#[91A74DC39822159C]) [    ] o.a.s.c.c.ZkStateReader Updating cluster state from ZooKeeper...
   [junit4]   2> 1286520 INFO  (TEST-TestRandomRequestDistribution.testRequestTracking-seed#[91A74DC39822159C]) [    ] o.a.s.c.ChaosMonkey monkey: init - expire sessions:false cause connection loss:false
   [junit4]   2> 1286795 INFO  (TEST-TestRandomRequestDistribution.testRequestTracking-seed#[91A74DC39822159C]) [    ] o.a.s.SolrTestCaseJ4 Writing core.properties file to C:\Users\JenkinsSlave\workspace\Lucene-Solr-trunk-Windows\solr\build\solr-core\test\J0\temp\solr.cloud.TestRandomRequestDistribution_91A74DC39822159C-001\shard-1-001\cores\collection1
   [junit4]   2> 1286798 INFO  (TEST-TestRandomRequestDistribution.testRequestTracking-seed#[91A74DC39822159C]) [    ] o.a.s.c.AbstractFullDistribZkTestBase create jetty 1 in directory C:\Users\JenkinsSlave\workspace\Lucene-Solr-trunk-Windows\solr\build\solr-core\test\J0\temp\solr.cloud.TestRandomRequestDistribution_91A74DC39822159C-001\shard-1-001
   [junit4]   2> 1286799 INFO  (TEST-TestRandomRequestDistribution.testRequestTracking-seed#[91A74DC39822159C]) [    ] o.e.j.s.Server jetty-9.2.11.v20150529
   [junit4]   2> 1286801 INFO  (TEST-TestRandomRequestDistribution.testRequestTracking-seed#[91A74DC39822159C]) [    ] o.e.j.s.h.ContextHandler Started o.e.j.s.ServletContextHandler@d6e4691{/fnfj/hk,null,AVAILABLE}
   [junit4]   2> 1286802 INFO  (TEST-TestRandomRequestDistribution.testRequestTracking-seed#[91A74DC39822159C]) [    ] o.e.j.s.ServerConnector Started ServerConnector@7f1d21d3{HTTP/1.1}{127.0.0.1:64564}
   [junit4]   2> 1286802 INFO  (TEST-TestRandomRequestDistribution.testRequestTracking-seed#[91A74DC39822159C]) [    ] o.e.j.s.Server Started @1285809ms
   [junit4]   2> 1286802 INFO  (TEST-TestRandomRequestDistribution.testRequestTracking-seed#[91A74DC39822159C]) [    ] o.a.s.c.s.e.JettySolrRunner Jetty properties: {solr.data.dir=C:\Users\JenkinsSlave\workspace\Lucene-Solr-trunk-Windows\solr\build\solr-core\test\J0\temp\solr.cloud.TestRandomRequestDistribution_91A74DC39822159C-001\tempDir-001/jetty1, solrconfig=solrconfig.xml, hostContext=/fnfj/hk, hostPort=64564, coreRootDirectory=C:\Users\JenkinsSlave\workspace\Lucene-Solr-trunk-Windows\solr\build\solr-core\test\J0\temp\solr.cloud.TestRandomRequestDistribution_91A74DC39822159C-001\shard-1-001\cores}
   [junit4]   2> 1286802 INFO  (TEST-TestRandomRequestDistribution.testRequestTracking-seed#[91A74DC39822159C]) [    ] o.a.s.s.SolrDispatchFilter SolrDispatchFilter.init(): sun.misc.Launcher$AppClassLoader@4e0e2f2a
   [junit4]   2> 1286802 INFO  (TEST-TestRandomRequestDistribution.testRequestTracking-seed#[91A74DC39822159C]) [    ] o.a.s.c.SolrResourceLoader new SolrResourceLoader for directory: 'C:\Users\JenkinsSlave\workspace\Lucene-Solr-trunk-Windows\solr\build\solr-core\test\J0\temp\solr.cloud.TestRandomRequestDistribution_91A74DC39822159C-001\shard-1-001\'
   [junit4]   2> 1286821 INFO  (TEST-TestRandomRequestDistribution.testRequestTracking-seed#[91A74DC39822159C]) [    ] o.a.s.c.SolrXmlConfig Loading container configuration from C:\Users\JenkinsSlave\workspace\Lucene-Solr-trunk-Windows\solr\build\solr-core\test\J0\temp\solr.cloud.TestRandomRequestDistribution_91A74DC39822159C-001\shard-1-001\solr.xml
   [junit4]   2> 1286829 INFO  (TEST-TestRandomRequestDistribution.testRequestTracking-seed#[91A74DC39822159C]) [    ] o.a.s.c.CoresLocator Config-defined core root directory: C:\Users\JenkinsSlave\workspace\Lucene-Solr-trunk-Windows\solr\build\solr-core\test\J0\temp\solr.cloud.TestRandomRequestDistribution_91A74DC39822159C-001\shard-1-001\cores
   [junit4]   2> 1286829 INFO  (TEST-TestRandomRequestDistribution.testRequestTracking-seed#[91A74DC39822159C]) [    ] o.a.s.c.CoreContainer New CoreContainer 266455273
   [junit4]   2> 1286829 INFO  (TEST-TestRandomRequestDistribution.testRequestTracking-seed#[91A74DC39822159C]) [    ] o.a.s.c.CoreContainer Loading cores into CoreContainer [instanceDir=C:\Users\JenkinsSlave\workspace\Lucene-Solr-trunk-Windows\solr\build\solr-core\test\J0\temp\solr.cloud.TestRandomRequestDistribution_91A74DC39822159C-001\shard-1-001\]
   [junit4]   2> 1286829 INFO  (TEST-TestRandomRequestDistribution.testRequestTracking-seed#[91A74DC39822159C]) [    ] o.a.s.c.CoreContainer loading shared library: C:\Users\JenkinsSlave\workspace\Lucene-Solr-trunk-Windows\solr\build\solr-core\test\J0\temp\solr.cloud.TestRandomRequestDistribution_91A74DC39822159C-001\shard-1-001\lib
   [junit4]   2> 1286830 WARN  (TEST-TestRandomRequestDistribution.testRequestTracking-seed#[91A74DC39822159C]) [    ] o.a.s.c.SolrResourceLoader Can't find (or read) directory to add to classloader: lib (resolved as: C:\Users\JenkinsSlave\workspace\Lucene-Solr-trunk-Windows\solr\build\solr-core\test\J0\temp\solr.cloud.TestRandomRequestDistribution_91A74DC39822159C-001\shard-1-001\lib).
   [junit4]   2> 1286836 INFO  (TEST-TestRandomRequestDistribution.testRequestTracking-seed#[91A74DC39822159C]) [    ] o.a.s.h.c.HttpShardHandlerFactory created with socketTimeout : 90000,urlScheme : ,connTimeout : 15000,maxConnectionsPerHost : 20,maxConnections : 10000,corePoolSize : 0,maximumPoolSize : 2147483647,maxThreadIdleTime : 5,sizeOfQueue : -1,fairnessPolicy : false,useRetries : false,
   [junit4]   2> 1286838 INFO  (TEST-TestRandomRequestDistribution.testRequestTracking-seed#[91A74DC39822159C]) [    ] o.a.s.u.UpdateShardHandler Creating UpdateShardHandler HTTP client with params: socketTimeout=340000&connTimeout=45000&retry=true
   [junit4]   2> 1286839 INFO  (TEST-TestRandomRequestDistribution.testRequestTracking-seed#[91A74DC39822159C]) [    ] o.a.s.l.LogWatcher SLF4J impl is org.slf4j.impl.Log4jLoggerFactory
   [junit4]   2> 1286839 INFO  (TEST-TestRandomRequestDistribution.testRequestTracking-seed#[91A74DC39822159C]) [    ] o.a.s.l.LogWatcher Registering Log Listener [Log4j (org.slf4j.impl.Log4jLoggerFactory)]
   [junit4]   2> 1286839 INFO  (TEST-TestRandomRequestDistribution.testRequestTracking-seed#[91A74DC39822159C]) [    ] o.a.s.c.ZkContainer Zookeeper client=127.0.0.1:64542/solr
   [junit4]   2> 1286839 INFO  (TEST-TestRandomRequestDistribution.testRequestTracking-seed#[91A74DC39822159C]) [    ] o.a.s.c.ZkController zkHost includes chroot
   [junit4]   2> 1286839 INFO  (TEST-TestRandomRequestDistribution.testRequestTracking-seed#[91A74DC39822159C]) [    ] o.a.s.c.c.SolrZkClient Using default ZkCredentialsProvider
   [junit4]   2> 1286843 INFO  (TEST-TestRandomRequestDistribution.testRequestTracking-seed#[91A74DC39822159C]) [    ] o.a.s.c.c.ConnectionManager Waiting for client to connect to ZooKeeper
   [junit4]   2> 1286845 INFO  (zkCallback-1500-thread-1) [    ] o.a.s.c.c.ConnectionManager Watcher org.apache.solr.common.cloud.ConnectionManager@5b17a57c name:ZooKeeperConnection Watcher:127.0.0.1:64542 got event WatchedEvent state:SyncConnected type:None path:null path:null type:None
   [junit4]   2> 1286846 INFO  (TEST-TestRandomRequestDistribution.testRequestTracking-seed#[91A74DC39822159C]) [    ] o.a.s.c.c.ConnectionManager Client is connected to ZooKeeper
   [junit4]   2> 1286846 INFO  (TEST-TestRandomRequestDistribution.testRequestTracking-seed#[91A74DC39822159C]) [    ] o.a.s.c.c.SolrZkClient Using default ZkACLProvider
   [junit4]   2> 1286850 INFO  (TEST-TestRandomRequestDistribution.testRequestTracking-seed#[91A74DC39822159C]) [n:127.0.0.1:64564_fnfj%2Fhk    ] o.a.s.c.c.ConnectionManager Waiting for client to connect to ZooKeeper
   [junit4]   2> 1286853 INFO  (zkCallback-1501-thread-1-processing-n:127.0.0.1:64564_fnfj%2Fhk) [n:127.0.0.1:64564_fnfj%2Fhk    ] o.a.s.c.c.ConnectionManager Watcher org.apache.solr.common.cloud.ConnectionManager@70512091 name:ZooKeeperConnection Watcher:127.0.0.1:64542/solr got event WatchedEvent state:SyncConnected type:None path:null path:null type:None
   [junit4]   2> 1286853 INFO  (TEST-TestRandomRequestDistribution.testRequestTracking-seed#[91A74DC39822159C]) [n:127.0.0.1:64564_fnfj%2Fhk    ] o.a.s.c.c.ConnectionManager Client is connected to ZooKeeper
   [junit4]   2> 1286863 INFO  (TEST-TestRandomRequestDistribution.testRequestTracking-seed#[91A74DC39822159C]) [n:127.0.0.1:64564_fnfj%2Fhk    ] o.a.s.c.c.ZkStateReader Updating cluster state from ZooKeeper...
   [junit4]   2> 1287755 INFO  (TEST-TestRandomRequestDistribution.testRequestTracking-seed#[91A74DC39822159C]) [n:127.0.0.1:64564_fnfj%2Fhk    ] o.a.s.c.ZkController Register node as live in ZooKeeper:/live_nodes/127.0.0.1:64564_fnfj%2Fhk
   [junit4]   2> 1287756 INFO  (TEST-TestRandomRequestDistribution.testRequestTracking-seed#[91A74DC39822159C]) [n:127.0.0.1:64564_fnfj%2Fhk    ] o.a.s.c.c.SolrZkClient makePath: /live_nodes/127.0.0.1:64564_fnfj%2Fhk
   [junit4]   2> 1287761 INFO  (TEST-TestRandomRequestDistribution.testRequestTracking-seed#[91A74DC39822159C]) [n:127.0.0.1:64564_fnfj%2Fhk    ] o.a.s.c.Overseer Overseer (id=null) closing
   [junit4]   2> 1287761 INFO  (TEST-TestRandomRequestDistribution.testRequestTracking-seed#[91A74DC39822159C]) [n:127.0.0.1:64564_fnfj%2Fhk    ] o.a.s.c.LeaderElector Joined leadership election with path: /overseer_elect/election/94081748872855558-127.0.0.1:64564_fnfj%2Fhk-n_0000000001
   [junit4]   2> 1287762 INFO  (TEST-TestRandomRequestDistribution.testRequestTracking-seed#[91A74DC39822159C]) [n:127.0.0.1:64564_fnfj%2Fhk    ] o.a.s.c.LeaderElector Watching path /overseer_elect/election/94081748872855555-127.0.0.1:64552_fnfj%2Fhk-n_0000000000 to know if I could be the leader
   [junit4]   2> 1287763 INFO  (TEST-TestRandomRequestDistribution.testRequestTracking-seed#[91A74DC39822159C]) [n:127.0.0.1:64564_fnfj%2Fhk    ] o.a.s.c.CoreContainer No authentication plugin used.
   [junit4]   2> 1287763 INFO  (TEST-TestRandomRequestDistribution.testRequestTracking-seed#[91A74DC39822159C]) [n:127.0.0.1:64564_fnfj%2Fhk    ] o.a.s.c.CoreContainer Security conf doesn't exist. Skipping setup for authorization module.
   [junit4]   2> 1287764 INFO  (TEST-TestRandomRequestDistribution.testRequestTracking-seed#[91A74DC39822159C]) [n:127.0.0.1:64564_fnfj%2Fhk    ] o.a.s.c.CoresLocator Looking for core definitions underneath C:\Users\JenkinsSlave\workspace\Lucene-Solr-trunk-Windows\solr\build\solr-core\test\J0\temp\solr.cloud.TestRandomRequestDistribution_91A74DC39822159C-001\shard-1-001\cores
   [junit4]   2> 1287765 INFO  (TEST-TestRandomRequestDistribution.testRequestTracking-seed#[91A74DC39822159C]) [n:127.0.0.1:64564_fnfj%2Fhk    ] o.a.s.c.SolrCore Created CoreDescriptor: {name=collection1, config=solrconfig.xml, transient=false, schema=schema.xml, loadOnStartup=true, instanceDir=C:\Users\JenkinsSlave\workspace\Lucene-Solr-trunk-Windows\solr\build\solr-core\test\J0\temp\solr.cloud.TestRandomRequestDistribution_91A74DC39822159C-001\shard-1-001\cores\collection1, collection=collection1, absoluteInstDir=C:\Users\JenkinsSlave\workspace\Lucene-Solr-trunk-Windows\solr\build\solr-core\test\J0\temp\solr.cloud.TestRandomRequestDistribution_91A74DC39822159C-001\shard-1-001\cores\collection1\, coreNodeName=, dataDir=data\, shard=}
   [junit4]   2> 1287765 INFO  (TEST-TestRandomRequestDistribution.testRequestTracking-seed#[91A74DC39822159C]) [n:127.0.0.1:64564_fnfj%2Fhk    ] o.a.s.c.CoresLocator Found core collection1 in C:\Users\JenkinsSlave\workspace\Lucene-Solr-trunk-Windows\solr\build\solr-core\test\J0\temp\solr.cloud.TestRandomRequestDistribution_91A74DC39822159C-001\shard-1-001\cores\collection1\
   [junit4]   2> 1287765 INFO  (TEST-TestRandomRequestDistribution.testRequestTracking-seed#[91A74DC39822159C]) [n:127.0.0.1:64564_fnfj%2Fhk    ] o.a.s.c.CoresLocator Found 1 core definitions
   [junit4]   2> 1287766 INFO  (coreLoadExecutor-3064-thread-1-processing-n:127.0.0.1:64564_fnfj%2Fhk) [n:127.0.0.1:64564_fnfj%2Fhk c:collection1   x:collection1] o.a.s.c.ZkController publishing state=down
   [junit4]   2> 1287766 INFO  (coreLoadExecutor-3064-thread-1-processing-n:127.0.0.1:64564_fnfj%2Fhk) [n:127.0.0.1:64564_fnfj%2Fhk c:collection1   x:collection1] o.a.s.c.ZkController numShards not found on descriptor - reading it from system property
   [junit4]   2> 1287766 INFO  (TEST-TestRandomRequestDistribution.testRequestTracking-seed#[91A74DC39822159C]) [n:127.0.0.1:64564_fnfj%2Fhk    ] o.a.s.s.SolrDispatchFilter user.dir=C:\Users\JenkinsSlave\workspace\Lucene-Solr-trunk-Windows\solr\build\solr-core\test\J0
   [junit4]   2> 1287766 INFO  (TEST-TestRandomRequestDistribution.testRequestTracking-seed#[91A74DC39822159C]) [n:127.0.0.1:64564_fnfj%2Fhk    ] o.a.s.s.SolrDispatchFilter SolrDispatchFilter.init() done
   [junit4]   2> 1287767 INFO  (coreLoadExecutor-3064-thread-1-processing-n:127.0.0.1:64564_fnfj%2Fhk) [n:127.0.0.1:64564_fnfj%2Fhk c:collection1   x:collection1] o.a.s.c.ZkController look for our core node name
   [junit4]   2> 1287767 INFO  (zkCallback-1496-thread-1-processing-n:127.0.0.1:64552_fnfj%2Fhk) [n:127.0.0.1:64552_fnfj%2Fhk    ] o.a.s.c.DistributedQueue NodeChildrenChanged fired on path /overseer/queue state SyncConnected
   [junit4]   2> 1287768 INFO  (OverseerStateUpdate-94081748872855555-127.0.0.1:64552_fnfj%2Fhk-n_0000000000) [n:127.0.0.1:64552_fnfj%2Fhk    ] o.a.s.c.Overseer processMessage: queueSize: 1, message = {
   [junit4]   2>   "core":"collection1",
   [junit4]   2>   "roles":null,
   [junit4]   2>   "base_url":"http://127.0.0.1:64564/fnfj/hk",
   [junit4]   2>   "node_name":"127.0.0.1:64564_fnfj%2Fhk",
   [junit4]   2>   "numShards":"2",
   [junit4]   2>   "state":"down",
   [junit4]   2>   "shard":null,
   [junit4]   2>   "collection":"collection1",
   [junit4]   2>   "operation":"state"} current state version: 3
   [junit4]   2> 1287768 INFO  (OverseerStateUpdate-94081748872855555-127.0.0.1:64552_fnfj%2Fhk-n_0000000000) [n:127.0.0.1:64552_fnfj%2Fhk    ] o.a.s.c.o.ReplicaMutator Update state numShards=2 message={
   [junit4]   2>   "core":"collection1",
   [junit4]   2>   "roles":null,
   [junit4]   2>   "base_url":"http://127.0.0.1:64564/fnfj/hk",
   [junit4]   2>   "node_name":"127.0.0.1:64564_fnfj%2Fhk",
   [junit4]   2>   "numShards":"2",
   [junit4]   2>   "state":"down",
   [junit4]   2>   "shard":null,
   [junit4]   2>   "collection":"collection1",
   [junit4]   2>   "operation":"state"}
   [junit4]   2> 1287768 INFO  (OverseerStateUpdate-94081748872855555-127.0.0.1:64552_fnfj%2Fhk-n_0000000000) [n:127.0.0.1:64552_fnfj%2Fhk    ] o.a.s.c.o.ClusterStateMutator building a new cName: collection1
   [junit4]   2> 1287769 INFO  (OverseerStateUpdate-94081748872855555-127.0.0.1:64552_fnfj%2Fhk-n_0000000000) [n:127.0.0.1:64552_fnfj%2Fhk    ] o.a.s.c.o.ReplicaMutator Assigning new node to shard shard=shard2
   [junit4]   2> 1287860 INFO  (zkCallback-1496-thread-1-processing-n:127.0.0.1:64552_fnfj%2Fhk) [n:127.0.0.1:64552_fnfj%2Fhk    ] o.a.s.c.c.ZkStateReader A cluster state change: WatchedEvent state:SyncConnected type:NodeDataChanged path:/clusterstate.json, has occurred - updating... (live nodes size: 2)
   [junit4]   2> 1287861 INFO  (zkCallback-1498-thread-1) [    ] o.a.s.c.c.ZkStateReader A cluster state change: WatchedEvent state:SyncConnected type:NodeDataChanged path:/clusterstate.json, has occurred - updating... (live nodes size: 2)
   [junit4]   2> 1287861 INFO  (zkCallback-1501-thread-1-processing-n:127.0.0.1:64564_fnfj%2Fhk) [n:127.0.0.1:64564_fnfj%2Fhk    ] o.a.s.c.c.ZkStateReader A cluster state change: WatchedEvent state:SyncConnected type:NodeDataChanged path:/clusterstate.json, has occurred - updating... (live nodes size: 2)
   [junit4]   2> 1287873 INFO  (zkCallback-1498-thread-1) [    ] o.a.s.c.c.ZkStateReader Updated cluster state version to 4
   [junit4]   2> 1287873 INFO  (zkCallback-1496-thread-1-processing-n:127.0.0.1:64552_fnfj%2Fhk) [n:127.0.0.1:64552_fnfj%2Fhk    ] o.a.s.c.c.ZkStateReader Updated cluster state version to 4
   [junit4]   2> 1287874 INFO  (zkCallback-1501-thread-1-processing-n:127.0.0.1:64564_fnfj%2Fhk) [n:127.0.0.1:64564_fnfj%2Fhk    ] o.a.s.c.c.ZkStateReader Updated cluster state version to 4
   [junit4]   2> 1288653 INFO  (coreLoadExecutor-3064-thread-1-processing-n:127.0.0.1:64564_fnfj%2Fhk) [n:127.0.0.1:64564_fnfj%2Fhk c:collection1   x:collection1] o.a.s.c.ZkController waiting to find shard id in clusterstate for collection1
   [junit4]   2> 1288653 INFO  (coreLoadExecutor-3064-thread-1-processing-n:127.0.0.1:64564_fnfj%2Fhk) [n:127.0.0.1:64564_fnfj%2Fhk c:collection1   x:collection1] o.a.s.c.ZkController Check for collection zkNode:collection1
   [junit4]   2> 1288653 INFO  (coreLoadExecutor-3064-thread-1-processing-n:127.0.0.1:64564_fnfj%2Fhk) [n:127.0.0.1:64564_fnfj%2Fhk c:collection1   x:collection1] o.a.s.c.ZkController Collection zkNode exists
   [junit4]   2> 1288653 INFO  (coreLoadExecutor-3064-thread-1-processing-n:127.0.0.1:64564_fnfj%2Fhk) [n:127.0.0.1:64564_fnfj%2Fhk c:collection1   x:collection1] o.a.s.c.c.ZkStateReader Load collection config from:/collections/collection1
   [junit4]   2> 1288654 INFO  (coreLoadExecutor-3064-thread-1-processing-n:127.0.0.1:64564_fnfj%2Fhk) [n:127.0.0.1:64564_fnfj%2Fhk c:collection1   x:collection1] o.a.s.c.c.ZkStateReader path=/collections/collection1 configName=conf1 specified config exists in ZooKeeper
   [junit4]   2> 1288654 INFO  (coreLoadExecutor-3064-thread-1-processing-n:127.0.0.1:64564_fnfj%2Fhk) [n:127.0.0.1:64564_fnfj%2Fhk c:collection1   x:collection1] o.a.s.c.SolrResourceLoader new SolrResourceLoader for directory: 'C:\Users\JenkinsSlave\workspace\Lucene-Solr-trunk-Windows\solr\build\solr-core\test\J0\temp\solr.cloud.TestRandomRequestDistribution_91A74DC39822159C-001\shard-1-001\cores\collection1\'
   [junit4]   2> 1288670 INFO  (coreLoadExecutor-3064-thread-1-processing-n:127.0.0.1:64564_fnfj%2Fhk) [n:127.0.0.1:64564_fnfj%2Fhk c:collection1   x:collection1] o.a.s.c.Config loaded config solrconfig.xml with version 0
   [junit4]   2> 1288675 INFO  (coreLoadExecutor-3064-thread-1-processing-n:127.0.0.1:64564_fnfj%2Fhk) [n:127.0.0.1:64564_fnfj%2Fhk c:collection1   x:collection1] o.a.s.c.SolrConfig current version of requestparams : -1
   [junit4]   2> 1288678 INFO  (coreLoadExecutor-3064-thread-1-processing-n:127.0.0.1:64564_fnfj%2Fhk) [n:127.0.0.1:64564_fnfj%2Fhk c:collection1   x:collection1] o.a.s.c.SolrConfig Using Lucene MatchVersion: 6.0.0
   [junit4]   2> 1288683 INFO  (coreLoadExecutor-3064-thread-1-processing-n:127.0.0.1:64564_fnfj%2Fhk) [n:127.0.0.1:64564_fnfj%2Fhk c:collection1   x:collection1] o.a.s.c.Config Loaded SolrConfig: solrconfig.xml
   [junit4]   2> 1288686 INFO  (coreLoadExecutor-3064-thread-1-processing-n:127.0.0.1:64564_fnfj%2Fhk) [n:127.0.0.1:64564_fnfj%2Fhk c:collection1   x:collection1] o.a.s.s.IndexSchema Reading Solr Schema from /configs/conf1/schema.xml
   [junit4]   2> 1288688 INFO  (coreLoadExecutor-3064-thread-1-processing-n:127.0.0.1:64564_fnfj%2Fhk) [n:127.0.0.1:64564_fnfj%2Fhk c:collection1   x:collection1] o.a.s.s.IndexSchema [collection1] Schema name=test
   [junit4]   2> 1288769 INFO  (coreLoadExecutor-3064-thread-1-processing-n:127.0.0.1:64564_fnfj%2Fhk) [n:127.0.0.1:64564_fnfj%2Fhk c:collection1   x:collection1] o.a.s.s.OpenExchangeRatesOrgProvider Initialized with rates=open-exchange-rates.json, refreshInterval=1440.
   [junit4]   2> 1288782 INFO  (coreLoadExecutor-3064-thread-1-processing-n:127.0.0.1:64564_fnfj%2Fhk) [n:127.0.0.1:64564_fnfj%2Fhk c:collection1   x:collection1] o.a.s.s.IndexSchema default search field in schema is text
   [junit4]   2> 1288782 INFO  (coreLoadExecutor-3064-thread-1-processing-n:127.0.0.1:64564_fnfj%2Fhk) [n:127.0.0.1:64564_fnfj%2Fhk c:collection1   x:collection1] o.a.s.s.IndexSchema unique key field: id
   [junit4]   2> 1288792 INFO  (coreLoadExecutor-3064-thread-1-processing-n:127.0.0.1:64564_fnfj%2Fhk) [n:127.0.0.1:64564_fnfj%2Fhk c:collection1   x:collection1] o.a.s.s.FileExchangeRateProvider Reloading exchange rates from file currency.xml
   [junit4]   2> 1288795 INFO  (coreLoadExecutor-3064-thread-1-processing-n:127.0.0.1:64564_fnfj%2Fhk) [n:127.0.0.1:64564_fnfj%2Fhk c:collection1   x:collection1] o.a.s.s.FileExchangeRateProvider Reloading exchange rates from file currency.xml
   [junit4]   2> 1288797 INFO  (coreLoadExecutor-3064-thread-1-processing-n:127.0.0.1:64564_fnfj%2Fhk) [n:127.0.0.1:64564_fnfj%2Fhk c:collection1   x:collection1] o.a.s.s.OpenExchangeRatesOrgProvider Reloading exchange rates from open-exchange-rates.json
   [junit4]   2> 1288798 WARN  (coreLoadExecutor-3064-thread-1-processing-n:127.0.0.1:64564_fnfj%2Fhk) [n:127.0.0.1:64564_fnfj%2Fhk c:collection1   x:collection1] o.a.s.s.OpenExchangeRatesOrgProvider Unknown key IMPORTANT NOTE
   [junit4]   2> 1288798 WARN  (coreLoadExecutor-3064-thread-1-processing-n:127.0.0.1:64564_fnfj%2Fhk) [n:127.0.0.1:64564_fnfj%2Fhk c:collection1   x:collection1] o.a.s.s.OpenExchangeRatesOrgProvider Expected key, got STRING
   [junit4]   2> 1288798 INFO  (coreLoadExecutor-3064-thread-1-processing-n:127.0.0.1:64564_fnfj%2Fhk) [n:127.0.0.1:64564_fnfj%2Fhk c:collection1   x:collection1] o.a.s.s.OpenExchangeRatesOrgProvider Reloading exchange rates from open-exchange-rates.json
   [junit4]   2> 1288799 WARN  (coreLoadExecutor-3064-thread-1-processing-n:127.0.0.1:64564_fnfj%2Fhk) [n:127.0.0.1:64564_fnfj%2Fhk c:collection1   x:collection1] o.a.s.s.OpenExchangeRatesOrgProvider Unknown key IMPORTANT NOTE
   [junit4]   2> 1288799 WARN  (coreLoadExecutor-3064-thread-1-processing-n:127.0.0.1:64564_fnfj%2Fhk) [n:127.0.0.1:64564_fnfj%2Fhk c:collection1   x:collection1] o.a.s.s.OpenExchangeRatesOrgProvider Expected key, got STRING
   [junit4]   2> 1288799 INFO  (coreLoadExecutor-3064-thread-1-processing-n:127.0.0.1:64564_fnfj%2Fhk) [n:127.0.0.1:64564_fnfj%2Fhk c:collection1   x:collection1] o.a.s.c.CoreContainer Creating SolrCore 'collection1' using configuration from collection collection1
   [junit4]   2> 1288799 INFO  (coreLoadExecutor-3064-thread-1-processing-n:127.0.0.1:64564_fnfj%2Fhk) [n:127.0.0.1:64564_fnfj%2Fhk c:collection1 s:shard2 r:core_node1 x:collection1] o.a.s.c.SolrCore org.apache.solr.core.MockDirectoryFactory
   [junit4]   2> 1288800 INFO  (coreLoadExecutor-3064-thread-1-processing-n:127.0.0.1:64564_fnfj%2Fhk) [n:127.0.0.1:64564_fnfj%2Fhk c:collection1 s:shard2 r:core_node1 x:collection1] o.a.s.c.SolrCore [[collection1] ] Opening new SolrCore at [C:\Users\JenkinsSlave\workspace\Lucene-Solr-trunk-Windows\solr\build\solr-core\test\J0\temp\solr.cloud.TestRandomRequestDistribution_91A74DC39822159C-001\shard-1-001\cores\collection1\], dataDir=[null]
   [junit4]   2> 1288800 INFO  (coreLoadExecutor-3064-thread-1-processing-n:127.0.0.1:64564_fnfj%2Fhk) [n:127.0.0.1:64564_fnfj%2Fhk c:collection1 s:shard2 r:core_node1 x:collection1] o.a.s.c.JmxMonitoredMap JMX monitoring is enabled. Adding Solr mbeans to JMX Server: com.sun.jmx.mbeanserver.JmxMBeanServer@23a0fd92
   [junit4]   2> 1288801 INFO  (coreLoadExecutor-3064-thread-1-processing-n:127.0.0.1:64564_fnfj%2Fhk) [n:127.0.0.1:64564_fnfj%2Fhk c:collection1 s:shard2 r:core_node1 x:collection1] o.a.s.c.CachingDirectoryFactory return new directory for C:\Users\JenkinsSlave\workspace\Lucene-Solr-trunk-Windows\solr\build\solr-core\test\J0\temp\solr.cloud.TestRandomRequestDistribution_91A74DC39822159C-001\shard-1-001\cores\collection1\data\
   [junit4]   2> 12888

[...truncated too long message...]

s\JenkinsSlave\workspace\Lucene-Solr-trunk-Windows\solr\build\solr-core\test\J0\temp\solr.cloud.TestRandomRequestDistribution_91A74DC39822159C-001\shard-3-001\cores\b1x1_shard1_replica1\data\index;done=false>>]
   [junit4]   2> 1319485 INFO  (TEST-TestRandomRequestDistribution.testRequestTracking-seed#[91A74DC39822159C]) [n:127.0.0.1:64586_fnfj%2Fhk c:b1x1 s:shard1 r:core_node1 x:b1x1_shard1_replica1] o.a.s.c.CachingDirectoryFactory Closing directory: C:\Users\JenkinsSlave\workspace\Lucene-Solr-trunk-Windows\solr\build\solr-core\test\J0\..\..\..\..\..\..\..\..\..\Users\JenkinsSlave\workspace\Lucene-Solr-trunk-Windows\solr\build\solr-core\test\J0\temp\solr.cloud.TestRandomRequestDistribution_91A74DC39822159C-001\shard-3-001\cores\b1x1_shard1_replica1\data\index
   [junit4]   2> 1319485 INFO  (TEST-TestRandomRequestDistribution.testRequestTracking-seed#[91A74DC39822159C]) [n:127.0.0.1:64586_fnfj%2Fhk c:b1x1 s:shard1 r:core_node1 x:b1x1_shard1_replica1] o.a.s.c.Overseer Overseer (id=94081748872855562-127.0.0.1:64586_fnfj%2Fhk-n_0000000003) closing
   [junit4]   2> 1319485 INFO  (OverseerStateUpdate-94081748872855562-127.0.0.1:64586_fnfj%2Fhk-n_0000000003) [n:127.0.0.1:64586_fnfj%2Fhk    ] o.a.s.c.Overseer Overseer Loop exiting : 127.0.0.1:64586_fnfj%2Fhk
   [junit4]   2> 1319495 ERROR (TEST-TestRandomRequestDistribution.testRequestTracking-seed#[91A74DC39822159C]-EventThread) [n:127.0.0.1:64586_fnfj%2Fhk    ] o.a.z.ClientCnxn Error while calling watcher
   [junit4]   2> java.util.concurrent.RejectedExecutionException: Task org.apache.solr.common.util.ExecutorUtil$MDCAwareThreadPoolExecutor$1@17a1f513 rejected from org.apache.solr.common.util.ExecutorUtil$MDCAwareThreadPoolExecutor@6cc05e5[Terminated, pool size = 0, active threads = 0, queued tasks = 0, completed tasks = 26]
   [junit4]   2> at java.util.concurrent.ThreadPoolExecutor$AbortPolicy.rejectedExecution(ThreadPoolExecutor.java:2047)
   [junit4]   2> at java.util.concurrent.ThreadPoolExecutor.reject(ThreadPoolExecutor.java:823)
   [junit4]   2> at java.util.concurrent.ThreadPoolExecutor.execute(ThreadPoolExecutor.java:1369)
   [junit4]   2> at org.apache.solr.common.util.ExecutorUtil$MDCAwareThreadPoolExecutor.execute(ExecutorUtil.java:143)
   [junit4]   2> at java.util.concurrent.AbstractExecutorService.submit(AbstractExecutorService.java:112)
   [junit4]   2> at org.apache.solr.common.cloud.SolrZkClient$3.process(SolrZkClient.java:266)
   [junit4]   2> at org.apache.zookeeper.ClientCnxn$EventThread.processEvent(ClientCnxn.java:522)
   [junit4]   2> at org.apache.zookeeper.ClientCnxn$EventThread.run(ClientCnxn.java:498)
   [junit4]   2> 1319497 INFO  (TEST-TestRandomRequestDistribution.testRequestTracking-seed#[91A74DC39822159C]) [    ] o.e.j.s.ServerConnector Stopped ServerConnector@62cbf092{HTTP/1.1}{127.0.0.1:0}
   [junit4]   2> 1319497 INFO  (TEST-TestRandomRequestDistribution.testRequestTracking-seed#[91A74DC39822159C]) [    ] o.e.j.s.h.ContextHandler Stopped o.e.j.s.ServletContextHandler@8845815{/fnfj/hk,null,UNAVAILABLE}
   [junit4]   2> 1319500 INFO  (TEST-TestRandomRequestDistribution.testRequestTracking-seed#[91A74DC39822159C]) [n:127.0.0.1:64586_fnfj%2Fhk c:b1x1 s:shard1 r:core_node1 x:b1x1_shard1_replica1] o.a.s.c.ZkTestServer connecting to 127.0.0.1:64542 64542
   [junit4]   2> 1322205 INFO  (Thread-2586) [    ] o.a.s.c.ZkTestServer connecting to 127.0.0.1:64542 64542
   [junit4]   2> 1322207 WARN  (Thread-2586) [    ] o.a.s.c.ZkTestServer Watch limit violations:
   [junit4]   2> Maximum concurrent create/delete watches above limit:
   [junit4]   2>
   [junit4]   2> 5 /solr/aliases.json
   [junit4]   2> 5 /solr/clusterstate.json
   [junit4]   2> 4 /solr/configs/conf1
   [junit4]   2> 2 /solr/collections/a1x2/state.json
   [junit4]   2>
   [junit4]   2> Maximum concurrent children watches above limit:
   [junit4]   2>
   [junit4]   2> 5 /solr/live_nodes
   [junit4]   2> 4 /solr/overseer/collection-queue-work
   [junit4]   2> 3 /solr/overseer/queue
   [junit4]   2>
   [junit4]   2> NOTE: reproduce with: ant test  -Dtestcase=TestRandomRequestDistribution -Dtests.method=testRequestTracking -Dtests.seed=91A74DC39822159C -Dtests.slow=true -Dtests.locale=ar_KW -Dtests.timezone=Africa/Windhoek -Dtests.asserts=true -Dtests.file.encoding=Cp1252
   [junit4] FAILURE 37.7s J0 | TestRandomRequestDistribution.testRequestTracking <<<
   [junit4]    > Throwable #1: java.lang.AssertionError: Shard a1x2_shard1_replica1 received all 10 requests
   [junit4]    > at __randomizedtesting.SeedInfo.seed([91A74DC39822159C:D99B14036C29040A]:0)
   [junit4]    > at org.apache.solr.cloud.TestRandomRequestDistribution.testRequestTracking(TestRandomRequestDistribution.java:109)
   [junit4]    > at org.apache.solr.BaseDistributedSearchTestCase$ShardsRepeatRule$ShardsFixedStatement.callStatement(BaseDistributedSearchTestCase.java:960)
   [junit4]    > at org.apache.solr.BaseDistributedSearchTestCase$ShardsRepeatRule$ShardsStatement.evaluate(BaseDistributedSearchTestCase.java:935)
   [junit4]    > at java.lang.Thread.run(Thread.java:745)
   [junit4]   2> 1322218 INFO  (SUITE-TestRandomRequestDistribution-seed#[91A74DC39822159C]-worker) [n:127.0.0.1:64586_fnfj%2Fhk c:b1x1 s:shard1 r:core_node1 x:b1x1_shard1_replica1] o.a.s.SolrTestCaseJ4 ###deleteCore
   [junit4]   2> NOTE: leaving temporary files on disk at: C:\Users\JenkinsSlave\workspace\Lucene-Solr-trunk-Windows\solr\build\solr-core\test\J0\temp\solr.cloud.TestRandomRequestDistribution_91A74DC39822159C-001
   [junit4]   2> NOTE: test params are: codec=Asserting(Lucene53): {}, docValues:{}, sim=DefaultSimilarity, locale=ar_KW, timezone=Africa/Windhoek
   [junit4]   2> NOTE: Windows 7 6.1 amd64/Oracle Corporation 1.8.0_45 (64-bit)/cpus=3,threads=1,free=249639272,total=498724864
   [junit4]   2> NOTE: All tests run in this JVM: [TestCollationField, LeaderElectionTest, TestCollapseQParserPlugin, PathHierarchyTokenizerFactoryTest, TestStressLucene, TestExactSharedStatsCache, DistributedSpellCheckComponentTest, DirectSolrConnectionTest, TestSchemaResource, TestStressReorder, ShowFileRequestHandlerTest, DistribJoinFromCollectionTest, ZkCLITest, VMParamsZkACLAndCredentialsProvidersTest, TestHdfsUpdateLog, SolrCoreTest, SOLR749Test, TestArbitraryIndexDir, DistributedFacetPivotLongTailTest, DocValuesMultiTest, TestCustomDocTransformer, TestPartialUpdateDeduplication, NumericFieldsTest, PreAnalyzedFieldTest, TestRestoreCore, TestReqParamsAPI, TestFunctionQuery, DocValuesTest, ChaosMonkeyNothingIsSafeTest, TestExpandComponent, TestRequestStatusCollectionAPI, UUIDUpdateProcessorFallbackTest, TestRandomMergePolicy, JSONWriterTest, TestFaceting, BJQParserTest, AnalyticsQueryTest, SSLMigrationTest, SimpleFacetsTest, RuleEngineTest, TestSchemaNameResource, RankQueryTest, SegmentsInfoRequestHandlerTest, TestSweetSpotSimilarityFactory, TestImplicitCoreProperties, CustomCollectionTest, TestManagedSchemaFieldTypeResource, TestRawResponseWriter, SuggesterFSTTest, ShardRoutingTest, CollectionReloadTest, TestCoreContainer, ZkControllerTest, TestJmxIntegration, TestNonDefinedSimilarityFactory, IndexSchemaRuntimeFieldTest, TestShortCircuitedRequests, TriLevelCompositeIdRoutingTest, AssignTest, HttpPartitionTest, TestWriterPerf, TestBinaryResponseWriter, RequiredFieldsTest, TestManagedStopFilterFactory, TestChildDocTransformer, TestSolrQueryParserResource, TestAnalyzedSuggestions, TestIBSimilarityFactory, CircularListTest, TestMiniSolrCloudCluster, TestOmitPositions, TestSurroundQueryParser, OutputWriterTest, DocExpirationUpdateProcessorFactoryTest, AlternateDirectoryTest, TestRTimer, SolrPluginUtilsTest, AddSchemaFieldsUpdateProcessorFactoryTest, TestCopyFieldCollectionResource, RequestLoggingTest, TestSortingResponseWriter, DOMUtilTest, DistributedQueryComponentCustomSortTest, SolrCoreCheckLockOnStartupTest, TestXIncludeConfig, DistributedFacetPivotSmallAdvancedTest, DistanceFunctionTest, DistributedFacetPivotLargeTest, TestBM25SimilarityFactory, TestSolr4Spatial2, TestWordDelimiterFilterFactory, ResponseLogComponentTest, CacheHeaderTest, DataDrivenBlockJoinTest, TestHighlightDedupGrouping, TestUpdate, TestElisionMultitermQuery, TestFastLRUCache, XmlUpdateRequestHandlerTest, TestDistributedSearch, TestPostingsSolrHighlighter, HdfsDirectoryFactoryTest, DateRangeFieldTest, TestCloudManagedSchemaConcurrent, TestSmileRequest, SoftAutoCommitTest, TestSolrIndexConfig, TestHashPartitioner, NoCacheHeaderTest, SuggesterTest, TestRandomRequestDistribution]
   [junit4] Completed [234/514] on J0 in 37.69s, 1 test, 1 failure <<< FAILURES!

[...truncated 880 lines...]
BUILD FAILED
C:\Users\JenkinsSlave\workspace\Lucene-Solr-trunk-Windows\build.xml:526: The following error occurred while executing this line:
C:\Users\JenkinsSlave\workspace\Lucene-Solr-trunk-Windows\build.xml:474: The following error occurred while executing this line:
C:\Users\JenkinsSlave\workspace\Lucene-Solr-trunk-Windows\build.xml:61: The following error occurred while executing this line:
C:\Users\JenkinsSlave\workspace\Lucene-Solr-trunk-Windows\extra-targets.xml:39: The following error occurred while executing this line:
C:\Users\JenkinsSlave\workspace\Lucene-Solr-trunk-Windows\solr\build.xml:230: The following error occurred while executing this line:
C:\Users\JenkinsSlave\workspace\Lucene-Solr-trunk-Windows\solr\common-build.xml:513: The following error occurred while executing this line:
C:\Users\JenkinsSlave\workspace\Lucene-Solr-trunk-Windows\lucene\common-build.xml:1426: The following error occurred while executing this line:
C:\Users\JenkinsSlave\workspace\Lucene-Solr-trunk-Windows\lucene\common-build.xml:981: There were test failures: 514 suites, 2021 tests, 1 failure, 69 ignored (35 assumptions)

Total time: 63 minutes 27 seconds
Build step 'Invoke Ant' marked build as failure
Archiving artifacts
Recording test results
Email was triggered for: Failure - Any
Sending email for trigger: Failure - Any




---------------------------------------------------------------------
To unsubscribe, e-mail: [hidden email]
For additional commands, e-mail: [hidden email]
Reply | Threaded
Open this post in threaded view
|

[JENKINS] Lucene-Solr-trunk-Windows (32bit/jdk1.8.0_45) - Build # 4980 - Still Failing!

Policeman Jenkins Server-2
Build: http://jenkins.thetaphi.de/job/Lucene-Solr-trunk-Windows/4980/
Java: 32bit/jdk1.8.0_45 -server -XX:+UseConcMarkSweepGC

3 tests failed.
FAILED:  org.apache.solr.handler.TestSQLHandler.doTest

Error Message:
JSONTupleStream: expected ARRAY_START but got EOF

Stack Trace:
java.io.IOException: JSONTupleStream: expected ARRAY_START but got EOF
        at __randomizedtesting.SeedInfo.seed([84C4C3D43E357222:23807B70538E619B]:0)
        at org.apache.solr.client.solrj.io.stream.JSONTupleStream.expect(JSONTupleStream.java:99)
        at org.apache.solr.client.solrj.io.stream.JSONTupleStream.advanceToDocs(JSONTupleStream.java:159)
        at org.apache.solr.client.solrj.io.stream.JSONTupleStream.next(JSONTupleStream.java:77)
        at org.apache.solr.client.solrj.io.stream.SolrStream.read(SolrStream.java:149)
        at org.apache.solr.handler.TestSQLHandler.getTuples(TestSQLHandler.java:833)
        at org.apache.solr.handler.TestSQLHandler.testParallelTimeSeriesGrouping(TestSQLHandler.java:731)
        at org.apache.solr.handler.TestSQLHandler.doTest(TestSQLHandler.java:94)
        at sun.reflect.NativeMethodAccessorImpl.invoke0(Native Method)
        at sun.reflect.NativeMethodAccessorImpl.invoke(NativeMethodAccessorImpl.java:62)
        at sun.reflect.DelegatingMethodAccessorImpl.invoke(DelegatingMethodAccessorImpl.java:43)
        at java.lang.reflect.Method.invoke(Method.java:497)
        at com.carrotsearch.randomizedtesting.RandomizedRunner.invoke(RandomizedRunner.java:1627)
        at com.carrotsearch.randomizedtesting.RandomizedRunner$6.evaluate(RandomizedRunner.java:836)
        at com.carrotsearch.randomizedtesting.RandomizedRunner$7.evaluate(RandomizedRunner.java:872)
        at com.carrotsearch.randomizedtesting.RandomizedRunner$8.evaluate(RandomizedRunner.java:886)
        at org.apache.solr.BaseDistributedSearchTestCase$ShardsRepeatRule$ShardsFixedStatement.callStatement(BaseDistributedSearchTestCase.java:960)
        at org.apache.solr.BaseDistributedSearchTestCase$ShardsRepeatRule$ShardsStatement.evaluate(BaseDistributedSearchTestCase.java:935)
        at com.carrotsearch.randomizedtesting.rules.SystemPropertiesRestoreRule$1.evaluate(SystemPropertiesRestoreRule.java:57)
        at org.apache.lucene.util.TestRuleSetupTeardownChained$1.evaluate(TestRuleSetupTeardownChained.java:50)
        at org.apache.lucene.util.AbstractBeforeAfterRule$1.evaluate(AbstractBeforeAfterRule.java:46)
        at org.apache.lucene.util.TestRuleThreadAndTestName$1.evaluate(TestRuleThreadAndTestName.java:49)
        at org.apache.lucene.util.TestRuleIgnoreAfterMaxFailures$1.evaluate(TestRuleIgnoreAfterMaxFailures.java:65)
        at org.apache.lucene.util.TestRuleMarkFailure$1.evaluate(TestRuleMarkFailure.java:48)
        at com.carrotsearch.randomizedtesting.rules.StatementAdapter.evaluate(StatementAdapter.java:36)
        at com.carrotsearch.randomizedtesting.ThreadLeakControl$StatementRunner.run(ThreadLeakControl.java:365)
        at com.carrotsearch.randomizedtesting.ThreadLeakControl.forkTimeoutingTask(ThreadLeakControl.java:798)
        at com.carrotsearch.randomizedtesting.ThreadLeakControl$3.evaluate(ThreadLeakControl.java:458)
        at com.carrotsearch.randomizedtesting.RandomizedRunner.runSingleTest(RandomizedRunner.java:845)
        at com.carrotsearch.randomizedtesting.RandomizedRunner$3.evaluate(RandomizedRunner.java:747)
        at com.carrotsearch.randomizedtesting.RandomizedRunner$4.evaluate(RandomizedRunner.java:781)
        at com.carrotsearch.randomizedtesting.RandomizedRunner$5.evaluate(RandomizedRunner.java:792)
        at com.carrotsearch.randomizedtesting.rules.StatementAdapter.evaluate(StatementAdapter.java:36)
        at com.carrotsearch.randomizedtesting.rules.SystemPropertiesRestoreRule$1.evaluate(SystemPropertiesRestoreRule.java:57)
        at org.apache.lucene.util.AbstractBeforeAfterRule$1.evaluate(AbstractBeforeAfterRule.java:46)
        at com.carrotsearch.randomizedtesting.rules.StatementAdapter.evaluate(StatementAdapter.java:36)
        at org.apache.lucene.util.TestRuleStoreClassName$1.evaluate(TestRuleStoreClassName.java:42)
        at com.carrotsearch.randomizedtesting.rules.NoShadowingOrOverridesOnMethodsRule$1.evaluate(NoShadowingOrOverridesOnMethodsRule.java:39)
        at com.carrotsearch.randomizedtesting.rules.NoShadowingOrOverridesOnMethodsRule$1.evaluate(NoShadowingOrOverridesOnMethodsRule.java:39)
        at com.carrotsearch.randomizedtesting.rules.StatementAdapter.evaluate(StatementAdapter.java:36)
        at com.carrotsearch.randomizedtesting.rules.StatementAdapter.evaluate(StatementAdapter.java:36)
        at com.carrotsearch.randomizedtesting.rules.StatementAdapter.evaluate(StatementAdapter.java:36)
        at org.apache.lucene.util.TestRuleAssertionsRequired$1.evaluate(TestRuleAssertionsRequired.java:54)
        at org.apache.lucene.util.TestRuleMarkFailure$1.evaluate(TestRuleMarkFailure.java:48)
        at org.apache.lucene.util.TestRuleIgnoreAfterMaxFailures$1.evaluate(TestRuleIgnoreAfterMaxFailures.java:65)
        at org.apache.lucene.util.TestRuleIgnoreTestSuites$1.evaluate(TestRuleIgnoreTestSuites.java:55)
        at com.carrotsearch.randomizedtesting.rules.StatementAdapter.evaluate(StatementAdapter.java:36)
        at com.carrotsearch.randomizedtesting.ThreadLeakControl$StatementRunner.run(ThreadLeakControl.java:365)
        at java.lang.Thread.run(Thread.java:745)


FAILED:  junit.framework.TestSuite.org.apache.solr.handler.TestSQLHandler

Error Message:
5 threads leaked from SUITE scope at org.apache.solr.handler.TestSQLHandler:     1) Thread[id=16165, name=zkCallback-2653-thread-1, state=TIMED_WAITING, group=TGRP-TestSQLHandler]         at sun.misc.Unsafe.park(Native Method)         at java.util.concurrent.locks.LockSupport.parkNanos(LockSupport.java:215)         at java.util.concurrent.SynchronousQueue$TransferStack.awaitFulfill(SynchronousQueue.java:460)         at java.util.concurrent.SynchronousQueue$TransferStack.transfer(SynchronousQueue.java:362)         at java.util.concurrent.SynchronousQueue.poll(SynchronousQueue.java:941)         at java.util.concurrent.ThreadPoolExecutor.getTask(ThreadPoolExecutor.java:1066)         at java.util.concurrent.ThreadPoolExecutor.runWorker(ThreadPoolExecutor.java:1127)         at java.util.concurrent.ThreadPoolExecutor$Worker.run(ThreadPoolExecutor.java:617)         at java.lang.Thread.run(Thread.java:745)    2) Thread[id=16164, name=qtp30878838-15976-EventThread, state=WAITING, group=TGRP-TestSQLHandler]         at sun.misc.Unsafe.park(Native Method)         at java.util.concurrent.locks.LockSupport.park(LockSupport.java:175)         at java.util.concurrent.locks.AbstractQueuedSynchronizer$ConditionObject.await(AbstractQueuedSynchronizer.java:2039)         at java.util.concurrent.LinkedBlockingQueue.take(LinkedBlockingQueue.java:442)         at org.apache.zookeeper.ClientCnxn$EventThread.run(ClientCnxn.java:494)    3) Thread[id=16179, name=zkCallback-2653-thread-2, state=TIMED_WAITING, group=TGRP-TestSQLHandler]         at sun.misc.Unsafe.park(Native Method)         at java.util.concurrent.locks.LockSupport.parkNanos(LockSupport.java:215)         at java.util.concurrent.SynchronousQueue$TransferStack.awaitFulfill(SynchronousQueue.java:460)         at java.util.concurrent.SynchronousQueue$TransferStack.transfer(SynchronousQueue.java:362)         at java.util.concurrent.SynchronousQueue.poll(SynchronousQueue.java:941)         at java.util.concurrent.ThreadPoolExecutor.getTask(ThreadPoolExecutor.java:1066)         at java.util.concurrent.ThreadPoolExecutor.runWorker(ThreadPoolExecutor.java:1127)         at java.util.concurrent.ThreadPoolExecutor$Worker.run(ThreadPoolExecutor.java:617)         at java.lang.Thread.run(Thread.java:745)    4) Thread[id=16163, name=qtp30878838-15976-SendThread(127.0.0.1:63880), state=RUNNABLE, group=TGRP-TestSQLHandler]         at sun.nio.ch.WindowsSelectorImpl$SubSelector.poll0(Native Method)         at sun.nio.ch.WindowsSelectorImpl$SubSelector.poll(WindowsSelectorImpl.java:296)         at sun.nio.ch.WindowsSelectorImpl$SubSelector.access$400(WindowsSelectorImpl.java:278)         at sun.nio.ch.WindowsSelectorImpl.doSelect(WindowsSelectorImpl.java:159)         at sun.nio.ch.SelectorImpl.lockAndDoSelect(SelectorImpl.java:86)         at sun.nio.ch.SelectorImpl.select(SelectorImpl.java:97)         at org.apache.zookeeper.ClientCnxnSocketNIO.doTransport(ClientCnxnSocketNIO.java:349)         at org.apache.zookeeper.ClientCnxn$SendThread.run(ClientCnxn.java:1081)    5) Thread[id=16204, name=zkCallback-2653-thread-3, state=TIMED_WAITING, group=TGRP-TestSQLHandler]         at sun.misc.Unsafe.park(Native Method)         at java.util.concurrent.locks.LockSupport.parkNanos(LockSupport.java:215)         at java.util.concurrent.SynchronousQueue$TransferStack.awaitFulfill(SynchronousQueue.java:460)         at java.util.concurrent.SynchronousQueue$TransferStack.transfer(SynchronousQueue.java:362)         at java.util.concurrent.SynchronousQueue.poll(SynchronousQueue.java:941)         at java.util.concurrent.ThreadPoolExecutor.getTask(ThreadPoolExecutor.java:1066)         at java.util.concurrent.ThreadPoolExecutor.runWorker(ThreadPoolExecutor.java:1127)         at java.util.concurrent.ThreadPoolExecutor$Worker.run(ThreadPoolExecutor.java:617)         at java.lang.Thread.run(Thread.java:745)

Stack Trace:
com.carrotsearch.randomizedtesting.ThreadLeakError: 5 threads leaked from SUITE scope at org.apache.solr.handler.TestSQLHandler:
   1) Thread[id=16165, name=zkCallback-2653-thread-1, state=TIMED_WAITING, group=TGRP-TestSQLHandler]
        at sun.misc.Unsafe.park(Native Method)
        at java.util.concurrent.locks.LockSupport.parkNanos(LockSupport.java:215)
        at java.util.concurrent.SynchronousQueue$TransferStack.awaitFulfill(SynchronousQueue.java:460)
        at java.util.concurrent.SynchronousQueue$TransferStack.transfer(SynchronousQueue.java:362)
        at java.util.concurrent.SynchronousQueue.poll(SynchronousQueue.java:941)
        at java.util.concurrent.ThreadPoolExecutor.getTask(ThreadPoolExecutor.java:1066)
        at java.util.concurrent.ThreadPoolExecutor.runWorker(ThreadPoolExecutor.java:1127)
        at java.util.concurrent.ThreadPoolExecutor$Worker.run(ThreadPoolExecutor.java:617)
        at java.lang.Thread.run(Thread.java:745)
   2) Thread[id=16164, name=qtp30878838-15976-EventThread, state=WAITING, group=TGRP-TestSQLHandler]
        at sun.misc.Unsafe.park(Native Method)
        at java.util.concurrent.locks.LockSupport.park(LockSupport.java:175)
        at java.util.concurrent.locks.AbstractQueuedSynchronizer$ConditionObject.await(AbstractQueuedSynchronizer.java:2039)
        at java.util.concurrent.LinkedBlockingQueue.take(LinkedBlockingQueue.java:442)
        at org.apache.zookeeper.ClientCnxn$EventThread.run(ClientCnxn.java:494)
   3) Thread[id=16179, name=zkCallback-2653-thread-2, state=TIMED_WAITING, group=TGRP-TestSQLHandler]
        at sun.misc.Unsafe.park(Native Method)
        at java.util.concurrent.locks.LockSupport.parkNanos(LockSupport.java:215)
        at java.util.concurrent.SynchronousQueue$TransferStack.awaitFulfill(SynchronousQueue.java:460)
        at java.util.concurrent.SynchronousQueue$TransferStack.transfer(SynchronousQueue.java:362)
        at java.util.concurrent.SynchronousQueue.poll(SynchronousQueue.java:941)
        at java.util.concurrent.ThreadPoolExecutor.getTask(ThreadPoolExecutor.java:1066)
        at java.util.concurrent.ThreadPoolExecutor.runWorker(ThreadPoolExecutor.java:1127)
        at java.util.concurrent.ThreadPoolExecutor$Worker.run(ThreadPoolExecutor.java:617)
        at java.lang.Thread.run(Thread.java:745)
   4) Thread[id=16163, name=qtp30878838-15976-SendThread(127.0.0.1:63880), state=RUNNABLE, group=TGRP-TestSQLHandler]
        at sun.nio.ch.WindowsSelectorImpl$SubSelector.poll0(Native Method)
        at sun.nio.ch.WindowsSelectorImpl$SubSelector.poll(WindowsSelectorImpl.java:296)
        at sun.nio.ch.WindowsSelectorImpl$SubSelector.access$400(WindowsSelectorImpl.java:278)
        at sun.nio.ch.WindowsSelectorImpl.doSelect(WindowsSelectorImpl.java:159)
        at sun.nio.ch.SelectorImpl.lockAndDoSelect(SelectorImpl.java:86)
        at sun.nio.ch.SelectorImpl.select(SelectorImpl.java:97)
        at org.apache.zookeeper.ClientCnxnSocketNIO.doTransport(ClientCnxnSocketNIO.java:349)
        at org.apache.zookeeper.ClientCnxn$SendThread.run(ClientCnxn.java:1081)
   5) Thread[id=16204, name=zkCallback-2653-thread-3, state=TIMED_WAITING, group=TGRP-TestSQLHandler]
        at sun.misc.Unsafe.park(Native Method)
        at java.util.concurrent.locks.LockSupport.parkNanos(LockSupport.java:215)
        at java.util.concurrent.SynchronousQueue$TransferStack.awaitFulfill(SynchronousQueue.java:460)
        at java.util.concurrent.SynchronousQueue$TransferStack.transfer(SynchronousQueue.java:362)
        at java.util.concurrent.SynchronousQueue.poll(SynchronousQueue.java:941)
        at java.util.concurrent.ThreadPoolExecutor.getTask(ThreadPoolExecutor.java:1066)
        at java.util.concurrent.ThreadPoolExecutor.runWorker(ThreadPoolExecutor.java:1127)
        at java.util.concurrent.ThreadPoolExecutor$Worker.run(ThreadPoolExecutor.java:617)
        at java.lang.Thread.run(Thread.java:745)
        at __randomizedtesting.SeedInfo.seed([84C4C3D43E357222]:0)


FAILED:  junit.framework.TestSuite.org.apache.solr.handler.TestSQLHandler

Error Message:
There are still zombie threads that couldn't be terminated:    1) Thread[id=16165, name=zkCallback-2653-thread-1, state=TIMED_WAITING, group=TGRP-TestSQLHandler]         at sun.misc.Unsafe.park(Native Method)         at java.util.concurrent.locks.LockSupport.parkNanos(LockSupport.java:215)         at java.util.concurrent.SynchronousQueue$TransferStack.awaitFulfill(SynchronousQueue.java:460)         at java.util.concurrent.SynchronousQueue$TransferStack.transfer(SynchronousQueue.java:362)         at java.util.concurrent.SynchronousQueue.poll(SynchronousQueue.java:941)         at java.util.concurrent.ThreadPoolExecutor.getTask(ThreadPoolExecutor.java:1066)         at java.util.concurrent.ThreadPoolExecutor.runWorker(ThreadPoolExecutor.java:1127)         at java.util.concurrent.ThreadPoolExecutor$Worker.run(ThreadPoolExecutor.java:617)         at java.lang.Thread.run(Thread.java:745)    2) Thread[id=16179, name=zkCallback-2653-thread-2, state=TIMED_WAITING, group=TGRP-TestSQLHandler]         at sun.misc.Unsafe.park(Native Method)         at java.util.concurrent.locks.LockSupport.parkNanos(LockSupport.java:215)         at java.util.concurrent.SynchronousQueue$TransferStack.awaitFulfill(SynchronousQueue.java:460)         at java.util.concurrent.SynchronousQueue$TransferStack.transfer(SynchronousQueue.java:362)         at java.util.concurrent.SynchronousQueue.poll(SynchronousQueue.java:941)         at java.util.concurrent.ThreadPoolExecutor.getTask(ThreadPoolExecutor.java:1066)         at java.util.concurrent.ThreadPoolExecutor.runWorker(ThreadPoolExecutor.java:1127)         at java.util.concurrent.ThreadPoolExecutor$Worker.run(ThreadPoolExecutor.java:617)         at java.lang.Thread.run(Thread.java:745)    3) Thread[id=16163, name=qtp30878838-15976-SendThread(127.0.0.1:63880), state=RUNNABLE, group=TGRP-TestSQLHandler]         at sun.nio.ch.WindowsSelectorImpl$SubSelector.poll0(Native Method)         at sun.nio.ch.WindowsSelectorImpl$SubSelector.poll(WindowsSelectorImpl.java:296)         at sun.nio.ch.WindowsSelectorImpl$SubSelector.access$400(WindowsSelectorImpl.java:278)         at sun.nio.ch.WindowsSelectorImpl.doSelect(WindowsSelectorImpl.java:159)         at sun.nio.ch.SelectorImpl.lockAndDoSelect(SelectorImpl.java:86)         at sun.nio.ch.SelectorImpl.select(SelectorImpl.java:97)         at org.apache.zookeeper.ClientCnxnSocketNIO.doTransport(ClientCnxnSocketNIO.java:349)         at org.apache.zookeeper.ClientCnxn$SendThread.run(ClientCnxn.java:1081)    4) Thread[id=16204, name=zkCallback-2653-thread-3, state=TIMED_WAITING, group=TGRP-TestSQLHandler]         at sun.misc.Unsafe.park(Native Method)         at java.util.concurrent.locks.LockSupport.parkNanos(LockSupport.java:215)         at java.util.concurrent.SynchronousQueue$TransferStack.awaitFulfill(SynchronousQueue.java:460)         at java.util.concurrent.SynchronousQueue$TransferStack.transfer(SynchronousQueue.java:362)         at java.util.concurrent.SynchronousQueue.poll(SynchronousQueue.java:941)         at java.util.concurrent.ThreadPoolExecutor.getTask(ThreadPoolExecutor.java:1066)         at java.util.concurrent.ThreadPoolExecutor.runWorker(ThreadPoolExecutor.java:1127)         at java.util.concurrent.ThreadPoolExecutor$Worker.run(ThreadPoolExecutor.java:617)         at java.lang.Thread.run(Thread.java:745)

Stack Trace:
com.carrotsearch.randomizedtesting.ThreadLeakError: There are still zombie threads that couldn't be terminated:
   1) Thread[id=16165, name=zkCallback-2653-thread-1, state=TIMED_WAITING, group=TGRP-TestSQLHandler]
        at sun.misc.Unsafe.park(Native Method)
        at java.util.concurrent.locks.LockSupport.parkNanos(LockSupport.java:215)
        at java.util.concurrent.SynchronousQueue$TransferStack.awaitFulfill(SynchronousQueue.java:460)
        at java.util.concurrent.SynchronousQueue$TransferStack.transfer(SynchronousQueue.java:362)
        at java.util.concurrent.SynchronousQueue.poll(SynchronousQueue.java:941)
        at java.util.concurrent.ThreadPoolExecutor.getTask(ThreadPoolExecutor.java:1066)
        at java.util.concurrent.ThreadPoolExecutor.runWorker(ThreadPoolExecutor.java:1127)
        at java.util.concurrent.ThreadPoolExecutor$Worker.run(ThreadPoolExecutor.java:617)
        at java.lang.Thread.run(Thread.java:745)
   2) Thread[id=16179, name=zkCallback-2653-thread-2, state=TIMED_WAITING, group=TGRP-TestSQLHandler]
        at sun.misc.Unsafe.park(Native Method)
        at java.util.concurrent.locks.LockSupport.parkNanos(LockSupport.java:215)
        at java.util.concurrent.SynchronousQueue$TransferStack.awaitFulfill(SynchronousQueue.java:460)
        at java.util.concurrent.SynchronousQueue$TransferStack.transfer(SynchronousQueue.java:362)
        at java.util.concurrent.SynchronousQueue.poll(SynchronousQueue.java:941)
        at java.util.concurrent.ThreadPoolExecutor.getTask(ThreadPoolExecutor.java:1066)
        at java.util.concurrent.ThreadPoolExecutor.runWorker(ThreadPoolExecutor.java:1127)
        at java.util.concurrent.ThreadPoolExecutor$Worker.run(ThreadPoolExecutor.java:617)
        at java.lang.Thread.run(Thread.java:745)
   3) Thread[id=16163, name=qtp30878838-15976-SendThread(127.0.0.1:63880), state=RUNNABLE, group=TGRP-TestSQLHandler]
        at sun.nio.ch.WindowsSelectorImpl$SubSelector.poll0(Native Method)
        at sun.nio.ch.WindowsSelectorImpl$SubSelector.poll(WindowsSelectorImpl.java:296)
        at sun.nio.ch.WindowsSelectorImpl$SubSelector.access$400(WindowsSelectorImpl.java:278)
        at sun.nio.ch.WindowsSelectorImpl.doSelect(WindowsSelectorImpl.java:159)
        at sun.nio.ch.SelectorImpl.lockAndDoSelect(SelectorImpl.java:86)
        at sun.nio.ch.SelectorImpl.select(SelectorImpl.java:97)
        at org.apache.zookeeper.ClientCnxnSocketNIO.doTransport(ClientCnxnSocketNIO.java:349)
        at org.apache.zookeeper.ClientCnxn$SendThread.run(ClientCnxn.java:1081)
   4) Thread[id=16204, name=zkCallback-2653-thread-3, state=TIMED_WAITING, group=TGRP-TestSQLHandler]
        at sun.misc.Unsafe.park(Native Method)
        at java.util.concurrent.locks.LockSupport.parkNanos(LockSupport.java:215)
        at java.util.concurrent.SynchronousQueue$TransferStack.awaitFulfill(SynchronousQueue.java:460)
        at java.util.concurrent.SynchronousQueue$TransferStack.transfer(SynchronousQueue.java:362)
        at java.util.concurrent.SynchronousQueue.poll(SynchronousQueue.java:941)
        at java.util.concurrent.ThreadPoolExecutor.getTask(ThreadPoolExecutor.java:1066)
        at java.util.concurrent.ThreadPoolExecutor.runWorker(ThreadPoolExecutor.java:1127)
        at java.util.concurrent.ThreadPoolExecutor$Worker.run(ThreadPoolExecutor.java:617)
        at java.lang.Thread.run(Thread.java:745)
        at __randomizedtesting.SeedInfo.seed([84C4C3D43E357222]:0)




Build Log:
[...truncated 10776 lines...]
   [junit4] Suite: org.apache.solr.handler.TestSQLHandler
   [junit4]   2> Creating dataDir: C:\Users\JenkinsSlave\workspace\Lucene-Solr-trunk-Windows\solr\build\solr-core\test\J0\temp\solr.handler.TestSQLHandler_84C4C3D43E357222-001\init-core-data-001
   [junit4]   2> 2507950 INFO  (SUITE-TestSQLHandler-seed#[84C4C3D43E357222]-worker) [    ] o.a.s.SolrTestCaseJ4 Randomized ssl (true) and clientAuth (true)
   [junit4]   2> 2507950 INFO  (SUITE-TestSQLHandler-seed#[84C4C3D43E357222]-worker) [    ] o.a.s.BaseDistributedSearchTestCase Setting hostContext system property: /
   [junit4]   2> 2507953 INFO  (TEST-TestSQLHandler.doTest-seed#[84C4C3D43E357222]) [    ] o.a.s.c.ZkTestServer STARTING ZK TEST SERVER
   [junit4]   2> 2507954 INFO  (Thread-5753) [    ] o.a.s.c.ZkTestServer client port:0.0.0.0/0.0.0.0:0
   [junit4]   2> 2507954 INFO  (Thread-5753) [    ] o.a.s.c.ZkTestServer Starting server
   [junit4]   2> 2508068 INFO  (TEST-TestSQLHandler.doTest-seed#[84C4C3D43E357222]) [    ] o.a.s.c.ZkTestServer start zk server on port:63880
   [junit4]   2> 2508089 INFO  (TEST-TestSQLHandler.doTest-seed#[84C4C3D43E357222]) [    ] o.a.s.c.AbstractZkTestCase put C:\Users\JenkinsSlave\workspace\Lucene-Solr-trunk-Windows\solr\core\src\test-files\solr\collection1\conf\solrconfig-sql.xml to /configs/conf1/solrconfig.xml
   [junit4]   2> 2508092 INFO  (TEST-TestSQLHandler.doTest-seed#[84C4C3D43E357222]) [    ] o.a.s.c.AbstractZkTestCase put C:\Users\JenkinsSlave\workspace\Lucene-Solr-trunk-Windows\solr\core\src\test-files\solr\collection1\conf\schema-sql.xml to /configs/conf1/schema.xml
   [junit4]   2> 2508099 INFO  (TEST-TestSQLHandler.doTest-seed#[84C4C3D43E357222]) [    ] o.a.s.c.AbstractZkTestCase put C:\Users\JenkinsSlave\workspace\Lucene-Solr-trunk-Windows\solr\core\src\test-files\solr\collection1\conf\solrconfig.snippet.randomindexconfig.xml to /configs/conf1/solrconfig.snippet.randomindexconfig.xml
   [junit4]   2> 2508101 INFO  (TEST-TestSQLHandler.doTest-seed#[84C4C3D43E357222]) [    ] o.a.s.c.AbstractZkTestCase put C:\Users\JenkinsSlave\workspace\Lucene-Solr-trunk-Windows\solr\core\src\test-files\solr\collection1\conf\stopwords.txt to /configs/conf1/stopwords.txt
   [junit4]   2> 2508103 INFO  (TEST-TestSQLHandler.doTest-seed#[84C4C3D43E357222]) [    ] o.a.s.c.AbstractZkTestCase put C:\Users\JenkinsSlave\workspace\Lucene-Solr-trunk-Windows\solr\core\src\test-files\solr\collection1\conf\protwords.txt to /configs/conf1/protwords.txt
   [junit4]   2> 2508107 INFO  (TEST-TestSQLHandler.doTest-seed#[84C4C3D43E357222]) [    ] o.a.s.c.AbstractZkTestCase put C:\Users\JenkinsSlave\workspace\Lucene-Solr-trunk-Windows\solr\core\src\test-files\solr\collection1\conf\currency.xml to /configs/conf1/currency.xml
   [junit4]   2> 2508108 INFO  (TEST-TestSQLHandler.doTest-seed#[84C4C3D43E357222]) [    ] o.a.s.c.AbstractZkTestCase put C:\Users\JenkinsSlave\workspace\Lucene-Solr-trunk-Windows\solr\core\src\test-files\solr\collection1\conf\enumsConfig.xml to /configs/conf1/enumsConfig.xml
   [junit4]   2> 2508111 INFO  (TEST-TestSQLHandler.doTest-seed#[84C4C3D43E357222]) [    ] o.a.s.c.AbstractZkTestCase put C:\Users\JenkinsSlave\workspace\Lucene-Solr-trunk-Windows\solr\core\src\test-files\solr\collection1\conf\open-exchange-rates.json to /configs/conf1/open-exchange-rates.json
   [junit4]   2> 2508114 INFO  (TEST-TestSQLHandler.doTest-seed#[84C4C3D43E357222]) [    ] o.a.s.c.AbstractZkTestCase put C:\Users\JenkinsSlave\workspace\Lucene-Solr-trunk-Windows\solr\core\src\test-files\solr\collection1\conf\mapping-ISOLatin1Accent.txt to /configs/conf1/mapping-ISOLatin1Accent.txt
   [junit4]   2> 2508116 INFO  (TEST-TestSQLHandler.doTest-seed#[84C4C3D43E357222]) [    ] o.a.s.c.AbstractZkTestCase put C:\Users\JenkinsSlave\workspace\Lucene-Solr-trunk-Windows\solr\core\src\test-files\solr\collection1\conf\old_synonyms.txt to /configs/conf1/old_synonyms.txt
   [junit4]   2> 2508118 INFO  (TEST-TestSQLHandler.doTest-seed#[84C4C3D43E357222]) [    ] o.a.s.c.AbstractZkTestCase put C:\Users\JenkinsSlave\workspace\Lucene-Solr-trunk-Windows\solr\core\src\test-files\solr\collection1\conf\synonyms.txt to /configs/conf1/synonyms.txt
   [junit4]   2> 2508524 INFO  (TEST-TestSQLHandler.doTest-seed#[84C4C3D43E357222]) [    ] o.a.s.SolrTestCaseJ4 Writing core.properties file to C:\Users\JenkinsSlave\workspace\Lucene-Solr-trunk-Windows\solr\build\solr-core\test\J0\temp\solr.handler.TestSQLHandler_84C4C3D43E357222-001\control-001\cores\collection1
   [junit4]   2> 2508527 INFO  (TEST-TestSQLHandler.doTest-seed#[84C4C3D43E357222]) [    ] o.e.j.s.Server jetty-9.2.11.v20150529
   [junit4]   2> 2508531 INFO  (TEST-TestSQLHandler.doTest-seed#[84C4C3D43E357222]) [    ] o.e.j.s.h.ContextHandler Started o.e.j.s.ServletContextHandler@1dc1475{/,null,AVAILABLE}
   [junit4]   2> 2508541 INFO  (TEST-TestSQLHandler.doTest-seed#[84C4C3D43E357222]) [    ] o.e.j.s.ServerConnector Started ServerConnector@9c0473{SSL-http/1.1}{127.0.0.1:63890}
   [junit4]   2> 2508541 INFO  (TEST-TestSQLHandler.doTest-seed#[84C4C3D43E357222]) [    ] o.e.j.s.Server Started @2514426ms
   [junit4]   2> 2508541 INFO  (TEST-TestSQLHandler.doTest-seed#[84C4C3D43E357222]) [    ] o.a.s.c.s.e.JettySolrRunner Jetty properties: {solr.data.dir=C:\Users\JenkinsSlave\workspace\Lucene-Solr-trunk-Windows\solr\build\solr-core\test\J0\temp\solr.handler.TestSQLHandler_84C4C3D43E357222-001\tempDir-001/control/data, hostContext=/, hostPort=63890, coreRootDirectory=C:\Users\JenkinsSlave\workspace\Lucene-Solr-trunk-Windows\solr\build\solr-core\test\J0\temp\solr.handler.TestSQLHandler_84C4C3D43E357222-001\control-001\cores}
   [junit4]   2> 2508543 INFO  (TEST-TestSQLHandler.doTest-seed#[84C4C3D43E357222]) [    ] o.a.s.s.SolrDispatchFilter SolrDispatchFilter.init(): sun.misc.Launcher$AppClassLoader@e2f2a
   [junit4]   2> 2508543 INFO  (TEST-TestSQLHandler.doTest-seed#[84C4C3D43E357222]) [    ] o.a.s.c.SolrResourceLoader new SolrResourceLoader for directory: 'C:\Users\JenkinsSlave\workspace\Lucene-Solr-trunk-Windows\solr\build\solr-core\test\J0\temp\solr.handler.TestSQLHandler_84C4C3D43E357222-001\control-001\'
   [junit4]   2> 2508569 INFO  (TEST-TestSQLHandler.doTest-seed#[84C4C3D43E357222]) [    ] o.a.s.c.SolrXmlConfig Loading container configuration from C:\Users\JenkinsSlave\workspace\Lucene-Solr-trunk-Windows\solr\build\solr-core\test\J0\temp\solr.handler.TestSQLHandler_84C4C3D43E357222-001\control-001\solr.xml
   [junit4]   2> 2508575 INFO  (TEST-TestSQLHandler.doTest-seed#[84C4C3D43E357222]) [    ] o.a.s.c.CoresLocator Config-defined core root directory: C:\Users\JenkinsSlave\workspace\Lucene-Solr-trunk-Windows\solr\build\solr-core\test\J0\temp\solr.handler.TestSQLHandler_84C4C3D43E357222-001\control-001\cores
   [junit4]   2> 2508575 INFO  (TEST-TestSQLHandler.doTest-seed#[84C4C3D43E357222]) [    ] o.a.s.c.CoreContainer New CoreContainer 27202910
   [junit4]   2> 2508575 INFO  (TEST-TestSQLHandler.doTest-seed#[84C4C3D43E357222]) [    ] o.a.s.c.CoreContainer Loading cores into CoreContainer [instanceDir=C:\Users\JenkinsSlave\workspace\Lucene-Solr-trunk-Windows\solr\build\solr-core\test\J0\temp\solr.handler.TestSQLHandler_84C4C3D43E357222-001\control-001\]
   [junit4]   2> 2508575 INFO  (TEST-TestSQLHandler.doTest-seed#[84C4C3D43E357222]) [    ] o.a.s.c.CoreContainer loading shared library: C:\Users\JenkinsSlave\workspace\Lucene-Solr-trunk-Windows\solr\build\solr-core\test\J0\temp\solr.handler.TestSQLHandler_84C4C3D43E357222-001\control-001\lib
   [junit4]   2> 2508575 WARN  (TEST-TestSQLHandler.doTest-seed#[84C4C3D43E357222]) [    ] o.a.s.c.SolrResourceLoader Can't find (or read) directory to add to classloader: lib (resolved as: C:\Users\JenkinsSlave\workspace\Lucene-Solr-trunk-Windows\solr\build\solr-core\test\J0\temp\solr.handler.TestSQLHandler_84C4C3D43E357222-001\control-001\lib).
   [junit4]   2> 2508591 INFO  (TEST-TestSQLHandler.doTest-seed#[84C4C3D43E357222]) [    ] o.a.s.h.c.HttpShardHandlerFactory created with socketTimeout : 90000,urlScheme : ,connTimeout : 15000,maxConnectionsPerHost : 20,maxConnections : 10000,corePoolSize : 0,maximumPoolSize : 2147483647,maxThreadIdleTime : 5,sizeOfQueue : -1,fairnessPolicy : false,useRetries : false,
   [junit4]   2> 2508596 INFO  (TEST-TestSQLHandler.doTest-seed#[84C4C3D43E357222]) [    ] o.a.s.u.UpdateShardHandler Creating UpdateShardHandler HTTP client with params: socketTimeout=340000&connTimeout=45000&retry=true
   [junit4]   2> 2508599 INFO  (TEST-TestSQLHandler.doTest-seed#[84C4C3D43E357222]) [    ] o.a.s.l.LogWatcher SLF4J impl is org.slf4j.impl.Log4jLoggerFactory
   [junit4]   2> 2508599 INFO  (TEST-TestSQLHandler.doTest-seed#[84C4C3D43E357222]) [    ] o.a.s.l.LogWatcher Registering Log Listener [Log4j (org.slf4j.impl.Log4jLoggerFactory)]
   [junit4]   2> 2508599 INFO  (TEST-TestSQLHandler.doTest-seed#[84C4C3D43E357222]) [    ] o.a.s.c.ZkContainer Zookeeper client=127.0.0.1:63880/solr
   [junit4]   2> 2508600 INFO  (TEST-TestSQLHandler.doTest-seed#[84C4C3D43E357222]) [    ] o.a.s.c.ZkController zkHost includes chroot
   [junit4]   2> 2508629 INFO  (TEST-TestSQLHandler.doTest-seed#[84C4C3D43E357222]) [n:127.0.0.1:63890_    ] o.a.s.c.ZkController Register node as live in ZooKeeper:/live_nodes/127.0.0.1:63890_
   [junit4]   2> 2508635 INFO  (TEST-TestSQLHandler.doTest-seed#[84C4C3D43E357222]) [n:127.0.0.1:63890_    ] o.a.s.c.Overseer Overseer (id=null) closing
   [junit4]   2> 2508636 INFO  (TEST-TestSQLHandler.doTest-seed#[84C4C3D43E357222]) [n:127.0.0.1:63890_    ] o.a.s.c.LeaderElector Joined leadership election with path: /overseer_elect/election/94083329916796932-127.0.0.1:63890_-n_0000000000
   [junit4]   2> 2508637 INFO  (TEST-TestSQLHandler.doTest-seed#[84C4C3D43E357222]) [n:127.0.0.1:63890_    ] o.a.s.c.OverseerElectionContext I am going to be the leader 127.0.0.1:63890_
   [junit4]   2> 2508639 INFO  (TEST-TestSQLHandler.doTest-seed#[84C4C3D43E357222]) [n:127.0.0.1:63890_    ] o.a.s.c.Overseer Overseer (id=94083329916796932-127.0.0.1:63890_-n_0000000000) starting
   [junit4]   2> 2508648 INFO  (TEST-TestSQLHandler.doTest-seed#[84C4C3D43E357222]) [n:127.0.0.1:63890_    ] o.a.s.c.OverseerAutoReplicaFailoverThread Starting OverseerAutoReplicaFailoverThread autoReplicaFailoverWorkLoopDelay=10000 autoReplicaFailoverWaitAfterExpiration=30000 autoReplicaFailoverBadNodeExpiration=60000
   [junit4]   2> 2508649 INFO  (OverseerStateUpdate-94083329916796932-127.0.0.1:63890_-n_0000000000) [n:127.0.0.1:63890_    ] o.a.s.c.Overseer Starting to work on the main queue
   [junit4]   2> 2508650 INFO  (OverseerCollectionProcessor-94083329916796932-127.0.0.1:63890_-n_0000000000) [n:127.0.0.1:63890_    ] o.a.s.c.OverseerCollectionProcessor Process current queue of collection creations
   [junit4]   2> 2508652 INFO  (TEST-TestSQLHandler.doTest-seed#[84C4C3D43E357222]) [n:127.0.0.1:63890_    ] o.a.s.c.CoreContainer No authentication plugin used.
   [junit4]   2> 2508654 INFO  (TEST-TestSQLHandler.doTest-seed#[84C4C3D43E357222]) [n:127.0.0.1:63890_    ] o.a.s.c.CoreContainer Security conf doesn't exist. Skipping setup for authorization module.
   [junit4]   2> 2508657 INFO  (TEST-TestSQLHandler.doTest-seed#[84C4C3D43E357222]) [n:127.0.0.1:63890_    ] o.a.s.c.CoresLocator Looking for core definitions underneath C:\Users\JenkinsSlave\workspace\Lucene-Solr-trunk-Windows\solr\build\solr-core\test\J0\temp\solr.handler.TestSQLHandler_84C4C3D43E357222-001\control-001\cores
   [junit4]   2> 2508658 INFO  (TEST-TestSQLHandler.doTest-seed#[84C4C3D43E357222]) [n:127.0.0.1:63890_    ] o.a.s.c.SolrCore Created CoreDescriptor: {name=collection1, config=solrconfig.xml, transient=false, schema=schema.xml, loadOnStartup=true, instanceDir=C:\Users\JenkinsSlave\workspace\Lucene-Solr-trunk-Windows\solr\build\solr-core\test\J0\temp\solr.handler.TestSQLHandler_84C4C3D43E357222-001\control-001\cores\collection1, collection=control_collection, absoluteInstDir=C:\Users\JenkinsSlave\workspace\Lucene-Solr-trunk-Windows\solr\build\solr-core\test\J0\temp\solr.handler.TestSQLHandler_84C4C3D43E357222-001\control-001\cores\collection1\, coreNodeName=, dataDir=data\, shard=}
   [junit4]   2> 2508659 INFO  (TEST-TestSQLHandler.doTest-seed#[84C4C3D43E357222]) [n:127.0.0.1:63890_    ] o.a.s.c.CoresLocator Found core collection1 in C:\Users\JenkinsSlave\workspace\Lucene-Solr-trunk-Windows\solr\build\solr-core\test\J0\temp\solr.handler.TestSQLHandler_84C4C3D43E357222-001\control-001\cores\collection1\
   [junit4]   2> 2508659 INFO  (TEST-TestSQLHandler.doTest-seed#[84C4C3D43E357222]) [n:127.0.0.1:63890_    ] o.a.s.c.CoresLocator Found 1 core definitions
   [junit4]   2> 2508660 INFO  (TEST-TestSQLHandler.doTest-seed#[84C4C3D43E357222]) [n:127.0.0.1:63890_    ] o.a.s.s.SolrDispatchFilter user.dir=C:\Users\JenkinsSlave\workspace\Lucene-Solr-trunk-Windows\solr\build\solr-core\test\J0
   [junit4]   2> 2508660 INFO  (TEST-TestSQLHandler.doTest-seed#[84C4C3D43E357222]) [n:127.0.0.1:63890_    ] o.a.s.s.SolrDispatchFilter SolrDispatchFilter.init() done
   [junit4]   2> 2508661 INFO  (coreLoadExecutor-6424-thread-1-processing-n:127.0.0.1:63890_) [n:127.0.0.1:63890_ c:control_collection   x:collection1] o.a.s.c.ZkController publishing state=down
   [junit4]   2> 2508661 INFO  (coreLoadExecutor-6424-thread-1-processing-n:127.0.0.1:63890_) [n:127.0.0.1:63890_ c:control_collection   x:collection1] o.a.s.c.ZkController numShards not found on descriptor - reading it from system property
   [junit4]   2> 2508662 INFO  (coreLoadExecutor-6424-thread-1-processing-n:127.0.0.1:63890_) [n:127.0.0.1:63890_ c:control_collection   x:collection1] o.a.s.c.ZkController look for our core node name
   [junit4]   2> 2508662 INFO  (zkCallback-2596-thread-1-processing-n:127.0.0.1:63890_) [n:127.0.0.1:63890_    ] o.a.s.c.DistributedQueue NodeChildrenChanged fired on path /overseer/queue state SyncConnected
   [junit4]   2> 2508664 INFO  (OverseerStateUpdate-94083329916796932-127.0.0.1:63890_-n_0000000000) [n:127.0.0.1:63890_    ] o.a.s.c.Overseer processMessage: queueSize: 1, message = {
   [junit4]   2>   "core":"collection1",
   [junit4]   2>   "roles":null,
   [junit4]   2>   "base_url":"https://127.0.0.1:63890",
   [junit4]   2>   "node_name":"127.0.0.1:63890_",
   [junit4]   2>   "numShards":"1",
   [junit4]   2>   "state":"down",
   [junit4]   2>   "shard":null,
   [junit4]   2>   "collection":"control_collection",
   [junit4]   2>   "operation":"state"} current state version: 0
   [junit4]   2> 2508665 INFO  (OverseerStateUpdate-94083329916796932-127.0.0.1:63890_-n_0000000000) [n:127.0.0.1:63890_    ] o.a.s.c.o.ReplicaMutator Update state numShards=1 message={
   [junit4]   2>   "core":"collection1",
   [junit4]   2>   "roles":null,
   [junit4]   2>   "base_url":"https://127.0.0.1:63890",
   [junit4]   2>   "node_name":"127.0.0.1:63890_",
   [junit4]   2>   "numShards":"1",
   [junit4]   2>   "state":"down",
   [junit4]   2>   "shard":null,
   [junit4]   2>   "collection":"control_collection",
   [junit4]   2>   "operation":"state"}
   [junit4]   2> 2508665 INFO  (OverseerStateUpdate-94083329916796932-127.0.0.1:63890_-n_0000000000) [n:127.0.0.1:63890_    ] o.a.s.c.o.ClusterStateMutator building a new cName: control_collection
   [junit4]   2> 2508665 INFO  (OverseerStateUpdate-94083329916796932-127.0.0.1:63890_-n_0000000000) [n:127.0.0.1:63890_    ] o.a.s.c.o.ReplicaMutator Assigning new node to shard shard=shard1
   [junit4]   2> 2509807 INFO  (coreLoadExecutor-6424-thread-1-processing-n:127.0.0.1:63890_) [n:127.0.0.1:63890_ c:control_collection   x:collection1] o.a.s.c.ZkController waiting to find shard id in clusterstate for collection1
   [junit4]   2> 2509807 INFO  (coreLoadExecutor-6424-thread-1-processing-n:127.0.0.1:63890_) [n:127.0.0.1:63890_ c:control_collection   x:collection1] o.a.s.c.ZkController Check for collection zkNode:control_collection
   [junit4]   2> 2509808 INFO  (coreLoadExecutor-6424-thread-1-processing-n:127.0.0.1:63890_) [n:127.0.0.1:63890_ c:control_collection   x:collection1] o.a.s.c.ZkController Collection zkNode exists
   [junit4]   2> 2509809 INFO  (coreLoadExecutor-6424-thread-1-processing-n:127.0.0.1:63890_) [n:127.0.0.1:63890_ c:control_collection   x:collection1] o.a.s.c.SolrResourceLoader new SolrResourceLoader for directory: 'C:\Users\JenkinsSlave\workspace\Lucene-Solr-trunk-Windows\solr\build\solr-core\test\J0\temp\solr.handler.TestSQLHandler_84C4C3D43E357222-001\control-001\cores\collection1\'
   [junit4]   2> 2509828 INFO  (coreLoadExecutor-6424-thread-1-processing-n:127.0.0.1:63890_) [n:127.0.0.1:63890_ c:control_collection   x:collection1] o.a.s.c.Config loaded config solrconfig.xml with version 0
   [junit4]   2> 2509834 INFO  (coreLoadExecutor-6424-thread-1-processing-n:127.0.0.1:63890_) [n:127.0.0.1:63890_ c:control_collection   x:collection1] o.a.s.c.SolrConfig current version of requestparams : -1
   [junit4]   2> 2509837 INFO  (coreLoadExecutor-6424-thread-1-processing-n:127.0.0.1:63890_) [n:127.0.0.1:63890_ c:control_collection   x:collection1] o.a.s.c.SolrConfig Using Lucene MatchVersion: 6.0.0
   [junit4]   2> 2509846 INFO  (coreLoadExecutor-6424-thread-1-processing-n:127.0.0.1:63890_) [n:127.0.0.1:63890_ c:control_collection   x:collection1] o.a.s.c.Config Loaded SolrConfig: solrconfig.xml
   [junit4]   2> 2509849 INFO  (coreLoadExecutor-6424-thread-1-processing-n:127.0.0.1:63890_) [n:127.0.0.1:63890_ c:control_collection   x:collection1] o.a.s.s.IndexSchema Reading Solr Schema from /configs/conf1/schema.xml
   [junit4]   2> 2509852 INFO  (coreLoadExecutor-6424-thread-1-processing-n:127.0.0.1:63890_) [n:127.0.0.1:63890_ c:control_collection   x:collection1] o.a.s.s.IndexSchema [collection1] Schema name=test
   [junit4]   2> 2509929 INFO  (coreLoadExecutor-6424-thread-1-processing-n:127.0.0.1:63890_) [n:127.0.0.1:63890_ c:control_collection   x:collection1] o.a.s.s.IndexSchema default search field in schema is text
   [junit4]   2> 2509930 INFO  (coreLoadExecutor-6424-thread-1-processing-n:127.0.0.1:63890_) [n:127.0.0.1:63890_ c:control_collection   x:collection1] o.a.s.s.IndexSchema unique key field: id
   [junit4]   2> 2509931 WARN  (coreLoadExecutor-6424-thread-1-processing-n:127.0.0.1:63890_) [n:127.0.0.1:63890_ c:control_collection   x:collection1] o.a.s.s.IndexSchema Field lowerfilt1and2 is not multivalued and destination for multiple copyFields (2)
   [junit4]   2> 2509931 WARN  (coreLoadExecutor-6424-thread-1-processing-n:127.0.0.1:63890_) [n:127.0.0.1:63890_ c:control_collection   x:collection1] o.a.s.s.IndexSchema Field text is not multivalued and destination for multiple copyFields (3)
   [junit4]   2> 2509932 INFO  (coreLoadExecutor-6424-thread-1-processing-n:127.0.0.1:63890_) [n:127.0.0.1:63890_ c:control_collection   x:collection1] o.a.s.c.CoreContainer Creating SolrCore 'collection1' using configuration from collection control_collection
   [junit4]   2> 2509932 INFO  (coreLoadExecutor-6424-thread-1-processing-n:127.0.0.1:63890_) [n:127.0.0.1:63890_ c:control_collection s:shard1 r:core_node1 x:collection1] o.a.s.c.SolrCore org.apache.solr.core.MockDirectoryFactory
   [junit4]   2> 2509932 INFO  (coreLoadExecutor-6424-thread-1-processing-n:127.0.0.1:63890_) [n:127.0.0.1:63890_ c:control_collection s:shard1 r:core_node1 x:collection1] o.a.s.c.SolrCore [[collection1] ] Opening new SolrCore at [C:\Users\JenkinsSlave\workspace\Lucene-Solr-trunk-Windows\solr\build\solr-core\test\J0\temp\solr.handler.TestSQLHandler_84C4C3D43E357222-001\control-001\cores\collection1\], dataDir=[null]
   [junit4]   2> 2509932 INFO  (coreLoadExecutor-6424-thread-1-processing-n:127.0.0.1:63890_) [n:127.0.0.1:63890_ c:control_collection s:shard1 r:core_node1 x:collection1] o.a.s.c.SolrCore JMX monitoring not detected for core: collection1
   [junit4]   2> 2509934 INFO  (coreLoadExecutor-6424-thread-1-processing-n:127.0.0.1:63890_) [n:127.0.0.1:63890_ c:control_collection s:shard1 r:core_node1 x:collection1] o.a.s.c.CachingDirectoryFactory return new directory for C:\Users\JenkinsSlave\workspace\Lucene-Solr-trunk-Windows\solr\build\solr-core\test\J0\temp\solr.handler.TestSQLHandler_84C4C3D43E357222-001\control-001\cores\collection1\data\
   [junit4]   2> 2509934 INFO  (coreLoadExecutor-6424-thread-1-processing-n:127.0.0.1:63890_) [n:127.0.0.1:63890_ c:control_collection s:shard1 r:core_node1 x:collection1] o.a.s.c.SolrCore New index directory detected: old=null new=C:\Users\JenkinsSlave\workspace\Lucene-Solr-trunk-Windows\solr\build\solr-core\test\J0\temp\solr.handler.TestSQLHandler_84C4C3D43E357222-001\control-001\cores\collection1\data\index/
   [junit4]   2> 2509934 WARN  (coreLoadExecutor-6424-thread-1-processing-n:127.0.0.1:63890_) [n:127.0.0.1:63890_ c:control_collection s:shard1 r:core_node1 x:collection1] o.a.s.c.SolrCore [collection1] Solr index directory 'C:\Users\JenkinsSlave\workspace\Lucene-Solr-trunk-Windows\solr\build\solr-core\test\J0\temp\solr.handler.TestSQLHandler_84C4C3D43E357222-001\control-001\cores\collection1\data\index' doesn't exist. Creating new index...
   [junit4]   2> 2509934 INFO  (coreLoadExecutor-6424-thread-1-processing-n:127.0.0.1:63890_) [n:127.0.0.1:63890_ c:control_collection s:shard1 r:core_node1 x:collection1] o.a.s.c.CachingDirectoryFactory return new directory for C:\Users\JenkinsSlave\workspace\Lucene-Solr-trunk-Windows\solr\build\solr-core\test\J0\temp\solr.handler.TestSQLHandler_84C4C3D43E357222-001\control-001\cores\collection1\data\index
   [junit4]   2> 2509935 INFO  (coreLoadExecutor-6424-thread-1-processing-n:127.0.0.1:63890_) [n:127.0.0.1:63890_ c:control_collection s:shard1 r:core_node1 x:collection1] o.a.s.c.SolrCore SolrDeletionPolicy.onCommit: commits: num=1
   [junit4]   2> commit{dir=MockDirectoryWrapper(RAMDirectory@168f7b1 lockFactory=org.apache.lucene.store.SingleInstanceLockFactory@11052b6),segFN=segments_1,generation=1}
   [junit4]   2> 2509935 INFO  (coreLoadExecutor-6424-thread-1-processing-n:127.0.0.1:63890_) [n:127.0.0.1:63890_ c:control_collection s:shard1 r:core_node1 x:collection1] o.a.s.c.SolrCore newest commit generation = 1
   [junit4]   2> 2509936 INFO  (OldIndexDirectoryCleanupThreadForCore-collection1) [n:127.0.0.1:63890_ c:control_collection s:shard1 r:core_node1 x:collection1] o.a.s.c.SolrCore Looking for old index directories to cleanup for core collection1 in C:\Users\JenkinsSlave\workspace\Lucene-Solr-trunk-Windows\solr\build\solr-core\test\J0\temp\solr.handler.TestSQLHandler_84C4C3D43E357222-001\control-001\cores\collection1\data\
   [junit4]   2> 2509937 WARN  (OldIndexDirectoryCleanupThreadForCore-collection1) [n:127.0.0.1:63890_ c:control_collection s:shard1 r:core_node1 x:collection1] o.a.s.c.DirectoryFactory C:\Users\JenkinsSlave\workspace\Lucene-Solr-trunk-Windows\solr\build\solr-core\test\J0\temp\solr.handler.TestSQLHandler_84C4C3D43E357222-001\control-001\cores\collection1\data\ does not point to a valid data directory; skipping clean-up of old index directories.
   [junit4]   2> 2509938 INFO  (coreLoadExecutor-6424-thread-1-processing-n:127.0.0.1:63890_) [n:127.0.0.1:63890_ c:control_collection s:shard1 r:core_node1 x:collection1] o.a.s.c.SolrCore no updateRequestProcessorChain defined as default, creating implicit default
   [junit4]   2> 2509944 INFO  (coreLoadExecutor-6424-thread-1-processing-n:127.0.0.1:63890_) [n:127.0.0.1:63890_ c:control_collection s:shard1 r:core_node1 x:collection1] o.a.s.h.l.XMLLoader xsltCacheLifetimeSeconds=60
   [junit4]   2> 2509945 INFO  (coreLoadExecutor-6424-thread-1-processing-n:127.0.0.1:63890_) [n:127.0.0.1:63890_ c:control_collection s:shard1 r:core_node1 x:collection1] o.a.s.h.l.XMLLoader xsltCacheLifetimeSeconds=60
   [junit4]   2> 2509946 INFO  (coreLoadExecutor-6424-thread-1-processing-n:127.0.0.1:63890_) [n:127.0.0.1:63890_ c:control_collection s:shard1 r:core_node1 x:collection1] o.a.s.h.l.XMLLoader xsltCacheLifetimeSeconds=60
   [junit4]   2> 2509947 INFO  (coreLoadExecutor-6424-thread-1-processing-n:127.0.0.1:63890_) [n:127.0.0.1:63890_ c:control_collection s:shard1 r:core_node1 x:collection1] o.a.s.h.l.XMLLoader xsltCacheLifetimeSeconds=60
   [junit4]   2> 2509947 INFO  (coreLoadExecutor-6424-thread-1-processing-n:127.0.0.1:63890_) [n:127.0.0.1:63890_ c:control_collection s:shard1 r:core_node1 x:collection1] o.a.s.c.PluginBag requestHandler : '/replication' created with startup=lazy
   [junit4]   2> 2509995 WARN  (coreLoadExecutor-6424-thread-1-processing-n:127.0.0.1:63890_) [n:127.0.0.1:63890_ c:control_collection s:shard1 r:core_node1 x:collection1] o.a.s.c.SolrResourceLoader Solr loaded a deprecated plugin/analysis class [org.apache.solr.handler.admin.AdminHandlers]. Please consult documentation how to replace it accordingly.
   [junit4]   2> 2509995 WARN  (coreLoadExecutor-6424-thread-1-processing-n:127.0.0.1:63890_) [n:127.0.0.1:63890_ c:control_collection s:shard1 r:core_node1 x:collection1] o.a.s.c.SolrResourceLoader Solr loaded a deprecated plugin/analysis class [org.apache.solr.handler.admin.AdminHandlers]. Please consult documentation how to replace it accordingly.
   [junit4]   2> 2509996 INFO  (coreLoadExecutor-6424-thread-1-processing-n:127.0.0.1:63890_) [n:127.0.0.1:63890_ c:control_collection s:shard1 r:core_node1 x:collection1] o.a.s.c.RequestHandlers Registered paths: /admin/mbeans,standard,,/update/json/docs,/admin/luke,/export,/get,/admin/properties,/update/json,/admin/threads,/update/csv,/sql,/admin/segments,/admin/system,/replication,/config,/stream,/schema,/admin/plugins,/admin/logging,/admin,/admin/ping,/update,/admin/file
   [junit4]   2> 2509996 WARN  (coreLoadExecutor-6424-thread-1-processing-n:127.0.0.1:63890_) [n:127.0.0.1:63890_ c:control_collection s:shard1 r:core_node1 x:collection1] o.a.s.c.RequestHandlers no default request handler is registered (either '/select' or 'standard')
   [junit4]   2> 2510002 INFO  (coreLoadExecutor-6424-thread-1-processing-n:127.0.0.1:63890_) [n:127.0.0.1:63890_ c:control_collection s:shard1 r:core_node1 x:collection1] o.a.s.c.SolrCore Using default statsCache cache: org.apache.solr.search.stats.LocalStatsCache
   [junit4]   2> 2510003 INFO  (coreLoadExecutor-6424-thread-1-processing-n:127.0.0.1:63890_) [n:127.0.0.1:63890_ c:control_collection s:shard1 r:core_node1 x:collection1] o.a.s.u.UpdateHandler Using UpdateLog implementation: org.apache.solr.update.UpdateLog
   [junit4]   2> 2510003 INFO  (coreLoadExecutor-6424-thread-1-processing-n:127.0.0.1:63890_) [n:127.0.0.1:63890_ c:control_collection s:shard1 r:core_node1 x:collection1] o.a.s.u.UpdateLog Initializing UpdateLog: dataDir= defaultSyncLevel=FLUSH numRecordsToKeep=100 maxNumLogsToKeep=10 numVersionBuckets=65536
   [junit4]   2> 2510004 INFO  (coreLoadExecutor-6424-thread-1-processing-n:127.0.0.1:63890_) [n:127.0.0.1:63890_ c:control_collection s:shard1 r:core_node1 x:collection1] o.a.s.c.SolrCore Hard AutoCommit: disabled
   [junit4]   2> 2510004 INFO  (coreLoadExecutor-6424-thread-1-processing-n:127.0.0.1:63890_) [n:127.0.0.1:63890_ c:control_collection s:shard1 r:core_node1 x:collection1] o.a.s.c.SolrCore Soft AutoCommit: disabled
   [junit4]   2> 2510005 INFO  (coreLoadExecutor-6424-thread-1-processing-n:127.0.0.1:63890_) [n:127.0.0.1:63890_ c:control_collection s:shard1 r:core_node1 x:collection1] o.a.s.c.SolrCore SolrDeletionPolicy.onInit: commits: num=1
   [junit4]   2> commit{dir=MockDirectoryWrapper(RAMDirectory@168f7b1 lockFactory=org.apache.lucene.store.SingleInstanceLockFactory@11052b6),segFN=segments_1,generation=1}
   [junit4]   2> 2510005 INFO  (coreLoadExecutor-6424-thread-1-processing-n:127.0.0.1:63890_) [n:127.0.0.1:63890_ c:control_collection s:shard1 r:core_node1 x:collection1] o.a.s.c.SolrCore newest commit generation = 1
   [junit4]   2> 2510005 INFO  (coreLoadExecutor-6424-thread-1-processing-n:127.0.0.1:63890_) [n:127.0.0.1:63890_ c:control_collection s:shard1 r:core_node1 x:collection1] o.a.s.s.SolrIndexSearcher Opening Searcher@1688549[collection1] main
   [junit4]   2> 2510007 INFO  (coreLoadExecutor-6424-thread-1-processing-n:127.0.0.1:63890_) [n:127.0.0.1:63890_ c:control_collection s:shard1 r:core_node1 x:collection1] o.a.s.r.ManagedResourceStorage Setting up ZooKeeper-based storage for the RestManager with znodeBase: /configs/conf1
   [junit4]   2> 2510007 INFO  (coreLoadExecutor-6424-thread-1-processing-n:127.0.0.1:63890_) [n:127.0.0.1:63890_ c:control_collection s:shard1 r:core_node1 x:collection1] o.a.s.r.ManagedResourceStorage Configured ZooKeeperStorageIO with znodeBase: /configs/conf1
   [junit4]   2> 2510007 INFO  (coreLoadExecutor-6424-thread-1-processing-n:127.0.0.1:63890_) [n:127.0.0.1:63890_ c:control_collection s:shard1 r:core_node1 x:collection1] o.a.s.r.RestManager Initializing RestManager with initArgs: {}
   [junit4]   2> 2510007 INFO  (coreLoadExecutor-6424-thread-1-processing-n:127.0.0.1:63890_) [n:127.0.0.1:63890_ c:control_collection s:shard1 r:core_node1 x:collection1] o.a.s.r.ManagedResourceStorage Reading _rest_managed.json using ZooKeeperStorageIO:path=/configs/conf1
   [junit4]   2> 2510008 INFO  (coreLoadExecutor-6424-thread-1-processing-n:127.0.0.1:63890_) [n:127.0.0.1:63890_ c:control_collection s:shard1 r:core_node1 x:collection1] o.a.s.r.ManagedResourceStorage No data found for znode /configs/conf1/_rest_managed.json
   [junit4]   2> 2510008 INFO  (coreLoadExecutor-6424-thread-1-processing-n:127.0.0.1:63890_) [n:127.0.0.1:63890_ c:control_collection s:shard1 r:core_node1 x:collection1] o.a.s.r.ManagedResourceStorage Loaded null at path _rest_managed.json using ZooKeeperStorageIO:path=/configs/conf1
   [junit4]   2> 2510008 INFO  (coreLoadExecutor-6424-thread-1-processing-n:127.0.0.1:63890_) [n:127.0.0.1:63890_ c:control_collection s:shard1 r:core_node1 x:collection1] o.a.s.r.RestManager Initializing 0 registered ManagedResources
   [junit4]   2> 2510011 WARN  (coreLoadExecutor-6424-thread-1-processing-n:127.0.0.1:63890_) [n:127.0.0.1:63890_ c:control_collection s:shard1 r:core_node1 x:collection1] o.a.s.h.a.AdminHandlers <requestHandler name="/admin/"
   [junit4]   2>  class="solr.admin.AdminHandlers" /> is deprecated . It is not required anymore
   [junit4]   2> 2510011 INFO  (searcherExecutor-6425-thread-1-processing-n:127.0.0.1:63890_ x:collection1 s:shard1 c:control_collection r:core_node1) [n:127.0.0.1:63890_ c:control_collection s:shard1 r:core_node1 x:collection1] o.a.s.c.SolrCore [collection1] Registered new searcher Searcher@1688549[collection1] main{ExitableDirectoryReader(UninvertingDirectoryReader())}
   [junit4]   2> 2510011 INFO  (coreLoadExecutor-6424-thread-1-processing-n:127.0.0.1:63890_) [n:127.0.0.1:63890_ c:control_collection s:shard1 r:core_node1 x:collection1] o.a.s.u.UpdateLog Looking up max value of version field to seed version buckets
   [junit4]   2> 2510011 INFO  (coreLoadExecutor-6424-thread-1-processing-n:127.0.0.1:63890_) [n:127.0.0.1:63890_ c:control_collection s:shard1 r:core_node1 x:collection1] o.a.s.u.VersionInfo Refreshing highest value of _version_ for 65536 version buckets from index
   [junit4]   2> 2510011 INFO  (coreLoadExecutor-6424-thread-1-processing-n:127.0.0.1:63890_) [n:127.0.0.1:63890_ c:control_collection s:shard1 r:core_node1 x:collection1] o.a.s.u.VersionInfo No terms found for _version_, cannot seed version bucket highest value from index
   [junit4]   2> 2510011 INFO  (coreLoadExecutor-6424-thread-1-processing-n:127.0.0.1:63890_) [n:127.0.0.1:63890_ c:control_collection s:shard1 r:core_node1 x:collection1] o.a.s.u.UpdateLog Could not find max version in index or recent updates, using new clock 1505333280822525952
   [junit4]   2> 2510014 INFO  (coreLoadExecutor-6424-thread-1-processing-n:127.0.0.1:63890_) [n:127.0.0.1:63890_ c:control_collection s:shard1 r:core_node1 x:collection1] o.a.s.u.UpdateLog Took 3 ms to seed version buckets with highest version 1505333280822525952
   [junit4]   2> 2510014 INFO  (coreLoadExecutor-6424-thread-1-processing-n:127.0.0.1:63890_) [n:127.0.0.1:63890_ c:control_collection s:shard1 r:core_node1 x:collection1] o.a.s.c.ZkController watch zkdir /configs/conf1
   [junit4]   2> 2510014 INFO  (coreLoadExecutor-6424-thread-1-processing-n:127.0.0.1:63890_) [n:127.0.0.1:63890_ c:control_collection s:shard1 r:core_node1 x:collection1] o.a.s.c.CoreContainer registering core: collection1
   [junit4]   2> 2510015 INFO  (coreZkRegister-6418-thread-1-processing-n:127.0.0.1:63890_ x:collection1 s:shard1 c:control_collection r:core_node1) [n:127.0.0.1:63890_ c:control_collection s:shard1 r:core_node1 x:collection1] o.a.s.c.ZkController Register replica - core:collection1 address:https://127.0.0.1:63890 collection:control_collection shard:shard1
   [junit4]   2> 2510024 INFO  (coreZkRegister-6418-thread-1-processing-n:127.0.0.1:63890_ x:collection1 s:shard1 c:control_collection r:core_node1) [n:127.0.0.1:63890_ c:control_collection s:shard1 r:core_node1 x:collection1] o.a.s.c.LeaderElector Joined leadership election with path: /collections/control_collection/leader_elect/shard1/election/94083329916796932-core_node1-n_0000000000
   [junit4]   2> 2510025 INFO  (coreZkRegister-6418-thread-1-processing-n:127.0.0.1:63890_ x:collection1 s:shard1 c:control_collection r:core_node1) [n:127.0.0.1:63890_ c:control_collection s:shard1 r:core_node1 x:collection1] o.a.s.c.ShardLeaderElectionContext Running the leader process for shard shard1
   [junit4]   2> 2510026 INFO  (zkCallback-2596-thread-1-processing-n:127.0.0.1:63890_) [n:127.0.0.1:63890_    ] o.a.s.c.DistributedQueue NodeChildrenChanged fired on path /overseer/queue state SyncConnected
   [junit4]   2> 2510027 INFO  (coreZkRegister-6418-thread-1-processing-n:127.0.0.1:63890_ x:collection1 s:shard1 c:control_collection r:core_node1) [n:127.0.0.1:63890_ c:control_collection s:shard1 r:core_node1 x:collection1] o.a.s.c.ShardLeaderElectionContext Enough replicas found to continue.
   [junit4]   2> 2510027 INFO  (coreZkRegister-6418-thread-1-processing-n:127.0.0.1:63890_ x:collection1 s:shard1 c:control_collection r:core_node1) [n:127.0.0.1:63890_ c:control_collection s:shard1 r:core_node1 x:collection1] o.a.s.c.ShardLeaderElectionContext I may be the new leader - try and sync
   [junit4]   2> 2510029 INFO  (coreZkRegister-6418-thread-1-processing-n:127.0.0.1:63890_ x:collection1 s:shard1 c:control_collection r:core_node1) [n:127.0.0.1:63890_ c:control_collection s:shard1 r:core_node1 x:collection1] o.a.s.c.SyncStrategy Sync replicas to https://127.0.0.1:63890/collection1/
   [junit4]   2> 2510029 INFO  (coreZkRegister-6418-thread-1-processing-n:127.0.0.1:63890_ x:collection1 s:shard1 c:control_collection r:core_node1) [n:127.0.0.1:63890_ c:control_collection s:shard1 r:core_node1 x:collection1] o.a.s.c.SyncStrategy Sync Success - now sync replicas to me
   [junit4]   2> 2510029 INFO  (coreZkRegister-6418-thread-1-processing-n:127.0.0.1:63890_ x:collection1 s:shard1 c:control_collection r:core_node1) [n:127.0.0.1:63890_ c:control_collection s:shard1 r:core_node1 x:collection1] o.a.s.c.SyncStrategy https://127.0.0.1:63890/collection1/ has no replicas
   [junit4]   2> 2510029 INFO  (coreZkRegister-6418-thread-1-processing-n:127.0.0.1:63890_ x:collection1 s:shard1 c:control_collection r:core_node1) [n:127.0.0.1:63890_ c:control_collection s:shard1 r:core_node1 x:collection1] o.a.s.c.ShardLeaderElectionContext I am the new leader: https://127.0.0.1:63890/collection1/ shard1
   [junit4]   2> 2510030 INFO  (OverseerStateUpdate-94083329916796932-127.0.0.1:63890_-n_0000000000) [n:127.0.0.1:63890_    ] o.a.s.c.Overseer processMessage: queueSize: 1, message = {
   [junit4]   2>   "operation":"leader",
   [junit4]   2>   "shard":"shard1",
   [junit4]   2>   "collection":"control_collection"} current state version: 1
   [junit4]   2> 2510034 INFO  (zkCallback-2596-thread-1-processing-n:127.0.0.1:63890_) [n:127.0.0.1:63890_    ] o.a.s.c.DistributedQueue NodeChildrenChanged fired on path /overseer/queue state SyncConnected
   [junit4]   2> 2510035 INFO  (OverseerStateUpdate-94083329916796932-127.0.0.1:63890_-n_0000000000) [n:127.0.0.1:63890_    ] o.a.s.c.Overseer processMessage: queueSize: 1, message = {
   [junit4]   2>   "operation":"leader",
   [junit4]   2>   "shard":"shard1",
   [junit4]   2>   "collection":"control_collection",
   [junit4]   2>   "base_url":"https://127.0.0.1:63890",
   [junit4]   2>   "core":"collection1",
   [junit4]   2>   "state":"active"} current state version: 1
   [junit4]   2> 2510210 INFO  (coreZkRegister-6418-thread-1-processing-n:127.0.0.1:63890_ x:collection1 s:shard1 c:control_collection r:core_node1) [n:127.0.0.1:63890_ c:control_collection s:shard1 r:core_node1 x:collection1] o.a.s.c.ZkController We are https://127.0.0.1:63890/collection1/ and leader is https://127.0.0.1:63890/collection1/
   [junit4]   2> 2510210 INFO  (coreZkRegister-6418-thread-1-processing-n:127.0.0.1:63890_ x:collection1 s:shard1 c:control_collection r:core_node1) [n:127.0.0.1:63890_ c:control_collection s:shard1 r:core_node1 x:collection1] o.a.s.c.ZkController No LogReplay needed for core=collection1 baseURL=https://127.0.0.1:63890
   [junit4]   2> 2510210 INFO  (coreZkRegister-6418-thread-1-processing-n:127.0.0.1:63890_ x:collection1 s:shard1 c:control_collection r:core_node1) [n:127.0.0.1:63890_ c:control_collection s:shard1 r:core_node1 x:collection1] o.a.s.c.ZkController I am the leader, no recovery necessary
   [junit4]   2> 2510210 INFO  (coreZkRegister-6418-thread-1-processing-n:127.0.0.1:63890_ x:collection1 s:shard1 c:control_collection r:core_node1) [n:127.0.0.1:63890_ c:control_collection s:shard1 r:core_node1 x:collection1] o.a.s.c.ZkController publishing state=active
   [junit4]   2> 2510210 INFO  (coreZkRegister-6418-thread-1-processing-n:127.0.0.1:63890_ x:collection1 s:shard1 c:control_collection r:core_node1) [n:127.0.0.1:63890_ c:control_collection s:shard1 r:core_node1 x:collection1] o.a.s.c.ZkController numShards not found on descriptor - reading it from system property
   [junit4]   2> 2510212 INFO  (zkCallback-2596-thread-1-processing-n:127.0.0.1:63890_) [n:127.0.0.1:63890_    ] o.a.s.c.DistributedQueue NodeChildrenChanged fired on path /overseer/queue state SyncConnected
   [junit4]   2> 2510213 INFO  (OverseerStateUpdate-94083329916796932-127.0.0.1:63890_-n_0000000000) [n:127.0.0.1:63890_    ] o.a.s.c.Overseer processMessage: queueSize: 1, message = {
   [junit4]   2>   "core":"collection1",
   [junit4]   2>   "core_node_name":"core_node1",
   [junit4]   2>   "roles":null,
   [junit4]   2>   "base_url":"https://127.0.0.1:63890",
   [junit4]   2>   "node_name":"127.0.0.1:63890_",
   [junit4]   2>   "numShards":"1",
   [junit4]   2>   "state":"active",
   [junit4]   2>   "shard":"shard1",
   [junit4]   2>   "collection":"control_collection",
   [junit4]   2>   "operation":"state"} current state version: 2
   [junit4]   2> 2510214 INFO  (OverseerStateUpdate-94083329916796932-127.0.0.1:63890_-n_0000000000) [n:127.0.0.1:63890_    ] o.a.s.c.o.ReplicaMutator Update state numShards=1 message={
   [junit4]   2>   "core":"collection1",
   [junit4]   2>   "core_node_name":"core_node1",
   [junit4]   2>   "roles":null,
   [junit4]   2>   "base_url":"https://127.0.0.1:63890",
   [junit4]   2>   "node_name":"127.0.0.1:63890_",
   [junit4]   2>   "numShards":"1",
   [junit4]   2>   "state":"active",
   [junit4]   2>   "shard":"shard1",
   [junit4]   2>   "collection":"control_collection",
   [junit4]   2>   "operation":"state"}
   [junit4]   2> 2510392 INFO  (TEST-TestSQLHandler.doTest-seed#[84C4C3D43E357222]) [    ] o.a.s.c.ChaosMonkey monkey: init - expire sessions:false cause connection loss:false
   [junit4]   2> 2510393 INFO  (TEST-TestSQLHandler.doTest-seed#[84C4C3D43E357222]) [    ] o.a.s.c.AbstractFullDistribZkTestBase Creating collection1 with stateFormat=2
   [junit4]   2> 2510397 INFO  (zkCallback-2596-thread-1-processing-n:127.0.0.1:63890_) [n:127.0.0.1:63890_    ] o.a.s.c.DistributedQueue NodeChildrenChanged fired on path /overseer/queue state SyncConnected
   [junit4]   2> 2510400 INFO  (OverseerStateUpdate-94083329916796932-127.0.0.1:63890_-n_0000000000) [n:127.0.0.1:63890_    ] o.a.s.c.Overseer processMessage: queueSize: 1, message = {
   [junit4]   2>   "operation":"create",
   [junit4]   2>   "name":"collection1",
   [junit4]   2>   "numShards":"2",
   [junit4]   2>   "stateFormat":"2"} current state version: 3
   [junit4]   2> 2510401 INFO  (OverseerStateUpdate-94083329916796932-127.0.0.1:63890_-n_0000000000) [n:127.0.0.1:63890_    ] o.a.s.c.o.ClusterStateMutator building a new cName: collection1
   [junit4]   2> 2510519 INFO  (OverseerStateUpdate-94083329916796932-127.0.0.1:63890_-n_0000000000) [n:127.0.0.1:63890_    ] o.a.s.c.o.ZkStateWriter going to create_collection /collections/collection1/state.json
   [junit4]   2> 2510771 INFO  (TEST-TestSQLHandler.doTest-seed#[84C4C3D43E357222]) [    ] o.a.s.SolrTestCaseJ4 Writing core.properties file to C:\Users\JenkinsSlave\workspace\Lucene-Solr-trunk-Windows\solr\build\solr-core\test\J0\temp\solr.handler.TestSQLHandler_84C4C3D43E357222-001\shard-1-001\cores\collection1
   [junit4]   2> 2510773 INFO  (TEST-TestSQLHandler.doTest-seed#[84C4C3D43E357222]) [    ] o.a.s.c.AbstractFullDistribZkTestBase create jetty 1 in directory C:\Users\JenkinsSlave\workspace\Lucene-Solr-trunk-Windows\solr\build\solr-core\test\J0\temp\solr.handler.TestSQLHandler_84C4C3D43E357222-001\shard-1-001
   [junit4]   2> 2510774 INFO  (TEST-TestSQLHandler.doTest-seed#[84C4C3D43E357222]) [    ] o.e.j.s.Server jetty-9.2.11.v20150529
   [junit4]   2> 2510778 INFO  (TEST-TestSQLHandler.doTest-seed#[84C4C3D43E357222]) [    ] o.e.j.s.h.ContextHandler Started o.e.j.s.ServletContextHandler@d6551d{/,null,AVAILABLE}
   [junit4]   2> 2510785 INFO  (TEST-TestSQLHandler.doTest-seed#[84C4C3D43E357222]) [    ] o.e.j.s.ServerConnector Started ServerConnector@18513d1{SSL-http/1.1}{127.0.0.1:63926}
   [junit4]   2> 2510785 INFO  (TEST-TestSQLHandler.doTest-seed#[84C4C3D43E357222]) [    ] o.e.j.s.Server Started @2516398ms
   [junit4]   2> 2510785 INFO  (TEST-TestSQLHandler.doTest-seed#[84C4C3D43E357222]) [    ] o.a.s.c.s.e.JettySolrRunner Jetty properties: {solr.data.dir=C:\Users\JenkinsSlave\workspace\Lucene-Solr-trunk-Windows\solr\build\solr-core\test\J0\temp\solr.handler.TestSQLHandler_84C4C3D43E357222-001\tempDir-001/jetty1, solrconfig=solrconfig.xml, hostContext=/, hostPort=63926, coreRootDirectory=C:\Users\JenkinsSlave\workspace\Lucene-Solr-trunk-Windows\solr\build\solr-core\test\J0\..\..\..\..\..\..\..\..\..\Users\JenkinsSlave\workspace\Lucene-Solr-trunk-Windows\solr\build\solr-core\test\J0\temp\solr.handler.TestSQLHandler_84C4C3D43E357222-001\shard-1-001\cores}
   [junit4]   2> 2510790 INFO  (TEST-TestSQLHandler.doTest-seed#[84C4C3D43E357222]) [    ] o.a.s.s.SolrDispatchFilter SolrDispatchFilter.init(): sun.misc.Launcher$AppClassLoader@e2f2a
   [junit4]   2> 2510790 INFO  (TEST-TestSQLHandler.doTest-seed#[84C4C3D43E357222]) [    ] o.a.s.c.SolrResourceLoader new SolrResourceLoader for directory: 'C:\Users\JenkinsSlave\workspace\Lucene-Solr-trunk-Windows\solr\build\solr-core\test\J0\..\..\..\..\..\..\..\..\..\Users\JenkinsSlave\workspace\Lucene-Solr-trunk-Windows\solr\build\solr-core\test\J0\temp\solr.handler.TestSQLHandler_84C4C3D43E357222-001\shard-1-001\'
   [junit4]   2> 2510818 INFO  (TEST-TestSQLHandler.doTest-seed#[84C4C3D43E357222]) [    ] o.a.s.c.SolrXmlConfig Loading container configuration from C:\Users\JenkinsSlave\workspace\Lucene-Solr-trunk-Windows\solr\build\solr-core\test\J0\..\..\..\..\..\..\..\..\..\Users\JenkinsSlave\workspace\Lucene-Solr-trunk-Windows\solr\build\solr-core\test\J0\temp\solr.handler.TestSQLHandler_84C4C3D43E357222-001\shard-1-001\solr.xml
   [junit4]   2> 2510833 INFO  (TEST-TestSQLHandler.doTest-seed#[84C4C3D43E357222]) [    ] o.a.s.c.CoresLocator Config-defined core root directory: C:\Users\JenkinsSlave\workspace\Lucene-Solr-trunk-Windows\solr\build\solr-core\test\J0\..\..\..\..\..\..\..\..\..\Users\JenkinsSlave\workspace\Lucene-Solr-trunk-Windows\solr\build\solr-core\test\J0\temp\solr.handler.TestSQLHandler_84C4C3D43E357222-001\shard-1-001\cores
   [junit4]   2> 2510835 INFO  (TEST-TestSQLHandler.doTest-seed#[84C4C3D43E357222]) [    ] o.a.s.c.CoreContainer New CoreContainer 18321381
   [junit4]   2> 2510835 INFO  (TEST-TestSQLHandler.doTest-seed#[84C4C3D43E357222]) [    ] o.a.s.c.CoreContainer Loading cores into CoreContainer [instanceDir=C:\Users\JenkinsSlave\workspace\Lucene-Solr-trunk-Windows\solr\build\solr-core\test\J0\..\..\..\..\..\..\..\..\..\Users\JenkinsSlave\workspace\Lucene-Solr-trunk-Windows\solr\build\solr-core\test\J0\temp\solr.handler.TestSQLHandler_84C4C3D43E357222-001\shard-1-001\]
   [junit4]   2> 2510835 INFO  (TEST-TestSQLHandler.doTest-seed#[84C4C3D43E357222]) [    ] o.a.s.c.CoreContainer loading shared library: C:\Users\JenkinsSlave\workspace\Lucene-Solr-trunk-Windows\solr\build\solr-core\test\J0\..\..\..\..\..\..\..\..\..\Users\JenkinsSlave\workspace\Lucene-Solr-trunk-Windows\solr\build\solr-core\test\J0\temp\solr.handler.TestSQLHandler_84C4C3D43E357222-001\shard-1-001\lib
   [junit4]   2> 2510836 WARN  (TEST-TestSQLHandler.doTest-seed#[84C4C3D43E357222]) [    ] o.a.s.c.SolrResourceLoader Can't find (or read) directory to add to classloader: lib (resolved as: C:\Users\JenkinsSlave\workspace\Lucene-Solr-trunk-Windows\solr\build\solr-core\test\J0\..\..\..\..\..\..\..\..\..\Users\JenkinsSlave\workspace\Lucene-Solr-trunk-Windows\solr\build\solr-core\test\J0\temp\solr.handler.TestSQLHandler_84C4C3D43E357222-001\shard-1-001\lib).
   [junit4]   2> 2510846 INFO  (TEST-TestSQLHandler.doTest-seed#[84C4C3D43E357222]) [    ] o.a.s.h.c.HttpShardHandlerFactory created with socketTimeout : 90000,urlScheme : ,connTimeout : 15000,maxConnectionsPerHost : 20,maxConnections : 10000,corePoolSize : 0,maximumPoolSize : 2147483647,maxThreadIdleTime : 5,sizeOfQueue : -1,fairnessPolicy : false,useRetries : false,
   [junit4]   2> 2510851 INFO  (TEST-TestSQLHandler.doTest-seed#[84C4C3D43E357222]) [    ] o.a.s.u.UpdateShardHandler Creating UpdateShardHandler HTTP client with params: socketTimeout=340000&connTimeout=45000&retry=true
   [junit4]   2> 2510854 INFO  (TEST-TestSQLHandler.doTest-seed#[84C4C3D43E357222]) [    ] o.a.s.l.LogWatcher SLF4J impl is org.slf4j.impl.Log4jLoggerFactory
   [junit4]   2> 2510854 INFO  (TEST-TestSQLHandler.doTest-seed#[84C4C3D43E357222]) [    ] o.a.s.l.LogWatcher Registering Log Listener [Log4j (org.slf4j.impl.Log4jLoggerFactory)]
   [junit4]   2> 2510855 INFO  (TEST-TestSQLHandler.doTest-seed#[84C4C3D43E357222]) [    ] o.a.s.c.ZkContainer Zookeeper client=127.0.0.1:63880/solr
   [junit4]   2> 2510855 INFO  (TEST-TestSQLHandler.doTest-seed#[84C4C3D43E357222]) [    ] o.a.s.c.ZkController zkHost includes chroot
   [junit4]   2> 2512020 INFO  (TEST-TestSQLHandler.doTest-seed#[84C4C3D43E357222]) [n:127.0.0.1:63926_    ] o.a.s.c.ZkController Register node as live in ZooKeeper:/live_nodes/127.0.0.1:63926_
   [junit4]   2> 2512024 INFO  (TEST-TestSQLHandler.doTest-seed#[84C4C3D43E357222]) [n:127.0.0.1:63926_    ] o.a.s.c.Overseer Overseer (id=null) closing
   [junit4]   2> 2512024 INFO  (TEST-TestSQLHandler.doTest-seed#[84C4C3D43E357222]) [n:127.0.0.1:63926_    ] o.a.s.c.LeaderElector Joined leadership election with path: /overseer_elect/election/94083329916796936-127.0.0.1:63926_-n_0000000001
   [junit4]   2> 2512025 INFO  (TEST-TestSQLHandler.doTest-seed#[84C4C3D43E357222]) [n:127.0.0.1:63926_    ] o.a.s.c.LeaderElector Watching path /overseer_elect/election/94083329916796932-127.0.0.1:63890_-n_0000000000 to know if I could be the leader
   [junit4]   2> 2512026 INFO  (TEST-TestSQLHandler.doTest-seed#[84C4C3D43E357222]) [n:127.0.0.1:63926_    ] o.a.s.c.CoreContainer No authentication plugin used.
   [junit4]   2> 2512026 INFO  (TEST-TestSQLHandler.doTest-seed#[84C4C3D43E357222]) [n:127.0.0.1:63926_    ] o.a.s.c.CoreContainer Security conf doesn't exist. Skipping setup for authorization module.
   [junit4]   2> 2512027 INFO  (TEST-TestSQLHandler.doTest-seed#[84C4C3D43E357222]) [n:127.0.0.1:63926_    ] o.a.s.c.CoresLocator Looking for core definitions underneath C:\Users\JenkinsSlave\workspace\Lucene-Solr-trunk-Windows\solr\build\solr-core\test\J0\..\..\..\..\..\..\..\..\..\Users\JenkinsSlave\workspace\Lucene-Solr-trunk-Windows\solr\build\solr-core\test\J0\temp\solr.handler.TestSQLHandler_84C4C3D43E357222-001\shard-1-001\cores
   [junit4]   2> 2512030 INFO  (TEST-TestSQLHandler.doTest-seed#[84C4C3D43E357222]) [n:127.0.0.1:63926_    ] o.a.s.c.SolrCore Created CoreDescriptor: {name=collection1, config=solrconfig.xml, transient=false, schema=schema.xml, loadOnStartup=true, instanceDir=C:\Users\JenkinsSlave\workspace\Lucene-Solr-trunk-Windows\solr\build\solr-core\test\J0\..\..\..\..\..\..\..\..\..\Users\JenkinsSlave\workspace\Lucene-Solr-trunk-Windows\solr\build\solr-core\test\J0\temp\solr.handler.TestSQLHandler_84C4C3D43E357222-001\shard-1-001\cores\collection1, collection=collection1, absoluteInstDir=C:\Users\JenkinsSlave\workspace\Lucene-Solr-trunk-Windows\solr\build\solr-core\test\J0\..\..\..\..\..\..\..\..\..\Users\JenkinsSlave\workspace\Lucene-Solr-trunk-Windows\solr\build\solr-core\test\J0\temp\solr.handler.TestSQLHandler_84C4C3D43E357222-001\shard-1-001\cores\collection1\, coreNodeName=, dataDir=data\, shard=}
   [junit4]   2> 2512031 INFO  (TEST-TestSQLHandler.doTest-seed#[84C4C3D43E357222]) [n:127.0.0.1:63926_    ] o.a.s.c.CoresLocator Found core collection1 in C:\Users\JenkinsSlave\workspace\Lucene-Solr-trunk-Windows\solr\build\solr-core\test\J0\..\..\..\..\..\..\..\..\..\Users\JenkinsSlave\workspace\Lucene-Solr-trunk-Windows\solr\build\solr-core\test\J0\temp\solr.handler.TestSQLHandler_84C4C3D43E357222-001\shard-1-001\cores\collection1\
   [junit4]   2> 2512031 INFO  (TEST-TestSQLHandler.doTest-seed#[84C4C3D43E357222]) [n:127.0.0.1:63926_    ] o.a.s.c.CoresLocator Found 1 core definitions
   [junit4]   2> 2512032 INFO  (TEST-TestSQLHandler.doTest-seed#[84C4C3D43E357222]) [n:127.0.0.1:63926_    ] o.a.s.s.SolrDispatchFilter user.dir=C:\Users\JenkinsSlave\workspace\Lucene-Solr-trunk-Windows\solr\build\solr-core\test\J0
   [junit4]   2> 2512032 INFO  (TEST-TestSQLHandler.doTest-seed#[84C4C3D43E357222]) [n:127.0.0.1:63926_    ] o.a.s.s.SolrDispatchFilter SolrDispatchFilter.init() done
   [junit4]   2> 2512033 INFO  (coreLoadExecutor-6434-thread-1-processing-n:127.0.0.1:63926_) [n:127.0.0.1:63926_ c:collection1   x:collection1] o.a.s.c.ZkController publishing state=down
   [junit4]   2> 2512033 INFO  (coreLoadExecutor-6434-thread-1-processing-n:127.0.0.1:63926_) [n:127.0.0.1:63926_ c:collection1   x:collection1] o.a.s.c.ZkController numShards not found on descriptor - reading it from system property
   [junit4]   2> 2512034 INFO  (zkCallback-2596-thread-1-processing-n:127.0.0.1:63890_) [n:127.0.0.1:63890_    ] o.a.s.c.DistributedQueue NodeChildrenChanged fired on path /overseer/queue state SyncConnected
   [junit4]   2> 2512035 INFO  (coreLoadExecutor-6434-thread-1-processing-n:127.0.0.1:63926_) [n:127.0.0.1:63926_ c:collection1   x:collection1] o.a.s.c.ZkController Registering watch for external collection collection1
   [junit4]   2> 2512035 INFO  (OverseerStateUpdate-94083329916796932-127.0.0.1:63890_-n_0000000000) [n:127.0.0.1:63890_    ] o.a.s.c.Overseer processMessage: queueSize: 1, message = {
   [junit4]   2>   "core":"collection1",
   [junit4]   2>   "roles":null,
   [junit4]   2>   "base_url":"https://127.0.0.1:63926",
   [junit4]   2>   "node_name":"127.0.0.1:63926_",
   [junit4]   2>   "numShards":"2",
   [junit4]   2>   "state":"down",
   [junit4]   2>   "shard":null,
   [junit4]   2>   "collection":"collection1",
   [junit4]   2>   "operation":"state"} current state version: 4
   [junit4]   2> 2512036 INFO  (coreLoadExecutor-6434-thread-1-processing-n:127.0.0.1:63926_) [n:127.0.0.1:63926_ c:collection1   x:collection1] o.a.s.c.ZkController look for our core node name
   [junit4]   2> 2512036 INFO  (OverseerStateUpdate-94083329916796932-127.0.0.1:63890_-n_0000000000) [n:127.0.0.1:63890_    ] o.a.s.c.o.ReplicaMutator Update state numShards=2 message={
   [junit4]   2>   "core":"collection1",
   [junit4]   2>   "roles":null,
   [junit4]   2>   "base_url":"https://127.0.0.1:63926",
   [junit4]   2>   "node_name":"127.0.0.1:63926_",
   [junit4]   2>   "numShards":"2",
   [junit4]   2>   "state":"down",
   [junit4]   2>   "shard":null,
   [junit4]   2>   "collection":"collection1",
   [junit4]   2>   "operation":"state"}
   [junit4]   2> 2512036 INFO  (OverseerStateUpdate-94083329916796932-127.0.0.1:63890_-n_0000000000) [n:127.0.0.1:63890_    ] o.a.s.c.o.ReplicaMutator Collection already exists with numShards=2
   [junit4]   2> 2512036 INFO  (OverseerStateUpdate-94083329916796932-127.0.0.1:63890_-n_0000000000) [n:127.0.0.1:63890_    ] o.a.s.c.o.ReplicaMutator Assigning new node to shard shard=shard2
   [junit4]   2> 2512154 INFO  (OverseerStateUpdate-94083329916796932-127.0.0.1:63890_-n_0000000000) [n:127.0.0.1:63890_    ] o.a.s.c.o.ZkStateWriter going to update_collection /collections/collection1/state.json version: 0
   [junit4]   2> 2513181 INFO  (coreLoadExecutor-6434-thread-1-processing-n:127.0.0.1:63926_) [n:127.0.0.1:63926_ c:collection1   x:collection1] o.a.s.c.ZkController waiting to find shard id in clusterstate for collection1
   [junit4]   2> 2513181 INFO  (coreLoadExecutor-6434-thread-1-processing-n:127.0.0.1:63926_) [n:127.0.0.1:63926_ c:collection1   x:collection1] o.a.s.c.ZkController Check for collection zkNode:collection1
   [junit4]   2> 2513181 INFO  (coreLoadExecutor-6434-thread-1-processing-n:127.0.0.1:63926_) [n:127.0.0.1:63926_ c:collection1   x:collection1] o.a.s.c.ZkController Collection zkNode exists
   [junit4]   2> 2513182 INFO  (coreLoadExecutor-6434-thread-1-processing-n:127.0.0.1:63926_) [n:127.0.0.1:63926_ c:collection1   x:collection1] o.a.s.c.SolrResourceLoader new SolrResourceLoader for directory: 'C:\Users\JenkinsSlave\workspace\Lucene-Solr-trunk-Windows\solr\build\solr-core\test\J0\..\..\..\..\..\..\..\..\..\Users\JenkinsSlave\workspace\Lucene-Solr-trunk-Windows\solr\build\solr-core\test\J0\temp\solr.handler.TestSQLHandler_84C4C3D43E357222-001\shard-1-001\cores\collection1\'
   [junit4]   2> 2513198 INFO  (coreLoadExecutor-6434-thread-1-processing-n:127.0.0.1:63926_) [n:127.0.0.1:63926_ c:collection1   x:collection1] o.a.s.c.Config loaded config solrconfig.xml with version 0
   [junit4]   2> 2513203 INFO  (coreLoadExecutor-6434-thread-1-processing-n:127.0.0.1:63926_) [n:127.0.0.1:63926_ c:collection1   x:collection1] o.a.s.c.SolrConfig current version of requestparams : -1
   [junit4]   2> 2513217 INFO  (coreLoadExecutor-6434-thread-1-processing-n:127.0.0.1:63926_) [n:127.0.0.1:63926_ c:collection1   x:collection1] o.a.s.c.SolrConfig Using Lucene MatchVersion: 6.0.0
   [junit4]   2> 2513223 INFO  (coreLoadExecutor-6434-thread-1-processing-n:127.0.0.1:63926_) [n:127.0.0.1:63926_ c:collection1   x:collection1] o.a.s.c.Config Loaded SolrConfig: solrconfig.xml
   [junit4]   2> 2513226 INFO  (coreLoadExecutor-6434-thread-1-processing-n:127.0.0.1:63926_) [n:127.0.0.1:63926_ c:collection1   x:collection1] o.a.s.s.IndexSchema Reading Solr Schema from /configs/conf1/schema.xml
   [junit4]   2> 2513230 INFO  (coreLoadExecutor-6434-thread-1-processing-n:127.0.0.1:63926_) [n:127.0.0.1:63926_ c:collection1   x:collection1] o.a.s.s.IndexSchema [collection1] Schema name=test
   [junit4]   2> 2513293 INFO  (coreLoadExecutor-6434-thread-1-processing-n:127.0.0.1:63926_) [n:127.0.0.1:63926_ c:collection1   x:collection1] o.a.s.s.IndexSchema default search field in schema is text
   [junit4]   2> 2513294 INFO  (coreLoadExecutor-6434-thread-1-processing-n:127.0.0.1:63926_) [n:127.0.0.1:63926_ c:collection1   x:collection1] o.a.s.s.IndexSchema unique key field: id
   [junit4]   2> 2513295 WARN  (coreLoadExecutor-6434-thread-1-processing-n:127.0.0.1:63926_) [n:127.0.0.1:63926_ c:collection1   x:collection1] o.a.s.s.IndexSchema Field lowerfilt1and2 is not multivalued and destination for multiple copyFields (2)
   [junit4]   2> 2513295 WARN  (coreLoadExecutor-6434-thread-1-processing-n:127.0.0.1:63926_) [n:127.0.0.1:63926_ c:collection1   x:collection1] o.a.s.s.IndexSchema Field text is not multivalued and destination for multiple copyFields (3)
   [junit4]   2> 2513295 INFO  (coreLoadExecutor-6434-thread-1-processing-n:127.0.0.1:63926_) [n:127.0.0.1:63926_ c:collection1   x:collection1] o.a.s.c.CoreContainer Creating SolrCore 'collection1' using configuration from collection collection1
   [junit4]   2> 2513295 INFO  (coreLoadExecutor-6434-thread-1-processing-n:127.0.0.1:63926_) [n:127.0.0.1:63926_ c:collection1 s:shard2 r:core_node1 x:collection1] o.a.s.c.SolrCore org.apache.solr.core.MockDirectoryFactory
   [junit4]   2> 2513296 INFO  (coreLoadExecutor-6434-thread-1-processing-n:127.0.0.1:63926_) [n:127.0.0.1:63926_ c:collection1 s:shard2 r:core_node1 x:collection1] o.a.s.c.SolrCore [[collection1] ] Opening new SolrCore at [C:\Users\JenkinsSlave\workspace\Lucene-Solr-trunk-Windows\solr\build\solr-core\test\J0\..\..\..\..\..\..\..\..\..\Users\JenkinsSlave\workspace\Lucene-Solr-trunk-Windows\solr\build\solr-core\test\J0\temp\solr.handler.TestSQLHandler_84C4C3D43E357222-001\shard-1-001\cores\collection1\], dataDir=[null]
   [junit4]   2> 2513296 INFO  (coreLoadExecutor-6434-thread-1-processing-n:127.0.0.1:63926_) [n:127.0.0.1:63926_ c:collection1 s:shard2 r:core_node1 x:collection1] o.a.s.c.SolrCore JMX monitoring not detected for core: collection1
   [junit4]   2> 2513296 INFO  (coreLoadExecutor-6434-thread-1-processing-n:127.0.0.1:63926_) [n:127.0.0.1:63926_ c:collection1 s:shard2 r:core_node1 x:collection1] o.a.s.c.CachingDirectoryFactory return new directory for C:\Users\JenkinsSlave\workspace\Lucene-Solr-trunk-Windows\solr\build\solr-core\test\J0\..\..\..\..\..\..\..\..\..\Users\JenkinsSlave\workspace\Lucene-Solr-trunk-Windows\solr\build\solr-core\test\J0\temp\solr.handler.TestSQLHandler_84C4C3D43E357222-001\shard-1-001\cores\collection1\data\
   [junit4]   2> 2513296 INFO  (coreLoadExecutor-6434-thread-1-processing-n:127.0.0.1:63926_) [n:127.0.0.1:63926_ c:collection1 s:shard2 r:core_node1 x:collection1] o.a.s.c.SolrCore New index directory detected: old=null new=C:\Users\JenkinsSlave\workspace\Lucene-Solr-trunk-Windows\solr\build\solr-core\test\J0\..\..\..\..\..\..\..\..\..\Users\JenkinsSlave\workspace\Lucene-Solr-trunk-Windows\solr\build\solr-core\test\J0\temp\solr.handler.TestSQLHandler_84C4C3D43E357222-001\shard-1-001\cores\collection1\data\index/
   [junit4]   2> 2513296 WARN  (coreLoadExecutor-6434-thread-1-processing-n:127.0.0.1:63926_) [n:127.0.0.1:63926_ c:collection1 s:shard2 r:core_node1 x:collection1] o.a.s.c.SolrCore [collection1] Solr index directory 'C:\Users\JenkinsSlave\workspace\Lucene-Solr-trunk-Windows\solr\build\solr-core\test\J0\..\..\..\..\..\..\..\..\..\Users\JenkinsSlave\workspace\Lucene-Solr-trunk-Windows\solr\build\solr-core\test\J0\temp\solr.handler.TestSQLHandler_84C4C3D43E357222-001\shard-1-001\cores\collection1\data\index' doesn't exist. Creating new index...
   [junit4]   2> 2513297 INFO  (coreLoadExecutor-6434-thread-1-processing-n:127.0.0.1:63926_) [n:127.0.0.1:63926_ c:collection1 s:shard2 r:core_node1 x:collection1] o.a.s.c.CachingDirectoryFactory return new directory for C:\Users\JenkinsSlave\workspace\Lucene-Solr-trunk-Windows\solr\build\solr-core\test\J0\..\..\..\..\..\..\..\..\..\Users\JenkinsSlave\workspace\Lucene-Solr-trunk-Windows\solr\build\solr-core\test\J0\temp\solr.handler.TestSQLHandler_84C4C3D43E357222-001\shard-1-001\cores\collection1\data\index
   [junit4]   2> 2513297 INFO  (coreLoadExecutor-6434-thread-1-processing-n:127.0.0.1:63926_) [n:127.0.0.1:63926_ c:collection1 s:shard2 r:core_node1 x:collection1] o.a.s.c.SolrCore SolrDeletionPolicy.onCommit: commits: num=1
   [junit4]   2> commit{dir=MockDirectoryWrapper(RAMDirectory@1456009 lockFactory=org.apache.lucene.store.SingleInstanceLockFactory@1937807),segFN=segments_1,generation=1}
   [junit4]   2> 2513297 INFO  (coreLoadExecutor-6434-thread-1-processing-n:127.0.0.1:63926_) [n:127.0.0.1:63926_ c:collection1 s:shard2 r:core_node1 x:collection1] o.a.s.c.SolrCore newest commit generation = 1
   [junit4]   2> 2513298 INFO  (OldIndexDirectoryCleanupThreadForCore-collection1) [n:127.0.0.1:63926_ c:collection1 s:shard2 r:core_node1 x:collection1] o.a.s.c.SolrCore Looking for old index directories to cleanup for core collection1 in C:\Users\JenkinsSlave\workspace\Lucene-Solr-trunk-Windows\solr\build\solr-core\test\J0\..\..\..\..\..\..\..\..\..\Users\JenkinsSlave\workspace\Lucene-Solr-trunk-Windows\solr\build\solr-core\test\J0\temp\solr.handler.TestSQLHandler_84C4C3D43E357222-001\shard-1-001\cores\collection1\data\
   [junit4]   2> 2513298 WARN  (OldIndexDirectoryCleanupThreadForCore-collection1) [n:127.0.0.1:63926_ c:collection1 s:shard2 r:core_node1 x:collection1] o.a.s.c.DirectoryFactory C:\Users\JenkinsSlave\workspace\Lucene-Solr-trunk-Windows\solr\build\solr-core\test\J0\..\..\..\..\..\..\..\..\..\Users\JenkinsSlave\workspace\Lucene-Solr-trunk-Windows\solr\build\solr-core\test\J0\temp\solr.handler.TestSQLHandler_84C4C3D43E357222-001\shard-1-001\cores\collection1\data\ does not point to a valid data directory; skipping clean-up of old index directories.
   [junit4]   2> 2513299 INFO  (coreLoadExecutor-6434-thread-1-processing-n:127.0.0.1:63926_) [n:127.0.0.1:63926_ c:collection1 s:shard2 r:core_node1 x:collection1] o.a.s.c.SolrCore no updateRequestProcessorChain defined as default, creating implicit default
   [junit4]   2> 2513304 INFO  (coreLoadExecutor-6434-thread-1-processing-n:127.0.0.1:63926_) [n:127.0.0.1:63926_ c:collection1 s:shard2 r:core_node1 x:collection1] o.a.s.h.l.XMLLoader xsltCacheLifetimeSeconds=60
   [junit4]   2> 2513305 INFO  (coreLoadExecutor-6434-thread-1-processing-n:127.0.0.1:63926_) [n:127.0.0.1:63926_ c:collection1 s:shard2 r:core_node1 x:collection1] o.a.s.h.l.XMLLoader xsltCacheLifetimeSeconds=60
   [junit4]   2> 2513305 INFO  (coreLoadExecutor-6434-thread-1-processing-n:127.0.0.1:63926_) [n:127.0.0.1:63926_ c:collection1 s:shard2 r:core_node1 x:collection1] o.a.s.h.l.XMLLoader xsltCacheLifetimeSeconds=60
   [junit4]   2> 2513306 INFO  (coreLoadExecutor-6434-thread-1-processing-n:127.0.0.1:63926_) [n:127.0.0.1:63926_ c:collection1 s:shard2 r:core_node1 x:collection1] o.a.s.h.l.XMLLoader xsltCacheLifetimeSeconds=60
   [junit4]   2> 2513307 INFO  (coreLoadExecutor-6434-thread-1-processing-n:127.0.0.1:63926_) [n:127.0.0.1:63926_ c:collection1 s:shard2 r:core_node1 x:collection1] o.a.s.c.PluginBag requestHandler : '/replication' created with startup=lazy
   [junit4]   2> 2513308 WARN  (coreLoadExecutor-6434-thread-1-processing-n:127.0.0.1:63926_) [n:127.0.0.1:63926_ c:collection1 s:shard2 r:core_node1 x:collection1] o.a.s.c.SolrResourceLoader Solr loaded a deprecated plugin/analysis class [org.apache.solr.handler.admin.AdminHandlers]. Please consult documentation how to replace it accordingly.
   [junit4]   2> 2513308 WARN  (coreLoadExecutor-6434-thread-1-processing-n:127.0.0.1:63926_) [n:127.0.0.1:63926_ c:collection1 s:shard2 r:core_node1 x:collection1] o.a.s.c.SolrResourceLoader Solr loaded a deprecated plugin/analysis class [org.apache.solr.handler.admin.AdminHandlers]. Please consult documentation how to replace it accordingly.
   [junit4]   2> 2513308 INFO  (coreLoadExecutor-6434-thread-1-processing-n:127.0.0.1:63926_) [n:127.0.0.1:63926_ c:collection1 s:shard2 r:core_node1 x:collection1] o.a.s.c.RequestHandlers Registered paths: /admin/mbeans,standard,,/update/json/docs,/admin/luke,/export,/get,/admin/properties,/update/json,/admin/threads,/update/csv,/sql,/admin/segments,/admin/system,/replication,/config,/stream,/schema,/admin/plugins,/admin/logging,/admin,/admin/ping,/update,/admin/file
   [junit4]   2> 2513308 WARN  (coreLoadExecutor-6434-thread-1-processing-n:127.0.0.1:63926_) [n:127.0.0.1:63926_ c:collection1 s:shard2 r:core_node1 x:collection1] o.a.s.c.RequestHandlers no default request handler is registered (either '/select' or 'standard')
   [junit4]   2> 2513310 INFO  (coreLoadExecutor-6434-thread-1-processing-n:127.0.0.1:63926_) [n:127.0.0.1:63926_ c:collection1 s:shard2 r:core_node1 x:collection1] o.a.s.c.SolrCore Using default statsCache cache: org.apache.solr.search.stats.LocalStatsCache
   [junit4]   2> 2513311 INFO  (coreLoadExecutor-6434-thread-1-processing-n:127.0.0.1:63926_) [n:127.0.0.1:63926_ c:collection1 s:shard2 r:core_node1 x:collection1] o.a.s.u.UpdateHandler Using UpdateLog implementation: org.apache.solr.update.UpdateLog
   [junit4]   2> 2513311 INFO  (coreLoadExecutor-6434-thread-1-processing-n:127.0.0.1:63926_) [n:127.0.0.1:63926_ c:collection1 s:shard2 r:core_node1 x:collection1] o.a.s.u.UpdateLog Initializing UpdateLog: dataDir= defaultSyncLevel=FLUSH numRecordsToKeep=100 maxNumLogsToKeep=10 numVersionBuckets=65536
   [junit4]   2> 2513313 INFO  (coreLoadExecutor-6434-thread-1-processing-n:127.0.0.1:63926_) [n:127.0.0.1:63926_ c:collection1 s:shard2 r:core_node1 x:collection1] o.a.s.c.SolrCore Hard AutoCommit: disabled
   [junit4]   2> 2513313 INFO  (coreLoadExecutor-6434-thread-1-processing-n:127.0.0.1:63926_) [n:127.0.0.1:63926_ c:collection1 s:shard2 r:core_node1 x:collection1] o.a.s.c.SolrCore Soft AutoCommit: disabled
   [junit4]   2> 2513314 INFO  (coreLoadExecutor-6434-thread-1-processing-n:127.0.0.1:63926_) [n:127.0.0.1:63926_ c:collection1 s:shard2 r:core_node1 x:collection1] o.a.s.c.SolrCore SolrDeletionPolicy.onInit: commits: num=1
   [junit4]   2> commit{dir=MockDirectoryWrapper(RAMDirectory@1456009 lockFactory=org.apache.lucene.store.SingleInstanceLockFactory@1937807),segFN=segments_1,generation=1}
   [junit4]   2> 2513314 INFO  (coreLoadExecutor-6434-thread-1-processing-n:127.0.0.1:63926_) [n:127.0.0.1:63926_ c:collection1 s:shard2 r:core_node1 x:collection1] o.a.s.c.SolrCore newest commit generation = 1
   [junit4]   2> 2513314 INFO  (coreLoadExecutor-6434-thread-1-processing-n:127.0.0.1:63926_) [n:127.0.0.1:63926_ c:collection1 s:shard2 r:core_node1 x:collection1] o.a.s.s.SolrIndexSearcher Opening Searcher@1f692f3[collection1] main
   [junit4]   2> 2513315 INFO  (coreLoadExecutor-6434-thread-1-processing-n:127.0.0.1:63926_) [n:127.0.0.1:63926_ c:collection1 s:shard2 r:core_node1 x:collection1] o.a.s.r.ManagedResourceStorage Setting up ZooKeeper-based storage for the RestManager with znodeBase: /configs/conf1
   [junit4]   2> 2513315 INFO  (coreLoadExecutor-6434-thread-1-processing-n:127.0.0.1:63926_) [n:127.0.0.1:63926_ c:collection1 s:shard2 r:core_node1 x:collection1] o.a.s.r.ManagedResourceStorage Configured ZooKeeperStorageIO with znodeBase: /configs/conf1
   [junit4]   2> 2513315 INFO  (coreLoadExecutor-6434-thread-1-processing-n:127.0.0.1:63926_) [n:127.0.0.1:63926_ c:collection1 s:shard2 r:core_node1 x:collection1] o.a.s.r.RestManager Initializing RestManager with initArgs: {}
   [junit4]   2> 2513315 INFO  (coreLoadExecutor-6434-thread-1-processing-n:127.0.0.1:63926_) [n:127.0.0.1:63926_ c:collection1 s:shard2 r:core_node1 x:collection1] o.a.s.r.ManagedResourceStorage Reading _rest_managed.json using ZooKeeperStorageIO:path=/configs/conf1
   [junit4]   2> 2513316 INFO  (coreLoadExecutor-6434-thread-1-processing-n:127.0.0.1:63926_) [n:127.0.0.1:63926_ c:collection1 s:shard2 r:core_node1 x:collection1] o.a.s.r.ManagedResourceStorage No data found for znode /configs/conf1/_rest_managed.json
   [junit4]   2> 2513316 INFO  (coreLoadExecutor-6434-thread-1-processing-n:127.0.0.1:63926_) [n:127.0.0.1:63926_ c:collection1 s:shard2 r:core_node1 x:collection1] o.a.s.r.ManagedResourceStorage Loaded null at path _rest_managed.json using ZooKeeperStorageIO:path=/configs/conf1
   [junit4]   2> 2513316 INFO  (coreLoadExecutor-6434-thread-1-processing-n:127.0.0.1:63926_) [n:127.0.0.1:63926_ c:collection1 s:shard2 r:core_node1 x:collection1] o.a.s.r.RestManager Initializing 0 registered ManagedResources
   [junit4]   2> 2513317 WARN  (coreLoadExecutor-6434-thread-1-processing-n:127.0.0.1:63926_) [n:127.0.0.1:63926_ c:collection1 s:shard2 r:core_node1 x:collection1] o.a.s.h.a.AdminHandlers <requestHandler name="/admin/"
   [junit4]   2>  class="solr.admin.AdminHandlers" /> is deprecated . It is not required anymore
   [junit4]   2> 2513317 INFO  (coreLoadExecutor-6434-thread-1-processing-n:127.0.0.1:63926_) [n:127.0.0.1:63926_ c:collection1 s:shard2 r:core_node1 x:collection1] o.a.s.u.UpdateLog Looking up max value of version field to seed version buckets
   [junit4]   2> 2513317 INFO  (coreLoadExecutor-6434-thread-1-processing-n:127.0.0.1:63926_) [n:127.0.0.1:63926_ c:collection1 s:shard2 r:core_node1 x:collection1] o.a.s.u.VersionInfo Refreshing highest value of _version_ for 65536 version buckets from index
   [junit4]   2> 2513317 INFO  (coreLoadExecutor-6434-thread-1-processing-n:127.0.0.1:63926_) [n:127.0.0.1:63926_ c:collection1 s:shard2 r:core_node1 x:collection1] o.a.s.u.VersionInfo No terms found for _version_, cannot seed version bucket highest value from index
   [junit4]   2> 2513319 INFO  (coreLoadExecutor-6434-thread-1-processing-n:127.0.0.1:63926_) [n:127.0.0.1:63926_ c:collection1 s:shard2 r:core_node1 x:collection1] o.a.s.u.UpdateLog Could not find max version in index or recent updates, using new clock 1505333284291215360
   [junit4]   2> 2513317 INFO  (searcherExecutor-6435-thread-1-processing-n:127.0.0.1:63926_ x:collection1 s:shard2 c:collection1 r:core_node1) [n:127.0.0.1:63926_ c:collection1 s:shard2 r:core_node1 x:collection1] o.a.s.c.SolrCore [collection1] Registered new searcher Searcher@1f692f3[collection1] main{ExitableDirectoryReader(UninvertingDirectoryReader())}
   [junit4]   2> 2513320 INFO  (coreLoadExecutor-6434-thread-1-processing-n:127.0.0.1:63926_) [n:127.0.0.1:63926_ c:collection1 s:shard2 r:core_node1

[...truncated too long message...]

nt.SynchronousQueue$TransferStack.awaitFulfill(SynchronousQueue.java:460)
   [junit4]    >         at java.util.concurrent.SynchronousQueue$TransferStack.transfer(SynchronousQueue.java:362)
   [junit4]    >         at java.util.concurrent.SynchronousQueue.poll(SynchronousQueue.java:941)
   [junit4]    >         at java.util.concurrent.ThreadPoolExecutor.getTask(ThreadPoolExecutor.java:1066)
   [junit4]    >         at java.util.concurrent.ThreadPoolExecutor.runWorker(ThreadPoolExecutor.java:1127)
   [junit4]    >         at java.util.concurrent.ThreadPoolExecutor$Worker.run(ThreadPoolExecutor.java:617)
   [junit4]    >         at java.lang.Thread.run(Thread.java:745)
   [junit4]    >    2) Thread[id=16164, name=qtp30878838-15976-EventThread, state=WAITING, group=TGRP-TestSQLHandler]
   [junit4]    >         at sun.misc.Unsafe.park(Native Method)
   [junit4]    >         at java.util.concurrent.locks.LockSupport.park(LockSupport.java:175)
   [junit4]    >         at java.util.concurrent.locks.AbstractQueuedSynchronizer$ConditionObject.await(AbstractQueuedSynchronizer.java:2039)
   [junit4]    >         at java.util.concurrent.LinkedBlockingQueue.take(LinkedBlockingQueue.java:442)
   [junit4]    >         at org.apache.zookeeper.ClientCnxn$EventThread.run(ClientCnxn.java:494)
   [junit4]    >    3) Thread[id=16179, name=zkCallback-2653-thread-2, state=TIMED_WAITING, group=TGRP-TestSQLHandler]
   [junit4]    >         at sun.misc.Unsafe.park(Native Method)
   [junit4]    >         at java.util.concurrent.locks.LockSupport.parkNanos(LockSupport.java:215)
   [junit4]    >         at java.util.concurrent.SynchronousQueue$TransferStack.awaitFulfill(SynchronousQueue.java:460)
   [junit4]    >         at java.util.concurrent.SynchronousQueue$TransferStack.transfer(SynchronousQueue.java:362)
   [junit4]    >         at java.util.concurrent.SynchronousQueue.poll(SynchronousQueue.java:941)
   [junit4]    >         at java.util.concurrent.ThreadPoolExecutor.getTask(ThreadPoolExecutor.java:1066)
   [junit4]    >         at java.util.concurrent.ThreadPoolExecutor.runWorker(ThreadPoolExecutor.java:1127)
   [junit4]    >         at java.util.concurrent.ThreadPoolExecutor$Worker.run(ThreadPoolExecutor.java:617)
   [junit4]    >         at java.lang.Thread.run(Thread.java:745)
   [junit4]    >    4) Thread[id=16163, name=qtp30878838-15976-SendThread(127.0.0.1:63880), state=RUNNABLE, group=TGRP-TestSQLHandler]
   [junit4]    >         at sun.nio.ch.WindowsSelectorImpl$SubSelector.poll0(Native Method)
   [junit4]    >         at sun.nio.ch.WindowsSelectorImpl$SubSelector.poll(WindowsSelectorImpl.java:296)
   [junit4]    >         at sun.nio.ch.WindowsSelectorImpl$SubSelector.access$400(WindowsSelectorImpl.java:278)
   [junit4]    >         at sun.nio.ch.WindowsSelectorImpl.doSelect(WindowsSelectorImpl.java:159)
   [junit4]    >         at sun.nio.ch.SelectorImpl.lockAndDoSelect(SelectorImpl.java:86)
   [junit4]    >         at sun.nio.ch.SelectorImpl.select(SelectorImpl.java:97)
   [junit4]    >         at org.apache.zookeeper.ClientCnxnSocketNIO.doTransport(ClientCnxnSocketNIO.java:349)
   [junit4]    >         at org.apache.zookeeper.ClientCnxn$SendThread.run(ClientCnxn.java:1081)
   [junit4]    >    5) Thread[id=16204, name=zkCallback-2653-thread-3, state=TIMED_WAITING, group=TGRP-TestSQLHandler]
   [junit4]    >         at sun.misc.Unsafe.park(Native Method)
   [junit4]    >         at java.util.concurrent.locks.LockSupport.parkNanos(LockSupport.java:215)
   [junit4]    >         at java.util.concurrent.SynchronousQueue$TransferStack.awaitFulfill(SynchronousQueue.java:460)
   [junit4]    >         at java.util.concurrent.SynchronousQueue$TransferStack.transfer(SynchronousQueue.java:362)
   [junit4]    >         at java.util.concurrent.SynchronousQueue.poll(SynchronousQueue.java:941)
   [junit4]    >         at java.util.concurrent.ThreadPoolExecutor.getTask(ThreadPoolExecutor.java:1066)
   [junit4]    >         at java.util.concurrent.ThreadPoolExecutor.runWorker(ThreadPoolExecutor.java:1127)
   [junit4]    >         at java.util.concurrent.ThreadPoolExecutor$Worker.run(ThreadPoolExecutor.java:617)
   [junit4]    >         at java.lang.Thread.run(Thread.java:745)
   [junit4]    > at __randomizedtesting.SeedInfo.seed([84C4C3D43E357222]:0)Throwable #2: com.carrotsearch.randomizedtesting.ThreadLeakError: There are still zombie threads that couldn't be terminated:
   [junit4]    >    1) Thread[id=16165, name=zkCallback-2653-thread-1, state=TIMED_WAITING, group=TGRP-TestSQLHandler]
   [junit4]    >         at sun.misc.Unsafe.park(Native Method)
   [junit4]    >         at java.util.concurrent.locks.LockSupport.parkNanos(LockSupport.java:215)
   [junit4]    >         at java.util.concurrent.SynchronousQueue$TransferStack.awaitFulfill(SynchronousQueue.java:460)
   [junit4]    >         at java.util.concurrent.SynchronousQueue$TransferStack.transfer(SynchronousQueue.java:362)
   [junit4]    >         at java.util.concurrent.SynchronousQueue.poll(SynchronousQueue.java:941)
   [junit4]    >         at java.util.concurrent.ThreadPoolExecutor.getTask(ThreadPoolExecutor.java:1066)
   [junit4]    >         at java.util.concurrent.ThreadPoolExecutor.runWorker(ThreadPoolExecutor.java:1127)
   [junit4]    >         at java.util.concurrent.ThreadPoolExecutor$Worker.run(ThreadPoolExecutor.java:617)
   [junit4]    >         at java.lang.Thread.run(Thread.java:745)
   [junit4]    >    2) Thread[id=16179, name=zkCallback-2653-thread-2, state=TIMED_WAITING, group=TGRP-TestSQLHandler]
   [junit4]    >         at sun.misc.Unsafe.park(Native Method)
   [junit4]    >         at java.util.concurrent.locks.LockSupport.parkNanos(LockSupport.java:215)
   [junit4]    >         at java.util.concurrent.SynchronousQueue$TransferStack.awaitFulfill(SynchronousQueue.java:460)
   [junit4]    >         at java.util.concurrent.SynchronousQueue$TransferStack.transfer(SynchronousQueue.java:362)
   [junit4]    >         at java.util.concurrent.SynchronousQueue.poll(SynchronousQueue.java:941)
   [junit4]    >         at java.util.concurrent.ThreadPoolExecutor.getTask(ThreadPoolExecutor.java:1066)
   [junit4]    >         at java.util.concurrent.ThreadPoolExecutor.runWorker(ThreadPoolExecutor.java:1127)
   [junit4]    >         at java.util.concurrent.ThreadPoolExecutor$Worker.run(ThreadPoolExecutor.java:617)
   [junit4]    >         at java.lang.Thread.run(Thread.java:745)
   [junit4]    >    3) Thread[id=16163, name=qtp30878838-15976-SendThread(127.0.0.1:63880), state=RUNNABLE, group=TGRP-TestSQLHandler]
   [junit4]    >         at sun.nio.ch.WindowsSelectorImpl$SubSelector.poll0(Native Method)
   [junit4]    >         at sun.nio.ch.WindowsSelectorImpl$SubSelector.poll(WindowsSelectorImpl.java:296)
   [junit4]    >         at sun.nio.ch.WindowsSelectorImpl$SubSelector.access$400(WindowsSelectorImpl.java:278)
   [junit4]    >         at sun.nio.ch.WindowsSelectorImpl.doSelect(WindowsSelectorImpl.java:159)
   [junit4]    >         at sun.nio.ch.SelectorImpl.lockAndDoSelect(SelectorImpl.java:86)
   [junit4]    >         at sun.nio.ch.SelectorImpl.select(SelectorImpl.java:97)
   [junit4]    >         at org.apache.zookeeper.ClientCnxnSocketNIO.doTransport(ClientCnxnSocketNIO.java:349)
   [junit4]    >         at org.apache.zookeeper.ClientCnxn$SendThread.run(ClientCnxn.java:1081)
   [junit4]    >    4) Thread[id=16204, name=zkCallback-2653-thread-3, state=TIMED_WAITING, group=TGRP-TestSQLHandler]
   [junit4]    >         at sun.misc.Unsafe.park(Native Method)
   [junit4]    >         at java.util.concurrent.locks.LockSupport.parkNanos(LockSupport.java:215)
   [junit4]    >         at java.util.concurrent.SynchronousQueue$TransferStack.awaitFulfill(SynchronousQueue.java:460)
   [junit4]    >         at java.util.concurrent.SynchronousQueue$TransferStack.transfer(SynchronousQueue.java:362)
   [junit4]    >         at java.util.concurrent.SynchronousQueue.poll(SynchronousQueue.java:941)
   [junit4]    >         at java.util.concurrent.ThreadPoolExecutor.getTask(ThreadPoolExecutor.java:1066)
   [junit4]    >         at java.util.concurrent.ThreadPoolExecutor.runWorker(ThreadPoolExecutor.java:1127)
   [junit4]    >         at java.util.concurrent.ThreadPoolExecutor$Worker.run(ThreadPoolExecutor.java:617)
   [junit4]    >         at java.lang.Thread.run(Thread.java:745)
   [junit4]    > at __randomizedtesting.SeedInfo.seed([84C4C3D43E357222]:0)
   [junit4] Completed [451/514] on J0 in 56.13s, 1 test, 3 errors <<< FAILURES!

[...truncated 194 lines...]
BUILD FAILED
C:\Users\JenkinsSlave\workspace\Lucene-Solr-trunk-Windows\build.xml:526: The following error occurred while executing this line:
C:\Users\JenkinsSlave\workspace\Lucene-Solr-trunk-Windows\build.xml:474: The following error occurred while executing this line:
C:\Users\JenkinsSlave\workspace\Lucene-Solr-trunk-Windows\build.xml:61: The following error occurred while executing this line:
C:\Users\JenkinsSlave\workspace\Lucene-Solr-trunk-Windows\extra-targets.xml:39: The following error occurred while executing this line:
C:\Users\JenkinsSlave\workspace\Lucene-Solr-trunk-Windows\solr\build.xml:230: The following error occurred while executing this line:
C:\Users\JenkinsSlave\workspace\Lucene-Solr-trunk-Windows\solr\common-build.xml:513: The following error occurred while executing this line:
C:\Users\JenkinsSlave\workspace\Lucene-Solr-trunk-Windows\lucene\common-build.xml:1426: The following error occurred while executing this line:
C:\Users\JenkinsSlave\workspace\Lucene-Solr-trunk-Windows\lucene\common-build.xml:981: There were test failures: 514 suites, 2021 tests, 2 suite-level errors, 1 error, 295 ignored (35 assumptions)

Total time: 61 minutes 47 seconds
Build step 'Invoke Ant' marked build as failure
Archiving artifacts
Recording test results
Email was triggered for: Failure - Any
Sending email for trigger: Failure - Any




---------------------------------------------------------------------
To unsubscribe, e-mail: [hidden email]
For additional commands, e-mail: [hidden email]