[JENKINS] Lucene-Solr-trunk-Windows (64bit/jdk1.8.0-ea-b99) - Build # 3102 - Failure!

classic Classic list List threaded Threaded
2 messages Options
Reply | Threaded
Open this post in threaded view
|

[JENKINS] Lucene-Solr-trunk-Windows (64bit/jdk1.8.0-ea-b99) - Build # 3102 - Failure!

Policeman Jenkins Server-2
Build: http://jenkins.thetaphi.de/job/Lucene-Solr-trunk-Windows/3102/
Java: 64bit/jdk1.8.0-ea-b99 -XX:+UseCompressedOops -XX:+UseG1GC

1 tests failed.
REGRESSION:  org.apache.solr.handler.TestReplicationHandler.doTestStressReplication

Error Message:
timed out waiting for collection1 startAt time to exceed: Sat Aug 03 01:31:17 OMST 2013

Stack Trace:
java.lang.AssertionError: timed out waiting for collection1 startAt time to exceed: Sat Aug 03 01:31:17 OMST 2013
        at __randomizedtesting.SeedInfo.seed([7187455E1DC0FCE6:AA2C459818E89555]:0)
        at org.junit.Assert.fail(Assert.java:93)
        at org.apache.solr.handler.TestReplicationHandler.watchCoreStartAt(TestReplicationHandler.java:1507)
        at org.apache.solr.handler.TestReplicationHandler.doTestStressReplication(TestReplicationHandler.java:811)
        at sun.reflect.NativeMethodAccessorImpl.invoke0(Native Method)
        at sun.reflect.NativeMethodAccessorImpl.invoke(NativeMethodAccessorImpl.java:57)
        at sun.reflect.DelegatingMethodAccessorImpl.invoke(DelegatingMethodAccessorImpl.java:43)
        at java.lang.reflect.Method.invoke(Method.java:491)
        at com.carrotsearch.randomizedtesting.RandomizedRunner.invoke(RandomizedRunner.java:1559)
        at com.carrotsearch.randomizedtesting.RandomizedRunner.access$600(RandomizedRunner.java:79)
        at com.carrotsearch.randomizedtesting.RandomizedRunner$6.evaluate(RandomizedRunner.java:737)
        at com.carrotsearch.randomizedtesting.RandomizedRunner$7.evaluate(RandomizedRunner.java:773)
        at com.carrotsearch.randomizedtesting.RandomizedRunner$8.evaluate(RandomizedRunner.java:787)
        at com.carrotsearch.randomizedtesting.rules.SystemPropertiesRestoreRule$1.evaluate(SystemPropertiesRestoreRule.java:53)
        at org.apache.lucene.util.TestRuleSetupTeardownChained$1.evaluate(TestRuleSetupTeardownChained.java:50)
        at org.apache.lucene.util.TestRuleFieldCacheSanity$1.evaluate(TestRuleFieldCacheSanity.java:51)
        at org.apache.lucene.util.AbstractBeforeAfterRule$1.evaluate(AbstractBeforeAfterRule.java:46)
        at com.carrotsearch.randomizedtesting.rules.SystemPropertiesInvariantRule$1.evaluate(SystemPropertiesInvariantRule.java:55)
        at org.apache.lucene.util.TestRuleThreadAndTestName$1.evaluate(TestRuleThreadAndTestName.java:49)
        at org.apache.lucene.util.TestRuleIgnoreAfterMaxFailures$1.evaluate(TestRuleIgnoreAfterMaxFailures.java:70)
        at org.apache.lucene.util.TestRuleMarkFailure$1.evaluate(TestRuleMarkFailure.java:48)
        at com.carrotsearch.randomizedtesting.rules.StatementAdapter.evaluate(StatementAdapter.java:36)
        at com.carrotsearch.randomizedtesting.ThreadLeakControl$StatementRunner.run(ThreadLeakControl.java:358)
        at com.carrotsearch.randomizedtesting.ThreadLeakControl.forkTimeoutingTask(ThreadLeakControl.java:782)
        at com.carrotsearch.randomizedtesting.ThreadLeakControl$3.evaluate(ThreadLeakControl.java:442)
        at com.carrotsearch.randomizedtesting.RandomizedRunner.runSingleTest(RandomizedRunner.java:746)
        at com.carrotsearch.randomizedtesting.RandomizedRunner$3.evaluate(RandomizedRunner.java:648)
        at com.carrotsearch.randomizedtesting.RandomizedRunner$4.evaluate(RandomizedRunner.java:682)
        at com.carrotsearch.randomizedtesting.RandomizedRunner$5.evaluate(RandomizedRunner.java:693)
        at com.carrotsearch.randomizedtesting.rules.StatementAdapter.evaluate(StatementAdapter.java:36)
        at com.carrotsearch.randomizedtesting.rules.SystemPropertiesRestoreRule$1.evaluate(SystemPropertiesRestoreRule.java:53)
        at org.apache.lucene.util.AbstractBeforeAfterRule$1.evaluate(AbstractBeforeAfterRule.java:46)
        at org.apache.lucene.util.TestRuleStoreClassName$1.evaluate(TestRuleStoreClassName.java:42)
        at com.carrotsearch.randomizedtesting.rules.SystemPropertiesInvariantRule$1.evaluate(SystemPropertiesInvariantRule.java:55)
        at com.carrotsearch.randomizedtesting.rules.NoShadowingOrOverridesOnMethodsRule$1.evaluate(NoShadowingOrOverridesOnMethodsRule.java:39)
        at com.carrotsearch.randomizedtesting.rules.NoShadowingOrOverridesOnMethodsRule$1.evaluate(NoShadowingOrOverridesOnMethodsRule.java:39)
        at com.carrotsearch.randomizedtesting.rules.StatementAdapter.evaluate(StatementAdapter.java:36)
        at org.apache.lucene.util.TestRuleAssertionsRequired$1.evaluate(TestRuleAssertionsRequired.java:43)
        at org.apache.lucene.util.TestRuleMarkFailure$1.evaluate(TestRuleMarkFailure.java:48)
        at org.apache.lucene.util.TestRuleIgnoreAfterMaxFailures$1.evaluate(TestRuleIgnoreAfterMaxFailures.java:70)
        at org.apache.lucene.util.TestRuleIgnoreTestSuites$1.evaluate(TestRuleIgnoreTestSuites.java:55)
        at com.carrotsearch.randomizedtesting.rules.StatementAdapter.evaluate(StatementAdapter.java:36)
        at com.carrotsearch.randomizedtesting.ThreadLeakControl$StatementRunner.run(ThreadLeakControl.java:358)
        at java.lang.Thread.run(Thread.java:724)




Build Log:
[...truncated 9406 lines...]
   [junit4] Suite: org.apache.solr.handler.TestReplicationHandler
   [junit4]   2> 213970 T847 oas.SolrTestCaseJ4.setUp ###Starting testNoWriter
   [junit4]   2> 213983 T847 oejs.Server.doStart jetty-8.1.10.v20130312
   [junit4]   2> 214012 T847 oejs.AbstractConnector.doStart Started SelectChannelConnector@127.0.0.1:65043
   [junit4]   2> 214013 T847 oass.SolrDispatchFilter.init SolrDispatchFilter.init()
   [junit4]   2> 214013 T847 oasc.SolrResourceLoader.locateSolrHome JNDI not configured for solr (NoInitialContextEx)
   [junit4]   2> 214013 T847 oasc.SolrResourceLoader.locateSolrHome using system property solr.solr.home: .\org.apache.solr.handler.TestReplicationHandler$SolrInstance-1375468226059\master
   [junit4]   2> 214014 T847 oasc.SolrResourceLoader.<init> new SolrResourceLoader for directory: '.\org.apache.solr.handler.TestReplicationHandler$SolrInstance-1375468226059\master\'
   [junit4]   2> 214048 T847 oasc.ConfigSolr.fromFile Loading container configuration from C:\Users\JenkinsSlave\workspace\Lucene-Solr-trunk-Windows\solr\build\solr-core\test\J0\.\org.apache.solr.handler.TestReplicationHandler$SolrInstance-1375468226059\master\solr.xml
   [junit4]   2> 214049 T847 oasc.ConfigSolr.fromFile C:\Users\JenkinsSlave\workspace\Lucene-Solr-trunk-Windows\solr\build\solr-core\test\J0\.\org.apache.solr.handler.TestReplicationHandler$SolrInstance-1375468226059\master\solr.xml does not exist, using default configuration
   [junit4]   2> 214061 T847 oasc.CoreContainer.<init> New CoreContainer 848063780
   [junit4]   2> 214061 T847 oasc.CoreContainer.load Loading cores into CoreContainer [instanceDir=.\org.apache.solr.handler.TestReplicationHandler$SolrInstance-1375468226059\master\]
   [junit4]   2> 214062 T847 oashc.HttpShardHandlerFactory.getParameter Setting socketTimeout to: 0
   [junit4]   2> 214062 T847 oashc.HttpShardHandlerFactory.getParameter Setting urlScheme to: http://
   [junit4]   2> 214063 T847 oashc.HttpShardHandlerFactory.getParameter Setting connTimeout to: 0
   [junit4]   2> 214063 T847 oashc.HttpShardHandlerFactory.getParameter Setting maxConnectionsPerHost to: 20
   [junit4]   2> 214063 T847 oashc.HttpShardHandlerFactory.getParameter Setting corePoolSize to: 0
   [junit4]   2> 214063 T847 oashc.HttpShardHandlerFactory.getParameter Setting maximumPoolSize to: 2147483647
   [junit4]   2> 214064 T847 oashc.HttpShardHandlerFactory.getParameter Setting maxThreadIdleTime to: 5
   [junit4]   2> 214064 T847 oashc.HttpShardHandlerFactory.getParameter Setting sizeOfQueue to: -1
   [junit4]   2> 214064 T847 oashc.HttpShardHandlerFactory.getParameter Setting fairnessPolicy to: false
   [junit4]   2> 214065 T847 oascsi.HttpClientUtil.createClient Creating new http client, config:maxConnectionsPerHost=20&maxConnections=10000&socketTimeout=0&connTimeout=0&retry=false
   [junit4]   2> 214077 T859 oasc.CoreContainer.create Creating SolrCore 'collection1' using instanceDir: .\org.apache.solr.handler.TestReplicationHandler$SolrInstance-1375468226059\master\collection1
   [junit4]   2> 214077 T859 oasc.SolrResourceLoader.<init> new SolrResourceLoader for directory: '.\org.apache.solr.handler.TestReplicationHandler$SolrInstance-1375468226059\master\collection1\'
   [junit4]   2> 214113 T859 oasc.SolrConfig.<init> Using Lucene MatchVersion: LUCENE_50
   [junit4]   2> 214119 T859 oasc.SolrConfig.<init> Loaded SolrConfig: solrconfig.xml
   [junit4]   2> 214120 T859 oass.IndexSchema.readSchema Reading Solr Schema from schema.xml
   [junit4]   2> 214124 T859 oass.IndexSchema.readSchema [collection1] Schema name=test
   [junit4]   2> 214131 T859 oass.IndexSchema.readSchema unique key field: id
   [junit4]   2> 214132 T859 oasc.SolrCore.initDirectoryFactory org.apache.solr.core.MockDirectoryFactory
   [junit4]   2> 214132 T859 oasc.SolrCore.<init> [collection1] Opening new SolrCore at .\org.apache.solr.handler.TestReplicationHandler$SolrInstance-1375468226059\master\collection1\, dataDir=C:\Users\JenkinsSlave\workspace\Lucene-Solr-trunk-Windows\solr\build\solr-core\test\J0\.\org.apache.solr.handler.TestReplicationHandler$SolrInstance-1375468226059\master\collection1\data\
   [junit4]   2> 214132 T859 oasc.SolrCore.<init> JMX monitoring not detected for core: collection1
   [junit4]   2> 214133 T859 oasc.CachingDirectoryFactory.get return new directory for C:\Users\JenkinsSlave\workspace\Lucene-Solr-trunk-Windows\solr\build\solr-core\test\J0\.\org.apache.solr.handler.TestReplicationHandler$SolrInstance-1375468226059\master\collection1\data\
   [junit4]   2> 214133 T859 oasc.SolrCore.getNewIndexDir New index directory detected: old=null new=C:\Users\JenkinsSlave\workspace\Lucene-Solr-trunk-Windows\solr\build\solr-core\test\J0\.\org.apache.solr.handler.TestReplicationHandler$SolrInstance-1375468226059\master\collection1\data\index/
   [junit4]   2> 214134 T859 oasc.SolrCore.initIndex WARN [collection1] Solr index directory 'C:\Users\JenkinsSlave\workspace\Lucene-Solr-trunk-Windows\solr\build\solr-core\test\J0\.\org.apache.solr.handler.TestReplicationHandler$SolrInstance-1375468226059\master\collection1\data\index' doesn't exist. Creating new index...
   [junit4]   2> 214135 T859 oasc.CachingDirectoryFactory.get return new directory for C:\Users\JenkinsSlave\workspace\Lucene-Solr-trunk-Windows\solr\build\solr-core\test\J0\.\org.apache.solr.handler.TestReplicationHandler$SolrInstance-1375468226059\master\collection1\data\index
   [junit4]   2> 214136 T859 oasc.SolrDeletionPolicy.onCommit SolrDeletionPolicy.onCommit: commits: num=1
   [junit4]   2> commit{dir=MockDirWrapper(org.apache.lucene.store.RAMDirectory@290a1a62 lockFactory=org.apache.lucene.store.SingleInstanceLockFactory@78a08e05),segFN=segments_1,generation=1}
   [junit4]   2> 214136 T859 oasc.SolrDeletionPolicy.updateCommits newest commit generation = 1
   [junit4]   2> 214138 T859 oasc.RequestHandlers.initHandlersFromConfig created standard: solr.StandardRequestHandler
   [junit4]   2> 214138 T859 oasc.RequestHandlers.initHandlersFromConfig created /replication: solr.ReplicationHandler
   [junit4]   2> 214138 T859 oasc.RequestHandlers.initHandlersFromConfig created defaults: solr.StandardRequestHandler
   [junit4]   2> 214139 T859 oasc.RequestHandlers.initHandlersFromConfig adding lazy requestHandler: solr.StandardRequestHandler
   [junit4]   2> 214139 T859 oasc.RequestHandlers.initHandlersFromConfig created lazy: solr.StandardRequestHandler
   [junit4]   2> 214139 T859 oasc.RequestHandlers.initHandlersFromConfig created /update: solr.UpdateRequestHandler
   [junit4]   2> 214144 T859 oashl.XMLLoader.init xsltCacheLifetimeSeconds=60
   [junit4]   2> 214145 T859 oass.SolrIndexSearcher.<init> Opening Searcher@17c97dd1 main
   [junit4]   2> 214146 T859 oasu.CommitTracker.<init> Hard AutoCommit: disabled
   [junit4]   2> 214146 T859 oasu.CommitTracker.<init> Soft AutoCommit: disabled
   [junit4]   2> 214146 T859 oash.ReplicationHandler.inform Replication enabled for following config files: schema.xml,xslt/dummy.xsl
   [junit4]   2> 214147 T859 oash.ReplicationHandler.inform Commits will be reserved for  10000
   [junit4]   2> 214147 T859 oasc.CoreContainer.registerCore registering core: collection1
   [junit4]   2> 214147 T860 oasc.SolrCore.registerSearcher [collection1] Registered new searcher Searcher@17c97dd1 main{StandardDirectoryReader(segments_1:1)}
   [junit4]   2> 214148 T847 oass.SolrDispatchFilter.init user.dir=C:\Users\JenkinsSlave\workspace\Lucene-Solr-trunk-Windows\solr\build\solr-core\test\J0
   [junit4]   2> 214149 T847 oass.SolrDispatchFilter.init SolrDispatchFilter.init() done
   [junit4]   2> 214149 T847 oascsi.HttpClientUtil.createClient Creating new http client, config:maxConnections=128&maxConnectionsPerHost=32&followRedirects=false
   [junit4]   2> 214165 T847 oejs.Server.doStart jetty-8.1.10.v20130312
   [junit4]   2> 214169 T847 oejs.AbstractConnector.doStart Started SelectChannelConnector@127.0.0.1:65046
   [junit4]   2> 214169 T847 oass.SolrDispatchFilter.init SolrDispatchFilter.init()
   [junit4]   2> 214169 T847 oasc.SolrResourceLoader.locateSolrHome JNDI not configured for solr (NoInitialContextEx)
   [junit4]   2> 214169 T847 oasc.SolrResourceLoader.locateSolrHome using system property solr.solr.home: .\org.apache.solr.handler.TestReplicationHandler$SolrInstance-1375468226242\slave
   [junit4]   2> 214171 T847 oasc.SolrResourceLoader.<init> new SolrResourceLoader for directory: '.\org.apache.solr.handler.TestReplicationHandler$SolrInstance-1375468226242\slave\'
   [junit4]   2> 214188 T847 oasc.ConfigSolr.fromFile Loading container configuration from C:\Users\JenkinsSlave\workspace\Lucene-Solr-trunk-Windows\solr\build\solr-core\test\J0\.\org.apache.solr.handler.TestReplicationHandler$SolrInstance-1375468226242\slave\solr.xml
   [junit4]   2> 214189 T847 oasc.ConfigSolr.fromFile C:\Users\JenkinsSlave\workspace\Lucene-Solr-trunk-Windows\solr\build\solr-core\test\J0\.\org.apache.solr.handler.TestReplicationHandler$SolrInstance-1375468226242\slave\solr.xml does not exist, using default configuration
   [junit4]   2> 214198 T847 oasc.CoreContainer.<init> New CoreContainer 894171044
   [junit4]   2> 214199 T847 oasc.CoreContainer.load Loading cores into CoreContainer [instanceDir=.\org.apache.solr.handler.TestReplicationHandler$SolrInstance-1375468226242\slave\]
   [junit4]   2> 214199 T847 oashc.HttpShardHandlerFactory.getParameter Setting socketTimeout to: 0
   [junit4]   2> 214200 T847 oashc.HttpShardHandlerFactory.getParameter Setting urlScheme to: http://
   [junit4]   2> 214200 T847 oashc.HttpShardHandlerFactory.getParameter Setting connTimeout to: 0
   [junit4]   2> 214200 T847 oashc.HttpShardHandlerFactory.getParameter Setting maxConnectionsPerHost to: 20
   [junit4]   2> 214201 T847 oashc.HttpShardHandlerFactory.getParameter Setting corePoolSize to: 0
   [junit4]   2> 214201 T847 oashc.HttpShardHandlerFactory.getParameter Setting maximumPoolSize to: 2147483647
   [junit4]   2> 214201 T847 oashc.HttpShardHandlerFactory.getParameter Setting maxThreadIdleTime to: 5
   [junit4]   2> 214202 T847 oashc.HttpShardHandlerFactory.getParameter Setting sizeOfQueue to: -1
   [junit4]   2> 214202 T847 oashc.HttpShardHandlerFactory.getParameter Setting fairnessPolicy to: false
   [junit4]   2> 214203 T847 oascsi.HttpClientUtil.createClient Creating new http client, config:maxConnectionsPerHost=20&maxConnections=10000&socketTimeout=0&connTimeout=0&retry=false
   [junit4]   2> 214210 T871 oasc.CoreContainer.create Creating SolrCore 'collection1' using instanceDir: .\org.apache.solr.handler.TestReplicationHandler$SolrInstance-1375468226242\slave\collection1
   [junit4]   2> 214211 T871 oasc.SolrResourceLoader.<init> new SolrResourceLoader for directory: '.\org.apache.solr.handler.TestReplicationHandler$SolrInstance-1375468226242\slave\collection1\'
   [junit4]   2> 214237 T871 oasc.SolrConfig.<init> Using Lucene MatchVersion: LUCENE_50
   [junit4]   2> 214252 T871 oasc.SolrConfig.<init> Loaded SolrConfig: solrconfig.xml
   [junit4]   2> 214252 T871 oass.IndexSchema.readSchema Reading Solr Schema from schema.xml
   [junit4]   2> 214257 T871 oass.IndexSchema.readSchema [collection1] Schema name=test
   [junit4]   2> 214260 T871 oass.IndexSchema.readSchema unique key field: id
   [junit4]   2> 214260 T871 oasc.SolrCore.initDirectoryFactory org.apache.solr.core.MockDirectoryFactory
   [junit4]   2> 214261 T871 oasc.SolrCore.<init> [collection1] Opening new SolrCore at .\org.apache.solr.handler.TestReplicationHandler$SolrInstance-1375468226242\slave\collection1\, dataDir=C:\Users\JenkinsSlave\workspace\Lucene-Solr-trunk-Windows\solr\build\solr-core\test\J0\.\org.apache.solr.handler.TestReplicationHandler$SolrInstance-1375468226242\slave\collection1\data\
   [junit4]   2> 214261 T871 oasc.SolrCore.<init> JMX monitoring not detected for core: collection1
   [junit4]   2> 214262 T871 oasc.CachingDirectoryFactory.get return new directory for C:\Users\JenkinsSlave\workspace\Lucene-Solr-trunk-Windows\solr\build\solr-core\test\J0\.\org.apache.solr.handler.TestReplicationHandler$SolrInstance-1375468226242\slave\collection1\data\
   [junit4]   2> 214262 T871 oasc.SolrCore.getNewIndexDir New index directory detected: old=null new=C:\Users\JenkinsSlave\workspace\Lucene-Solr-trunk-Windows\solr\build\solr-core\test\J0\.\org.apache.solr.handler.TestReplicationHandler$SolrInstance-1375468226242\slave\collection1\data\index/
   [junit4]   2> 214262 T871 oasc.SolrCore.initIndex WARN [collection1] Solr index directory 'C:\Users\JenkinsSlave\workspace\Lucene-Solr-trunk-Windows\solr\build\solr-core\test\J0\.\org.apache.solr.handler.TestReplicationHandler$SolrInstance-1375468226242\slave\collection1\data\index' doesn't exist. Creating new index...
   [junit4]   2> 214262 T871 oasc.CachingDirectoryFactory.get return new directory for C:\Users\JenkinsSlave\workspace\Lucene-Solr-trunk-Windows\solr\build\solr-core\test\J0\.\org.apache.solr.handler.TestReplicationHandler$SolrInstance-1375468226242\slave\collection1\data\index
   [junit4]   2> 214263 T871 oasc.SolrDeletionPolicy.onCommit SolrDeletionPolicy.onCommit: commits: num=1
   [junit4]   2> commit{dir=MockDirWrapper(org.apache.lucene.store.RAMDirectory@41519aea lockFactory=org.apache.lucene.store.SingleInstanceLockFactory@5b8f3e22),segFN=segments_1,generation=1}
   [junit4]   2> 214264 T871 oasc.SolrDeletionPolicy.updateCommits newest commit generation = 1
   [junit4]   2> 214265 T871 oasc.RequestHandlers.initHandlersFromConfig created standard: solr.StandardRequestHandler
   [junit4]   2> 214265 T871 oasc.RequestHandlers.initHandlersFromConfig created defaults: solr.StandardRequestHandler
   [junit4]   2> 214265 T871 oasc.RequestHandlers.initHandlersFromConfig adding lazy requestHandler: solr.StandardRequestHandler
   [junit4]   2> 214266 T871 oasc.RequestHandlers.initHandlersFromConfig created lazy: solr.StandardRequestHandler
   [junit4]   2> 214266 T871 oasc.RequestHandlers.initHandlersFromConfig created /update: solr.UpdateRequestHandler
   [junit4]   2> 214267 T871 oasc.RequestHandlers.initHandlersFromConfig created /replication: solr.ReplicationHandler
   [junit4]   2> 214269 T871 oashl.XMLLoader.init xsltCacheLifetimeSeconds=60
   [junit4]   2> 214271 T871 oass.SolrIndexSearcher.<init> Opening Searcher@6cee0c2e main
   [junit4]   2> 214271 T871 oasu.CommitTracker.<init> Hard AutoCommit: disabled
   [junit4]   2> 214272 T871 oasu.CommitTracker.<init> Soft AutoCommit: disabled
   [junit4]   2> 214278 T871 oash.SnapPuller.startExecutorService Poll Scheduled at an interval of 1000ms
   [junit4]   2> 214279 T871 oasc.CoreContainer.registerCore registering core: collection1
   [junit4]   2> 214279 T872 oasc.SolrCore.registerSearcher [collection1] Registered new searcher Searcher@6cee0c2e main{StandardDirectoryReader(segments_1:1)}
   [junit4]   2> 214279 T847 oass.SolrDispatchFilter.init user.dir=C:\Users\JenkinsSlave\workspace\Lucene-Solr-trunk-Windows\solr\build\solr-core\test\J0
   [junit4]   2> 214279 T847 oass.SolrDispatchFilter.init SolrDispatchFilter.init() done
   [junit4]   2> 214279 T847 oascsi.HttpClientUtil.createClient Creating new http client, config:maxConnections=128&maxConnectionsPerHost=32&followRedirects=false
   [junit4]   2> 214297 T847 oasc.CoreContainer.shutdown Shutting down CoreContainer instance=894171044
   [junit4]   2> 214298 T847 oasc.SolrCore.close [collection1]  CLOSING SolrCore org.apache.solr.core.SolrCore@12765074
   [junit4]   2> 214299 T847 oasu.DirectUpdateHandler2.close closing DirectUpdateHandler2{commits=0,autocommits=0,soft autocommits=0,optimizes=0,rollbacks=0,expungeDeletes=0,docsPending=0,adds=0,deletesById=0,deletesByQuery=0,errors=0,cumulative_adds=0,cumulative_deletesById=0,cumulative_deletesByQuery=0,cumulative_errors=0}
   [junit4]   2> 214299 T847 oasu.SolrCoreState.decrefSolrCoreState Closing SolrCoreState
   [junit4]   2> 214299 T847 oasu.DefaultSolrCoreState.closeIndexWriter SolrCoreState ref count has reached 0 - closing IndexWriter
   [junit4]   2> 214299 T847 oasu.DefaultSolrCoreState.closeIndexWriter closing IndexWriter with IndexWriterCloser
   [junit4]   2> 214301 T847 oasc.SolrCore.closeSearcher [collection1] Closing main searcher on request.
   [junit4]   2> 214302 T847 oasc.CachingDirectoryFactory.close Closing MockDirectoryFactory - 2 directories currently being tracked
   [junit4]   2> 214302 T847 oasc.CachingDirectoryFactory.closeCacheValue looking to close C:\Users\JenkinsSlave\workspace\Lucene-Solr-trunk-Windows\solr\build\solr-core\test\J0\.\org.apache.solr.handler.TestReplicationHandler$SolrInstance-1375468226242\slave\collection1\data\ [CachedDir<<refCount=0;path=C:\Users\JenkinsSlave\workspace\Lucene-Solr-trunk-Windows\solr\build\solr-core\test\J0\.\org.apache.solr.handler.TestReplicationHandler$SolrInstance-1375468226242\slave\collection1\data\;done=false>>]
   [junit4]   2> 214302 T847 oasc.CachingDirectoryFactory.close Closing directory: C:\Users\JenkinsSlave\workspace\Lucene-Solr-trunk-Windows\solr\build\solr-core\test\J0\.\org.apache.solr.handler.TestReplicationHandler$SolrInstance-1375468226242\slave\collection1\data\
   [junit4]   2> 214302 T847 oasc.CachingDirectoryFactory.closeCacheValue looking to close C:\Users\JenkinsSlave\workspace\Lucene-Solr-trunk-Windows\solr\build\solr-core\test\J0\.\org.apache.solr.handler.TestReplicationHandler$SolrInstance-1375468226242\slave\collection1\data\index [CachedDir<<refCount=0;path=C:\Users\JenkinsSlave\workspace\Lucene-Solr-trunk-Windows\solr\build\solr-core\test\J0\.\org.apache.solr.handler.TestReplicationHandler$SolrInstance-1375468226242\slave\collection1\data\index;done=false>>]
   [junit4]   2> 214303 T847 oasc.CachingDirectoryFactory.close Closing directory: C:\Users\JenkinsSlave\workspace\Lucene-Solr-trunk-Windows\solr\build\solr-core\test\J0\.\org.apache.solr.handler.TestReplicationHandler$SolrInstance-1375468226242\slave\collection1\data\index
   [junit4]   2> 214304 T847 oejsh.ContextHandler.doStop stopped o.e.j.s.ServletContextHandler{/solr,null}
   [junit4]   2> 214371 T847 oasc.CoreContainer.shutdown Shutting down CoreContainer instance=848063780
   [junit4]   2> 214372 T847 oasc.SolrCore.close [collection1]  CLOSING SolrCore org.apache.solr.core.SolrCore@20ece123
   [junit4]   2> 214372 T847 oasu.DirectUpdateHandler2.close closing DirectUpdateHandler2{commits=0,autocommits=0,soft autocommits=0,optimizes=0,rollbacks=0,expungeDeletes=0,docsPending=0,adds=0,deletesById=0,deletesByQuery=0,errors=0,cumulative_adds=0,cumulative_deletesById=0,cumulative_deletesByQuery=0,cumulative_errors=0}
   [junit4]   2> 214373 T847 oasu.SolrCoreState.decrefSolrCoreState Closing SolrCoreState
   [junit4]   2> 214373 T847 oasu.DefaultSolrCoreState.closeIndexWriter SolrCoreState ref count has reached 0 - closing IndexWriter
   [junit4]   2> 214374 T847 oasu.DefaultSolrCoreState.closeIndexWriter closing IndexWriter with IndexWriterCloser
   [junit4]   2> 214374 T847 oasc.SolrCore.closeSearcher [collection1] Closing main searcher on request.
   [junit4]   2> 214375 T847 oasc.CachingDirectoryFactory.close Closing MockDirectoryFactory - 2 directories currently being tracked
   [junit4]   2> 214375 T847 oasc.CachingDirectoryFactory.closeCacheValue looking to close C:\Users\JenkinsSlave\workspace\Lucene-Solr-trunk-Windows\solr\build\solr-core\test\J0\.\org.apache.solr.handler.TestReplicationHandler$SolrInstance-1375468226059\master\collection1\data\ [CachedDir<<refCount=0;path=C:\Users\JenkinsSlave\workspace\Lucene-Solr-trunk-Windows\solr\build\solr-core\test\J0\.\org.apache.solr.handler.TestReplicationHandler$SolrInstance-1375468226059\master\collection1\data\;done=false>>]
   [junit4]   2> 214376 T847 oasc.CachingDirectoryFactory.close Closing directory: C:\Users\JenkinsSlave\workspace\Lucene-Solr-trunk-Windows\solr\build\solr-core\test\J0\.\org.apache.solr.handler.TestReplicationHandler$SolrInstance-1375468226059\master\collection1\data\
   [junit4]   2> 214376 T847 oasc.CachingDirectoryFactory.closeCacheValue looking to close C:\Users\JenkinsSlave\workspace\Lucene-Solr-trunk-Windows\solr\build\solr-core\test\J0\.\org.apache.solr.handler.TestReplicationHandler$SolrInstance-1375468226059\master\collection1\data\index [CachedDir<<refCount=0;path=C:\Users\JenkinsSlave\workspace\Lucene-Solr-trunk-Windows\solr\build\solr-core\test\J0\.\org.apache.solr.handler.TestReplicationHandler$SolrInstance-1375468226059\master\collection1\data\index;done=false>>]
   [junit4]   2> 214376 T847 oasc.CachingDirectoryFactory.close Closing directory: C:\Users\JenkinsSlave\workspace\Lucene-Solr-trunk-Windows\solr\build\solr-core\test\J0\.\org.apache.solr.handler.TestReplicationHandler$SolrInstance-1375468226059\master\collection1\data\index
   [junit4]   2> 214377 T847 oejsh.ContextHandler.doStop stopped o.e.j.s.ServletContextHandler{/solr,null}
   [junit4]   2> 214429 T847 oejs.Server.doStart jetty-8.1.10.v20130312
   [junit4]   2> 214433 T847 oejs.AbstractConnector.doStart Started SelectChannelConnector@127.0.0.1:65046
   [junit4]   2> 214435 T847 oass.SolrDispatchFilter.init SolrDispatchFilter.init()
   [junit4]   2> 214435 T847 oasc.SolrResourceLoader.locateSolrHome JNDI not configured for solr (NoInitialContextEx)
   [junit4]   2> 214437 T847 oasc.SolrResourceLoader.locateSolrHome using system property solr.solr.home: .\org.apache.solr.handler.TestReplicationHandler$SolrInstance-1375468226242\slave
   [junit4]   2> 214437 T847 oasc.SolrResourceLoader.<init> new SolrResourceLoader for directory: '.\org.apache.solr.handler.TestReplicationHandler$SolrInstance-1375468226242\slave\'
   [junit4]   2> 214455 T847 oasc.ConfigSolr.fromFile Loading container configuration from C:\Users\JenkinsSlave\workspace\Lucene-Solr-trunk-Windows\solr\build\solr-core\test\J0\.\org.apache.solr.handler.TestReplicationHandler$SolrInstance-1375468226242\slave\solr.xml
   [junit4]   2> 214456 T847 oasc.ConfigSolr.fromFile C:\Users\JenkinsSlave\workspace\Lucene-Solr-trunk-Windows\solr\build\solr-core\test\J0\.\org.apache.solr.handler.TestReplicationHandler$SolrInstance-1375468226242\slave\solr.xml does not exist, using default configuration
   [junit4]   2> 214464 T847 oasc.CoreContainer.<init> New CoreContainer 487735845
   [junit4]   2> 214465 T847 oasc.CoreContainer.load Loading cores into CoreContainer [instanceDir=.\org.apache.solr.handler.TestReplicationHandler$SolrInstance-1375468226242\slave\]
   [junit4]   2> 214465 T847 oashc.HttpShardHandlerFactory.getParameter Setting socketTimeout to: 0
   [junit4]   2> 214466 T847 oashc.HttpShardHandlerFactory.getParameter Setting urlScheme to: http://
   [junit4]   2> 214466 T847 oashc.HttpShardHandlerFactory.getParameter Setting connTimeout to: 0
   [junit4]   2> 214466 T847 oashc.HttpShardHandlerFactory.getParameter Setting maxConnectionsPerHost to: 20
   [junit4]   2> 214467 T847 oashc.HttpShardHandlerFactory.getParameter Setting corePoolSize to: 0
   [junit4]   2> 214467 T847 oashc.HttpShardHandlerFactory.getParameter Setting maximumPoolSize to: 2147483647
   [junit4]   2> 214468 T847 oashc.HttpShardHandlerFactory.getParameter Setting maxThreadIdleTime to: 5
   [junit4]   2> 214468 T847 oashc.HttpShardHandlerFactory.getParameter Setting sizeOfQueue to: -1
   [junit4]   2> 214469 T847 oashc.HttpShardHandlerFactory.getParameter Setting fairnessPolicy to: false
   [junit4]   2> 214469 T847 oascsi.HttpClientUtil.createClient Creating new http client, config:maxConnectionsPerHost=20&maxConnections=10000&socketTimeout=0&connTimeout=0&retry=false
   [junit4]   2> 214478 T884 oasc.CoreContainer.create Creating SolrCore 'collection1' using instanceDir: .\org.apache.solr.handler.TestReplicationHandler$SolrInstance-1375468226242\slave\collection1
   [junit4]   2> 214478 T884 oasc.SolrResourceLoader.<init> new SolrResourceLoader for directory: '.\org.apache.solr.handler.TestReplicationHandler$SolrInstance-1375468226242\slave\collection1\'
   [junit4]   2> 214500 T884 oasc.SolrConfig.<init> Using Lucene MatchVersion: LUCENE_50
   [junit4]   2> 214519 T884 oasc.SolrConfig.<init> Loaded SolrConfig: solrconfig.xml
   [junit4]   2> 214520 T884 oass.IndexSchema.readSchema Reading Solr Schema from schema.xml
   [junit4]   2> 214525 T884 oass.IndexSchema.readSchema [collection1] Schema name=test
   [junit4]   2> 214528 T884 oass.IndexSchema.readSchema unique key field: id
   [junit4]   2> 214529 T884 oasc.SolrCore.initDirectoryFactory solr.NRTCachingDirectoryFactory
   [junit4]   2> 214555 T884 oasc.SolrCore.<init> [collection1] Opening new SolrCore at .\org.apache.solr.handler.TestReplicationHandler$SolrInstance-1375468226242\slave\collection1\, dataDir=C:\Users\JenkinsSlave\workspace\Lucene-Solr-trunk-Windows\solr\build\solr-core\test\J0\org.apache.solr.handler.TestReplicationHandler$SolrInstance-1375468226242\slave\collection1\data\
   [junit4]   2> 214555 T884 oasc.SolrCore.<init> JMX monitoring not detected for core: collection1
   [junit4]   2> 214556 T884 oasc.CachingDirectoryFactory.get return new directory for C:\Users\JenkinsSlave\workspace\Lucene-Solr-trunk-Windows\solr\build\solr-core\test\J0\org.apache.solr.handler.TestReplicationHandler$SolrInstance-1375468226242\slave\collection1\data
   [junit4]   2> 214560 T884 oasc.SolrCore.getNewIndexDir New index directory detected: old=null new=C:\Users\JenkinsSlave\workspace\Lucene-Solr-trunk-Windows\solr\build\solr-core\test\J0\org.apache.solr.handler.TestReplicationHandler$SolrInstance-1375468226242\slave\collection1\data\index/
   [junit4]   2> 214560 T884 oasc.SolrCore.initIndex WARN [collection1] Solr index directory 'C:\Users\JenkinsSlave\workspace\Lucene-Solr-trunk-Windows\solr\build\solr-core\test\J0\org.apache.solr.handler.TestReplicationHandler$SolrInstance-1375468226242\slave\collection1\data\index' doesn't exist. Creating new index...
   [junit4]   2> 214561 T884 oasc.CachingDirectoryFactory.get return new directory for C:\Users\JenkinsSlave\workspace\Lucene-Solr-trunk-Windows\solr\build\solr-core\test\J0\org.apache.solr.handler.TestReplicationHandler$SolrInstance-1375468226242\slave\collection1\data\index
   [junit4]   2> 214581 T884 oasc.SolrDeletionPolicy.onCommit SolrDeletionPolicy.onCommit: commits: num=1
   [junit4]   2> commit{dir=NRTCachingDirectory(org.apache.lucene.store.MMapDirectory@C:\Users\JenkinsSlave\workspace\Lucene-Solr-trunk-Windows\solr\build\solr-core\test\J0\org.apache.solr.handler.TestReplicationHandler$SolrInstance-1375468226242\slave\collection1\data\index lockFactory=org.apache.lucene.store.SingleInstanceLockFactory@3b337db1; maxCacheMB=48.0 maxMergeSizeMB=4.0),segFN=segments_1,generation=1}
   [junit4]   2> 214581 T884 oasc.SolrDeletionPolicy.updateCommits newest commit generation = 1
   [junit4]   2> 214582 T884 oasc.RequestHandlers.initHandlersFromConfig created standard: solr.StandardRequestHandler
   [junit4]   2> 214583 T884 oasc.RequestHandlers.initHandlersFromConfig created defaults: solr.StandardRequestHandler
   [junit4]   2> 214583 T884 oasc.RequestHandlers.initHandlersFromConfig adding lazy requestHandler: solr.StandardRequestHandler
   [junit4]   2> 214583 T884 oasc.RequestHandlers.initHandlersFromConfig created lazy: solr.StandardRequestHandler
   [junit4]   2> 214584 T884 oasc.RequestHandlers.initHandlersFromConfig created /update: solr.UpdateRequestHandler
   [junit4]   2> 214584 T884 oasc.RequestHandlers.initHandlersFromConfig created /replication: solr.ReplicationHandler
   [junit4]   2> 214592 T884 oashl.XMLLoader.init xsltCacheLifetimeSeconds=60
   [junit4]   2> 214596 T884 oass.SolrIndexSearcher.<init> Opening Searcher@6cb4d180 main
   [junit4]   2> 214596 T884 oasu.CommitTracker.<init> Hard AutoCommit: disabled
   [junit4]   2> 214596 T884 oasu.CommitTracker.<init> Soft AutoCommit: disabled
   [junit4]   2> 214597 T884 oash.SnapPuller.startExecutorService Poll Scheduled at an interval of 1000ms
   [junit4]   2> 214598 T884 oasc.CoreContainer.registerCore registering core: collection1
   [junit4]   2> 214598 T885 oasc.SolrCore.registerSearcher [collection1] Registered new searcher Searcher@6cb4d180 main{StandardDirectoryReader(segments_1:1)}
   [junit4]   2> 214598 T847 oass.SolrDispatchFilter.init user.dir=C:\Users\JenkinsSlave\workspace\Lucene-Solr-trunk-Windows\solr\build\solr-core\test\J0
   [junit4]   2> 214599 T847 oass.SolrDispatchFilter.init SolrDispatchFilter.init() done
   [junit4]   2> 214600 T847 oejs.Server.doStart jetty-8.1.10.v20130312
   [junit4]   2> 214603 T847 oejs.AbstractConnector.doStart Started SelectChannelConnector@127.0.0.1:65043
   [junit4]   2> 214604 T847 oass.SolrDispatchFilter.init SolrDispatchFilter.init()
   [junit4]   2> 214606 T847 oasc.SolrResourceLoader.locateSolrHome JNDI not configured for solr (NoInitialContextEx)
   [junit4]   2> 214606 T847 oasc.SolrResourceLoader.locateSolrHome using system property solr.solr.home: .\org.apache.solr.handler.TestReplicationHandler$SolrInstance-1375468226059\master
   [junit4]   2> 214606 T847 oasc.SolrResourceLoader.<init> new SolrResourceLoader for directory: '.\org.apache.solr.handler.TestReplicationHandler$SolrInstance-1375468226059\master\'
   [junit4]   2> 214640 T847 oasc.ConfigSolr.fromFile Loading container configuration from C:\Users\JenkinsSlave\workspace\Lucene-Solr-trunk-Windows\solr\build\solr-core\test\J0\.\org.apache.solr.handler.TestReplicationHandler$SolrInstance-1375468226059\master\solr.xml
   [junit4]   2> 214641 T847 oasc.ConfigSolr.fromFile C:\Users\JenkinsSlave\workspace\Lucene-Solr-trunk-Windows\solr\build\solr-core\test\J0\.\org.apache.solr.handler.TestReplicationHandler$SolrInstance-1375468226059\master\solr.xml does not exist, using default configuration
   [junit4]   2> 214654 T847 oasc.CoreContainer.<init> New CoreContainer 1130832901
   [junit4]   2> 214654 T847 oasc.CoreContainer.load Loading cores into CoreContainer [instanceDir=.\org.apache.solr.handler.TestReplicationHandler$SolrInstance-1375468226059\master\]
   [junit4]   2> 214655 T847 oashc.HttpShardHandlerFactory.getParameter Setting socketTimeout to: 0
   [junit4]   2> 214655 T847 oashc.HttpShardHandlerFactory.getParameter Setting urlScheme to: http://
   [junit4]   2> 214655 T847 oashc.HttpShardHandlerFactory.getParameter Setting connTimeout to: 0
   [junit4]   2> 214656 T847 oashc.HttpShardHandlerFactory.getParameter Setting maxConnectionsPerHost to: 20
   [junit4]   2> 214657 T847 oashc.HttpShardHandlerFactory.getParameter Setting corePoolSize to: 0
   [junit4]   2> 214657 T847 oashc.HttpShardHandlerFactory.getParameter Setting maximumPoolSize to: 2147483647
   [junit4]   2> 214658 T847 oashc.HttpShardHandlerFactory.getParameter Setting maxThreadIdleTime to: 5
   [junit4]   2> 214658 T847 oashc.HttpShardHandlerFactory.getParameter Setting sizeOfQueue to: -1
   [junit4]   2> 214658 T847 oashc.HttpShardHandlerFactory.getParameter Setting fairnessPolicy to: false
   [junit4]   2> 214658 T847 oascsi.HttpClientUtil.createClient Creating new http client, config:maxConnectionsPerHost=20&maxConnections=10000&socketTimeout=0&connTimeout=0&retry=false
   [junit4]   2> 214671 T897 oasc.CoreContainer.create Creating SolrCore 'collection1' using instanceDir: .\org.apache.solr.handler.TestReplicationHandler$SolrInstance-1375468226059\master\collection1
   [junit4]   2> 214671 T897 oasc.SolrResourceLoader.<init> new SolrResourceLoader for directory: '.\org.apache.solr.handler.TestReplicationHandler$SolrInstance-1375468226059\master\collection1\'
   [junit4]   2> 214697 T897 oasc.SolrConfig.<init> Using Lucene MatchVersion: LUCENE_50
   [junit4]   2> 214712 T897 oasc.SolrConfig.<init> Loaded SolrConfig: solrconfig.xml
   [junit4]   2> 214712 T897 oass.IndexSchema.readSchema Reading Solr Schema from schema.xml
   [junit4]   2> 214716 T897 oass.IndexSchema.readSchema [collection1] Schema name=test
   [junit4]   2> 214721 T897 oass.IndexSchema.readSchema unique key field: id
   [junit4]   2> 214721 T897 oasc.SolrCore.initDirectoryFactory solr.NRTCachingDirectoryFactory
   [junit4]   2> 214723 T897 oasc.SolrCore.<init> [collection1] Opening new SolrCore at .\org.apache.solr.handler.TestReplicationHandler$SolrInstance-1375468226059\master\collection1\, dataDir=C:\Users\JenkinsSlave\workspace\Lucene-Solr-trunk-Windows\solr\build\solr-core\test\J0\org.apache.solr.handler.TestReplicationHandler$SolrInstance-1375468226059\master\collection1\data\
   [junit4]   2> 214723 T897 oasc.SolrCore.<init> JMX monitoring not detected for core: collection1
   [junit4]   2> 214724 T897 oasc.CachingDirectoryFactory.get return new directory for C:\Users\JenkinsSlave\workspace\Lucene-Solr-trunk-Windows\solr\build\solr-core\test\J0\org.apache.solr.handler.TestReplicationHandler$SolrInstance-1375468226059\master\collection1\data
   [junit4]   2> 214724 T897 oasc.SolrCore.getNewIndexDir New index directory detected: old=null new=C:\Users\JenkinsSlave\workspace\Lucene-Solr-trunk-Windows\solr\build\solr-core\test\J0\org.apache.solr.handler.TestReplicationHandler$SolrInstance-1375468226059\master\collection1\data\index/
   [junit4]   2> 214725 T897 oasc.SolrCore.initIndex WARN [collection1] Solr index directory 'C:\Users\JenkinsSlave\workspace\Lucene-Solr-trunk-Windows\solr\build\solr-core\test\J0\org.apache.solr.handler.TestReplicationHandler$SolrInstance-1375468226059\master\collection1\data\index' doesn't exist. Creating new index...
   [junit4]   2> 214725 T897 oasc.CachingDirectoryFactory.get return new directory for C:\Users\JenkinsSlave\workspace\Lucene-Solr-trunk-Windows\solr\build\solr-core\test\J0\org.apache.solr.handler.TestReplicationHandler$SolrInstance-1375468226059\master\collection1\data\index
   [junit4]   2> 214734 T897 oasc.SolrDeletionPolicy.onCommit SolrDeletionPolicy.onCommit: commits: num=1
   [junit4]   2> commit{dir=NRTCachingDirectory(org.apache.lucene.store.MMapDirectory@C:\Users\JenkinsSlave\workspace\Lucene-Solr-trunk-Windows\solr\build\solr-core\test\J0\org.apache.solr.handler.TestReplicationHandler$SolrInstance-1375468226059\master\collection1\data\index lockFactory=org.apache.lucene.store.SingleInstanceLockFactory@17e9dab4; maxCacheMB=48.0 maxMergeSizeMB=4.0),segFN=segments_1,generation=1}
   [junit4]   2> 214734 T897 oasc.SolrDeletionPolicy.updateCommits newest commit generation = 1
   [junit4]   2> 214737 T897 oasc.RequestHandlers.initHandlersFromConfig created standard: solr.StandardRequestHandler
   [junit4]   2> 214738 T897 oasc.RequestHandlers.initHandlersFromConfig created /replication: solr.ReplicationHandler
   [junit4]   2> 214739 T897 oasc.RequestHandlers.initHandlersFromConfig created defaults: solr.StandardRequestHandler
   [junit4]   2> 214739 T897 oasc.RequestHandlers.initHandlersFromConfig adding lazy requestHandler: solr.StandardRequestHandler
   [junit4]   2> 214739 T897 oasc.RequestHandlers.initHandlersFromConfig created lazy: solr.StandardRequestHandler
   [junit4]   2> 214740 T897 oasc.RequestHandlers.initHandlersFromConfig created /update: solr.UpdateRequestHandler
   [junit4]   2> 214753 T897 oashl.XMLLoader.init xsltCacheLifetimeSeconds=60
   [junit4]   2> 214756 T897 oass.SolrIndexSearcher.<init> Opening Searcher@12c221ce main
   [junit4]   2> 214757 T897 oasu.CommitTracker.<init> Hard AutoCommit: disabled
   [junit4]   2> 214757 T897 oasu.CommitTracker.<init> Soft AutoCommit: disabled
   [junit4]   2> 214757 T897 oash.ReplicationHandler.inform Replication enabled for following config files: schema.xml,xslt/dummy.xsl
   [junit4]   2> 214757 T897 oash.ReplicationHandler.inform Commits will be reserved for  10000
   [junit4]   2> 214758 T897 oasc.CoreContainer.registerCore registering core: collection1
   [junit4]   2> 214758 T898 oasc.SolrCore.registerSearcher [collection1] Registered new searcher Searcher@12c221ce main{StandardDirectoryReader(segments_1:1)}
   [junit4]   2> 214759 T847 oass.SolrDispatchFilter.init user.dir=C:\Users\JenkinsSlave\workspace\Lucene-Solr-trunk-Windows\solr\build\solr-core\test\J0
   [junit4]   2> 214759 T847 oass.SolrDispatchFilter.init SolrDispatchFilter.init() done
   [junit4]   2> ASYNC  NEW_CORE C262 name=collection1 org.apache.solr.core.SolrCore@5f27d145
   [junit4]   2> 214767 T878 C262 oasc.SolrDeletionPolicy.onInit SolrDeletionPolicy.onInit: commits: num=1
   [junit4]   2> commit{dir=NRTCachingDirectory(org.apache.lucene.store.MMapDirectory@C:\Users\JenkinsSlave\workspace\Lucene-Solr-trunk-Windows\solr\build\solr-core\test\J0\org.apache.solr.handler.TestReplicationHandler$SolrInstance-1375468226242\slave\collection1\data\index lockFactory=org.apache.lucene.store.SingleInstanceLockFactory@3b337db1; maxCacheMB=48.0 maxMergeSizeMB=4.0),segFN=segments_1,generation=1}
   [junit4]   2> 214769 T878 C262 oasc.SolrDeletionPolicy.updateCommits newest commit generation = 1
   [junit4]   2> 214770 T878 C262 oasup.LogUpdateProcessor.finish [collection1] webapp=/solr path=/update params={wt=javabin&version=2} {add=[123456]} 0 7
   [junit4]   2> 214775 T879 C262 oasu.DirectUpdateHandler2.commit start commit{,optimize=false,openSearcher=true,waitSearcher=true,expungeDeletes=false,softCommit=false,prepareCommit=false}
   [junit4]   2> 214810 T879 C262 oasc.SolrDeletionPolicy.onCommit SolrDeletionPolicy.onCommit: commits: num=2
   [junit4]   2> commit{dir=NRTCachingDirectory(org.apache.lucene.store.MMapDirectory@C:\Users\JenkinsSlave\workspace\Lucene-Solr-trunk-Windows\solr\build\solr-core\test\J0\org.apache.solr.handler.TestReplicationHandler$SolrInstance-1375468226242\slave\collection1\data\index lockFactory=org.apache.lucene.store.SingleInstanceLockFactory@3b337db1; maxCacheMB=48.0 maxMergeSizeMB=4.0),segFN=segments_1,generation=1}
   [junit4]   2> commit{dir=NRTCachingDirectory(org.apache.lucene.store.MMapDirectory@C:\Users\JenkinsSlave\workspace\Lucene-Solr-trunk-Windows\solr\build\solr-core\test\J0\org.apache.solr.handler.TestReplicationHandler$SolrInstance-1375468226242\slave\collection1\data\index lockFactory=org.apache.lucene.store.SingleInstanceLockFactory@3b337db1; maxCacheMB=48.0 maxMergeSizeMB=4.0),segFN=segments_2,generation=2}
   [junit4]   2> 214810 T879 C262 oasc.SolrDeletionPolicy.updateCommits newest commit generation = 2
   [junit4]   2> 214818 T879 C262 oass.SolrIndexSearcher.<init> Opening Searcher@4b0bc847 main
   [junit4]   2> 214819 T879 C262 oasu.DirectUpdateHandler2.commit end_commit_flush
   [junit4]   2> 214820 T885 oasc.SolrCore.registerSearcher [collection1] Registered new searcher Searcher@4b0bc847 main{StandardDirectoryReader(segments_2:3:nrt _0(5.0):C1)}
   [junit4]   2> 214820 T879 C262 oasup.LogUpdateProcessor.finish [collection1] webapp=/solr path=/update params={waitSearcher=true&commit=true&wt=javabin&version=2&softCommit=false} {commit=} 0 45
   [junit4]   2> 214833 T847 oasc.CoreContainer.shutdown Shutting down CoreContainer instance=487735845
   [junit4]   2> 214834 T847 oasc.SolrCore.close [collection1]  CLOSING SolrCore org.apache.solr.core.SolrCore@5f27d145
   [junit4]   2> 214835 T847 oasu.DirectUpdateHandler2.close closing DirectUpdateHandler2{commits=1,autocommits=0,soft autocommits=0,optimizes=0,rollbacks=0,expungeDeletes=0,docsPending=0,adds=0,deletesById=0,deletesByQuery=0,errors=0,cumulative_adds=1,cumulative_deletesById=0,cumulative_deletesByQuery=0,cumulative_errors=0}
   [junit4]   2> 214835 T847 oasu.SolrCoreState.decrefSolrCoreState Closing SolrCoreState
   [junit4]   2> 214835 T847 oasu.DefaultSolrCoreState.closeIndexWriter SolrCoreState ref count has reached 0 - closing IndexWriter
   [junit4]   2> 214835 T847 oasu.DefaultSolrCoreState.closeIndexWriter closing IndexWriter with IndexWriterCloser
   [junit4]   2> 214837 T847 oasc.SolrCore.closeSearcher [collection1] Closing main searcher on request.
   [junit4]   2> 214840 T847 oasc.CachingDirectoryFactory.close Closing NRTCachingDirectoryFactory - 2 directories currently being tracked
   [junit4]   2> 214840 T847 oasc.CachingDirectoryFactory.closeCacheValue looking to close C:\Users\JenkinsSlave\workspace\Lucene-Solr-trunk-Windows\solr\build\solr-core\test\J0\org.apache.solr.handler.TestReplicationHandler$SolrInstance-1375468226242\slave\collection1\data\index [CachedDir<<refCount=0;path=C:\Users\JenkinsSlave\workspace\Lucene-Solr-trunk-Windows\solr\build\solr-core\test\J0\org.apache.solr.handler.TestReplicationHandler$SolrInstance-1375468226242\slave\collection1\data\index;done=false>>]
   [junit4]   2> 214841 T847 oasc.CachingDirectoryFactory.close Closing directory: C:\Users\JenkinsSlave\workspace\Lucene-Solr-trunk-Windows\solr\build\solr-core\test\J0\org.apache.solr.handler.TestReplicationHandler$SolrInstance-1375468226242\slave\collection1\data\index
   [junit4]   2> 214841 T847 oasc.CachingDirectoryFactory.closeCacheValue looking to close C:\Users\JenkinsSlave\workspace\Lucene-Solr-trunk-Windows\solr\build\solr-core\test\J0\org.apache.solr.handler.TestReplicationHandler$SolrInstance-1375468226242\slave\collection1\data [CachedDir<<refCount=0;path=C:\Users\JenkinsSlave\workspace\Lucene-Solr-trunk-Windows\solr\build\solr-core\test\J0\org.apache.solr.handler.TestReplicationHandler$SolrInstance-1375468226242\slave\collection1\data;done=false>>]
   [junit4]   2> 214841 T847 oasc.CachingDirectoryFactory.close Closing directory: C:\Users\JenkinsSlave\workspace\Lucene-Solr-trunk-Windows\solr\build\solr-core\test\J0\org.apache.solr.handler.TestReplicationHandler$SolrInstance-1375468226242\slave\collection1\data
   [junit4]   2> 214842 T847 oejsh.ContextHandler.doStop stopped o.e.j.s.ServletContextHandler{/solr,null}
   [junit4]   2> 214894 T847 oejs.Server.doStart jetty-8.1.10.v20130312
   [junit4]   2> 214898 T847 oejs.AbstractConnector.doStart Started SelectChannelConnector@127.0.0.1:65046
   [junit4]   2> 214899 T847 oass.SolrDispatchFilter.init SolrDispatchFilter.init()
   [junit4]   2> 214899 T847 oasc.SolrResourceLoader.locateSolrHome JNDI not configured for solr (NoInitialContextEx)
   [junit4]   2> 214899 T847 oasc.SolrResourceLoader.locateSolrHome using system property solr.solr.home: .\org.apache.solr.handler.TestReplicationHandler$SolrInstance-1375468226242\slave
   [junit4]   2> 214900 T847 oasc.SolrResourceLoader.<init> new SolrResourceLoader for directory: '.\org.apache.solr.handler.TestReplicationHandler$SolrInstance-1375468226242\slave\'
   [junit4]   2> 214943 T847 oasc.ConfigSolr.fromFile Loading container configuration from C:\Users\JenkinsSlave\workspace\Lucene-Solr-trunk-Windows\solr\build\solr-core\test\J0\.\org.apache.solr.handler.TestReplicationHandler$SolrInstance-1375468226242\slave\solr.xml
   [junit4]   2> 214944 T847 oasc.ConfigSolr.fromFile C:\Users\JenkinsSlave\workspace\Lucene-Solr-trunk-Windows\solr\build\solr-core\test\J0\.\org.apache.solr.handler.TestReplicationHandler$SolrInstance-1375468226242\slave\solr.xml does not exist, using default configuration
   [junit4]   2> 214966 T847 oasc.CoreContainer.<init> New CoreContainer 701974903
   [junit4]   2> 214967 T847 oasc.CoreContainer.load Loading cores into CoreContainer [instanceDir=.\org.apache.solr.handler.TestReplicationHandler$SolrInstance-1375468226242\slave\]
   [junit4]   2> 214969 T847 oashc.HttpShardHandlerFactory.getParameter Setting socketTimeout to: 0
   [junit4]   2> 214969 T847 oashc.HttpShardHandlerFactory.getParameter Setting urlScheme to: http://
   [junit4]   2> 214970 T847 oashc.HttpShardHandlerFactory.getParameter Setting connTimeout to: 0
   [junit4]   2> 214970 T847 oashc.HttpShardHandlerFactory.getParameter Setting maxConnectionsPerHost to: 20
   [junit4]   2> 214971 T847 oashc.HttpShardHandlerFactory.getParameter Setting corePoolSize to: 0
   [junit4]   2> 214973 T847 oashc.HttpShardHandlerFactory.getParameter Setting maximumPoolSize to: 2147483647
   [junit4]   2> 214973 T847 oashc.HttpShardHandlerFactory.getParameter Setting maxThreadIdleTime to: 5
   [junit4]   2> 214974 T847 oashc.HttpShardHandlerFactory.getParameter Setting sizeOfQueue to: -1
   [junit4]   2> 214974 T847 oashc.HttpShardHandlerFactory.getParameter Setting fairnessPolicy to: false
   [junit4]   2> 214974 T847 oascsi.HttpClientUtil.createClient Creating new http client, config:maxConnectionsPerHost=20&maxConnections=10000&socketTimeout=0&connTimeout=0&retry=false
   [junit4]   2> 214987 T909 oasc.CoreContainer.create Creating SolrCore 'collection1' using instanceDir: .\org.apache.solr.handler.TestReplicationHandler$SolrInstance-1375468226242\slave\collection1
   [junit4]   2> 214987 T909 oasc.SolrResourceLoader.<init> new SolrResourceLoader for directory: '.\org.apache.solr.handler.TestReplicationHandler$SolrInstance-1375468226242\slave\collection1\'
   [junit4]   2> 215016 T909 oasc.SolrConfig.<init> Using Lucene MatchVersion: LUCENE_50
   [junit4]   2> 215033 T909 oasc.SolrConfig.<init> Loaded SolrConfig: solrconfig.xml
   [junit4]   2> 215034 T909 oass.IndexSchema.readSchema Reading Solr Schema from schema.xml
   [junit4]   2> 215038 T909 oass.IndexSchema.readSchema [collection1] Schema name=test
   [junit4]   2> 215044 T909 oass.IndexSchema.readSchema unique key field: id
   [junit4]   2> 215045 T909 oasc.SolrCore.initDirectoryFactory solr.NRTCachingDirectoryFactory
   [junit4]   2> 215046 T909 oasc.SolrCore.<init> [collection1] Opening new SolrCore at .\org.apache.solr.handler.TestReplicationHandler$SolrInstance-1375468226242\slave\collection1\, dataDir=C:\Users\JenkinsSlave\workspace\Lucene-Solr-trunk-Windows\solr\build\solr-core\test\J0\org.apache.solr.handler.TestReplicationHandler$SolrInstance-1375468226242\slave\collection1\data\
   [junit4]   2> 215047 T909 oasc.SolrCore.<init> JMX monitoring not detected for core: collection1
   [junit4]   2> 215047 T909 oasc.CachingDirectoryFactory.get return new directory for C:\Users\JenkinsSlave\workspace\Lucene-Solr-trunk-Windows\solr\build\solr-core\test\J0\org.apache.solr.handler.TestReplicationHandler$SolrInstance-1375468226242\slave\collection1\data
   [junit4]   2> 215047 T909 oasc.SolrCore.getNewIndexDir New index directory detected: old=null new=C:\Users\JenkinsSlave\workspace\Lucene-Solr-trunk-Windows\solr\build\solr-core\test\J0\org.apache.solr.handler.TestReplicationHandler$SolrInstance-1375468226242\slave\collection1\data\index/
   [junit4]   2> 215049 T909 oasc.RequestHandlers.initHandlersFromConfig created standard: solr.StandardRequestHandler
   [junit4]   2> 215049 T909 oasc.RequestHandlers.initHandlersFromConfig created defaults: solr.StandardRequestHandler
   [junit4]   2> 215049 T909 oasc.RequestHandlers.initHandlersFromConfig adding lazy requestHandler: solr.StandardRequestHandler
   [junit4]   2> 215050 T909 oasc.RequestHandlers.initHandlersFromConfig created lazy: solr.StandardRequestHandler
   [junit4]   2> 215050 T909 oasc.RequestHandlers.initHandlersFromConfig created /update: solr.UpdateRequestHandler
   [junit4]   2> 215050 T909 oasc.RequestHandlers.initHandlersFromConfig created /replication: solr.ReplicationHandler
   [junit4]   2> 215056 T909 oashl.XMLLoader.init xsltCacheLifetimeSeconds=60
   [junit4]   2> 215058 T909 oasc.CachingDirectoryFactory.get return new directory for C:\Users\JenkinsSlave\workspace\Lucene-Solr-trunk-Windows\solr\build\solr-core\test\J0\org.apache.solr.handler.TestReplicationHandler$SolrInstance-1375468226242\slave\collection1\data\index
   [junit4]   2> 215062 T909 oass.SolrIndexSearcher.<init> Opening Searcher@15c2aae9 main
   [junit4]   2> 215063 T909 oasu.CommitTracker.<init> Hard AutoCommit: disabled
   [junit4]   2> 215063 T909 oasu.CommitTracker.<init> Soft AutoCommit: disabled
   [junit4]   2> 215064 T909 oash.SnapPuller.startExecutorService Poll Scheduled at an interval of 1000ms
   [junit4]   2> 215064 T909 oasc.CoreContainer.registerCore registering core: collection1
   [junit4]   2> 215064 T910 oasc.SolrCore.registerSearcher [collection1] Registered new searcher Searcher@15c2aae9 main{StandardDirectoryReader(segments_2:3 _0(5.0):C1)}
   [junit4]   2> 215065 T847 oass.SolrDispatchFilter.init user.dir=C:\Users\JenkinsSlave\workspace\Lucene-Solr-trunk-Windows\solr\build\solr-core\test\J0
   [junit4]   2> 215065 T847 oass.SolrDispatchFilter.init SolrDispatchFilter.init() done
   [junit4]   2> 215073 T913 oash.SnapPuller.<init> WARN 'masterUrl' must be specified without the /replication suffix
   [junit4]   2> 215073 T913 oash.SnapPuller.<init>  No value set for 'pollInterval'. Timer Task not started.
   [junit4]   2> ASYNC  NEW_CORE C263 name=collection1 org.apache.solr.core.SolrCore@3fa7a5f7
   [junit4]   2> 215076 T892 C263 oasc.SolrCore.execute [collection1] webapp=/solr path=/replication params={command=indexversion&qt=/replication&wt=javabin&version=2} status=0 QTime=0
   [junit4]   2> ASYNC  NEW_CORE C264 name=collection1 org.apache.solr.core.SolrCore@4eebcf1b
   [junit4]   2> 215078 T903 C264 oasc.SolrCore.execute [collection1] webapp=/solr path=/replication params={masterUrl=http://127.0.0.1:65043/solr/replication&command=fetchindex&wait=true} status=0 QTime=7
   [junit4]   2> 215079 T847 oas.SolrTestCaseJ4.tearDown ###Ending testNoWriter
   [junit4]   2> 215092 T847 oasc.CoreContainer.shutdown Shutting down CoreContainer instance=1130832901
   [junit4]   2> 215094 T847 oasc.SolrCore.close [collection1]  CLOSING SolrCore org.apache.solr.core.SolrCore@3fa7a5f7
   [junit4]   2> 215094 T847 oasu.DirectUpdateHandler2.close closing DirectUpdateHandler2{commits=0,autocommits=0,soft autocommits=0,optimizes=0,rollbacks=0,expungeDeletes=0,docsPending=0,adds=0,deletesById=0,deletesByQuery=0,errors=0,cumulative_adds=0,cumulative_deletesById=0,cumulative_deletesByQuery=0,cumulative_errors=0}
   [junit4]   2> 215094 T847 oasu.SolrCoreState.decrefSolrCoreState Closing SolrCoreState
   [junit4]   2> 215094 T847 oasu.DefaultSolrCoreState.closeIndexWriter SolrCoreState ref count has reached 0 - closing IndexWriter
   [junit4]   2> 215095 T847 oasu.DefaultSolrCoreState.closeIndexWriter closing IndexWriter with IndexWriterCloser
   [junit4]   2> 215096 T847 oasc.SolrCore.closeSearcher [collection1] Closing main searcher on request.
   [junit4]   2> 215097 T847 oasc.CachingDirectoryFactory.close Closing NRTCachingDirectoryFactory - 2 directories currently being tracked
   [junit4]   2> 215097 T847 oasc.CachingDirectoryFactory.closeCacheValue looking to close C:\Users\JenkinsSlave\workspace\Lucene-Solr-trunk-Windows\solr\build\solr-core\test\J0\org.apache.solr.handler.TestReplicationHandler$SolrInstance-1375468226059\master\collection1\data\index [CachedDir<<refCount=0;path=C:\Users\JenkinsSlave\workspace\Lucene-Solr-trunk-Windows\solr\build\solr-core\test\J0\org.apache.solr.handler.TestReplicationHandler$SolrInstance-1375468226059\master\collection1\data\index;done=false>>]
   [junit4]   2> 215097 T847 oasc.CachingDirectoryFactory.close Closing directory: C:\Users\JenkinsSlave\workspace\Lucene-Solr-trunk-Windows\solr\build\solr-core\test\J0\org.apache.solr.handler.TestReplicationHandler$SolrInstance-1375468226059\master\collection1\data\index
   [junit4]   2> 215098 T847 oasc.CachingDirectoryFactory.closeCacheValue looking to close C:\Users\JenkinsSlave\workspace\Lucene-Solr-trunk-Windows\solr\build\solr-core\test\J0\org.apache.solr.handler.TestReplicationHandler$SolrInstance-1375468226059\master\collection1\data [CachedDir<<refCount=0;path=C:\Users\JenkinsSlave\workspace\Lucene-Solr-trunk-Windows\solr\build\solr-core\test\J0\org.apache.solr.handler.TestReplicationHandler$SolrInstance-1375468226059\master\collection1\data;done=false>>]
   [junit4]   2> 215098 T847 oasc.CachingDirectoryFactory.close Closing directory: C:\Users\JenkinsSlave\workspace\Lucene-Solr-trunk-Windows\solr\build\solr-core\test\J0\org.apache.solr.handler.TestReplicationHandler$SolrInstance-1375468226059\master\collection1\data
   [junit4]   2> 215099 T847 oejsh.ContextHandler.doStop stopped o.e.j.s.ServletContextHandler{/solr,null}
   [junit4]   2> 215164 T847 oasc.CoreContainer.shutdown Shutting down CoreContainer instance=701974903
   [junit4]   2> 215166 T847 oasc.SolrCore.close [collection1]  CLOSING SolrCore org.apache.solr.core.SolrCore@4eebcf1b
   [junit4]   2> 215166 T847 oasu.DirectUpdateHandler2.close closing DirectUpdateHandler2{commits=0,autocommits=0,soft autocommits=0,optimizes=0,rollbacks=0,expungeDeletes=0,docsPending=0,adds=0,deletesById=0,deletesByQuery=0,errors=0,cumulative_adds=0,cumulative_deletesById=0,cumulative_deletesByQuery=0,cumulative_errors=0}
   [junit4]   2> 215167 T847 oasu.SolrCoreState.decrefSolrCoreState Closing SolrCoreState
   [junit4]   2> 215167 T847 oasu.DefaultSolrCoreState.closeIndexWriter SolrCoreState ref count has reached 0 - closing IndexWriter
   [junit4]   2> 215167 T847 oasu.DefaultSolrCoreState.closeIndexWriter closing IndexWriter with IndexWriterCloser
   [junit4]   2> 215167 T847 oasc.SolrCore.closeSearcher [collection1] Closing main searcher on request.
   [junit4]   2> 215168 T847 oasc.CachingDirectoryFactory.close Closing NRTCachingDirectoryFactory - 2 directories currently being tracked
   [junit4]   2> 215168 T847 oasc.CachingDirectoryFactory.closeCacheValue looking to close C:\Users\JenkinsSlave\workspace\Lucene-Solr-trunk-Windows\solr\build\solr-core\test\J0\org.apache.solr.handler.TestReplicationHandler$SolrInstance-1375468226242\slave\collection1\data\index [CachedDir<<refCount=0;path=C:\Users\JenkinsSlave\workspace\Lucene-Solr-trunk-Windows\solr\build\solr-core\test\J0\org.apache.solr.handler.TestReplicationHandler$SolrInstance-1375468226242\slave\collection1\data\index;done=false>>]
   [junit4]   2> 215168 T847 oasc.CachingDirectoryFactory.close Closing directory: C:\Users\JenkinsSlave\workspace\Lucene-Solr-trunk-Windows\solr\build\solr-core\test\J0\org.apache.solr.handler.TestReplicationHandler$SolrInstance-1375468226242\slave\collection1\data\index
   [junit4]   2> 215168 T847 oasc.CachingDirectoryFactory.closeCacheValue looking to close C:\Users\JenkinsSlave\workspace\Lucene-Solr-trunk-Windows\solr\build\solr-core\test\J0\org.apache.solr.handler.TestReplicationHandler$SolrInstance-1375468226242\slave\collection1\data [CachedDir<<refCount=0;path=C:\Users\JenkinsSlave\workspace\Lucene-Solr-trunk-Windows\solr\build\solr-core\test\J0\org.apache.solr.handler.TestReplicationHandler$SolrInstance-1375468226242\slave\collection1\data;done=false>>]
   [junit4]   2> 215170 T847 oasc.CachingDirectoryFactory.close Closing directory: C:\Users\JenkinsSlave\workspace\Lucene-Solr-trunk-Windows\solr\build\solr-core\test\J0\org.apache.solr.handler.TestReplicationHandler$SolrInstance-1375468226242\slave\collection1\data
   [junit4]   2> 215171 T847 oejsh.ContextHandler.doStop stopped o.e.j.s.ServletContextHandler{/solr,null}
   [junit4]   2> 215278 T847 oas.SolrTestCaseJ4.setUp ###Starting doTestDetails
   [junit4]   2> 215291 T847 oejs.Server.doStart jetty-8.1.10.v20130312
   [junit4]   2> 215296 T847 oejs.AbstractConnector.doStart Started SelectChannelConnector@127.0.0.1:65058
   [junit4]   2> 215297 T847 oass.SolrDispatchFilter.init SolrDispatchFilter.init()
   [junit4]   2> 215297 T847 oasc.SolrResourceLoader.locateSolrHome JNDI not configured for solr (NoInitialContextEx)
   [junit4]   2> 215297 T847 oasc.SolrResourceLoader.locateSolrHome using system property solr.solr.home: .\org.apache.solr.handler.TestReplicationHandler$SolrInstance-1375468227367\master
   [junit4]   2> 215297 T847 oasc.SolrResourceLoader.<init> new SolrResourceLoader for directory: '.\org.apache.solr.handler.TestReplicationHandler$SolrInstance-1375468227367\master\'
   [junit4]   2> 215341 T847 oasc.ConfigSolr.fromFile Loading container configuration from C:\Users\JenkinsSlave\workspace\Lucene-Solr-trunk-Windows\solr\build\solr-core\test\J0\.\org.apache.solr.handler.TestReplicationHandler$SolrInstance-1375468227367\master\solr.xml
   [junit4]   2> 215342 T847 oasc.ConfigSolr.fromFile C:\Users\JenkinsSlave\workspace\Lucene-Solr-trunk-Windows\solr\build\solr-core\test\J0\.\org.apache.solr.handler.TestReplicationHandler$SolrInstance-1375468227367\master\solr.xml does not exist, using default configuration
   [junit4]   2> 215355 T847 oasc.CoreContainer.<init> New CoreContainer 756153395
   [junit4]   2> 215355 T847 oasc.CoreContainer.load Loading cores into CoreContainer [instanceDir=.\org.apache.solr.handler.TestReplicationHandler$SolrInstance-1375468227367\master\]
   [junit4]   2> 215357 T847 oashc.HttpShardHandlerFactory.getParameter Setting socketTimeout to: 0
   [junit4]   2> 215357 T847 oashc.HttpShardHandlerFactory.getParameter Setting urlScheme to: http://
   [junit4]   2> 215357 T847 oashc.HttpShardHandlerFactory.getParameter Setting connTimeout to: 0
   [junit4]   2> 215357 T847 oashc.HttpShardHandlerFactory.getParameter Setting maxConnectionsPerHost to: 20
   [junit4]   2> 215357 T847 oashc.HttpShardHandlerFactory.getParameter Setting corePoolSize to: 0
   [junit4]   2> 215358 T847 oashc.HttpShardHandlerFactory.getParameter Setting maximumPoolSize to: 2147483647
   [junit4]   2> 215358 T847 oashc.HttpShardHandlerFactory.getParameter Setting maxThreadIdleTime to: 5
   [junit4]   2> 215359 T847 oashc.HttpShardHandlerFactory.getParameter Setting sizeOfQueue to: -1
   [junit4]   2> 215359 T847 oashc.HttpShardHandlerFactory.getParameter Setting fairnessPolicy to: false
   [junit4]   2> 215360 T847 oascsi.HttpClientUtil.createClient Creating new http client, config:maxConnectionsPerHost=20&maxConnections=10000&socketTimeout=0&connTimeout=0&retry=false
   [junit4]   2> 215372 T923 oasc.CoreContainer.create Creating SolrCore 'collection1' using instanceDir: .\org.apache.solr.handler.TestReplicationHandler$SolrInstance-1375468227367\master\collection1
   [junit4]   2> 215372 T923 oasc.SolrResourceLoader.<init> new SolrResourceLoader for directory: '.\org.apache.solr.handler.TestReplicationHandler$SolrInstance-1375468227367\master\collection1\'
   [junit4]   2> 215398 T923 oasc.SolrConfig.<init> Using Lucene MatchVersion: LUCENE_50
   [junit4]   2> 215412 T923 oasc.SolrConfig.<init> Loaded SolrConfig: solrconfig.xml
   [junit4]   2> 215413 T923 oass.IndexSchema.readSchema Reading Solr Schema from schema.xml
   [junit4]   2> 215417 T923 oass.IndexSchema.readSchema [collection1] Schema name=test
   [junit4]   2> 215422 T923 oass.IndexSchema.readSchema unique key field: id
   [junit4]   2> 215422 T923 oasc.SolrCore.initDirectoryFactory org.apache.solr.core.MockDirectoryFactory
   [junit4]   2> 215423 T923 oasc.SolrCore.<init> [collection1] Opening new SolrCore at .\org.apache.solr.handler.TestReplicationHandler$SolrInstance-1375468227367\master\collection1\, dataDir=C:\Users\JenkinsSlave\workspace\Lucene-Solr-trunk-Windows\solr\build\solr-core\test\J0\.\org.apache.solr.handler.TestReplicationHandler$SolrInstance-1375468227367\master\collection1\data\
   [junit4]   2> 215423 T923 oasc.SolrCore.<init> JMX monitoring not detected for core: collection1
   [junit4]   2> 215424 T923 oasc.CachingDirectoryFactory.get return new directory for C:\Users\JenkinsSlave\workspace\Lucene-Solr-trunk-Windows\solr\build\solr-core\test\J0\.\org.apache.solr.handler.TestReplicationHandler$SolrInstance-1375468227367\master\collection1\data\
   [junit4]   2> 215424 T923 oasc.SolrCore.getNewIndexDir New index directory detected: old=null new=C:\Users\JenkinsSlave\workspace\Lucene-Solr-trunk-Windows\solr\build\solr-core\test\J0\.\org.apache.solr.handler.TestReplicationHandler$SolrInstance-1375468227367\master\collection1\data\index/
   [junit4]   2> 215424 T923 oasc.SolrCore.initIndex WARN [collection1] Solr index directory 'C:\Users\JenkinsSlave\workspace\Lucene-Solr-trunk-Windows\solr\build\solr-core\test\J0\.\org.apache.solr.handler.TestReplicationHandler$SolrInstance-1375468227367\master\collection1\data\index' doesn't exist. Creating new index...
   [junit4]   2> 215424 T923 oasc.CachingDirectoryFactory.get return new directory for C:\Users\JenkinsSlave\workspace\Lucene-Solr-trunk-Windows\solr\build\solr-core\test\J0\.\org.apache.solr.handler.TestReplicationHandler$SolrInstance-1375468227367\master\collection1\data\index
   [junit4]   2> 215426 T923 oasc.SolrDeletionPolicy.onCommit SolrDeletionPolicy.onCommit: commits: num=1
   [junit4]   2> commit{dir=MockDirWrapper(org.apache.lucene.store.RAMDirectory@6f20b0c0 lockFactory=org.apache.lucene.store.SingleInstanceLockFactory@56c922c3),segFN=segments_1,generation=1}
   [junit4]   2> 215426 T923 oasc.SolrDeletionPolicy.updateCommits newest commit generation = 1
   [junit4]   2> 215427 T923 oasc.RequestHandlers.initHandlersFromConfig created standard: solr.StandardRequestHandler
   [junit4]   2> 215428 T923 oasc.RequestHandlers.initHandlersFromConfig created /replication: solr.ReplicationHandler
   [junit4]   2> 215428 T923 oasc.RequestHandlers.initHandlersFromConfig created defaults: solr.StandardRequestHandler
   [junit4]   2> 215428 T923 oasc.RequestHandlers.initHandlersFromConfig adding lazy requestHandler: solr.StandardRequestHandler
   [junit4]   2> 215428 T923 oasc.RequestHandlers.initHandlersFromConfig created lazy: solr.StandardRequestHandler
   [junit4]   2> 215429 T923 oasc.RequestHandlers.initHandlersFromConfig created /update: solr.UpdateRequestHandler
   [junit4]   2> 215434 T923 oashl.XMLLoader.init xsltCacheLifetimeSeconds=60
   [junit4]   2> 215435 T923 oass.SolrIndexSearcher.<init> Opening Searcher@6cd54256 main
   [junit4]   2> 215435 T923 oasu.CommitTracker.<init> Hard AutoCommit: disabled
   [junit4]   2> 215436 T923 oasu.CommitTracker.<init> Soft AutoCommit: disabled
   [junit4]   2> 215436 T923 oash.ReplicationHandler.inform Replication enabled for following config files: schema.xml,xslt/dummy.xsl
   [junit4]   2> 215436 T923 oash.ReplicationHandler.inform Commits will be reserved for  10000
   [junit4]   2> 215436 T923 oasc.CoreContainer.registerCore registering core: collection1
   [junit4]   2> 215436 T924 oasc.SolrCore.registerSearcher [collection1] Registered new searcher Searcher@6cd54256 main{StandardDirectoryReader(segments_1:1)}
   [junit4]   2> 215437 T847 oass.SolrDispatchFilter.init user.dir=C:\Users\JenkinsSlave\workspace\Lucene-Solr-trunk-Windows\solr\build\solr-core\test\J0
   [junit4]   2> 215437 T847 oass.SolrDispatchFilter.init SolrDispatchFilter.init() done
   [junit4]   2> 215437 T847 oascsi.HttpClientUtil.createClient Creating new http client, config:maxConnections=128&maxConnectionsPerHost=32&followRedirects=false
   [junit4]   2> 215453 T847 oejs.Server.doStart jetty-8.1.10.v20130312
   [junit4]   2> 215456 T847 oejs.AbstractConnector.doStart Started SelectChannelConnector@127.0.0.1:65061
   [junit4]   2> 215456 T847 oass.SolrDispatchFilter.init SolrDispatchFilter.init()
   [junit4]   2> 215457 T847 oasc.SolrResourceLoader.locateSolrHome JNDI not configured for solr (NoInitialContextEx)
   [junit4]   2> 215457 T847 oasc.SolrResourceLoader.locateSolrHome using system property solr.solr.home: .\org.apache.solr.handler.TestReplicationHandler$SolrInstance-1375468227531\slave
   [junit4]   2> 215457 T847 oasc.SolrResourceLoader.<init> new SolrResourceLoader for directory: '.\org.apache.solr.handler.TestReplicationHandler$SolrInstance-1375468227531\slave\'
   [junit4]   2> 215475 T847 oasc.ConfigSolr.fromFile Loading container configuration from C:\Users\JenkinsSlave\workspace\Lucene-Solr-trunk-Windows\solr\build\solr-core\test\J0\.\org.apache.solr.handler.TestReplicationHandler$SolrInstance-1375468227531\slave\solr.xml
   [junit4]   2> 215476 T847 oasc.ConfigSolr.fromFile C:\Users\JenkinsSlave\workspace\Lucene-Solr-trunk-Windows\solr\build\solr-core\test\J0\.\org.apache.solr.handler.TestReplicationHandler$SolrInstance-1375468227531\slave\solr.xml does not exist, using default configuration
   [junit4]   2> 215484 T847 oasc.CoreContainer.<init> New CoreContainer 431867072
   [junit4]   2> 215486 T847 oasc.CoreContainer.load Loading cores into CoreContainer [instanceDir=.\org.apache.solr.handler.TestReplicationHandler$SolrInstance-1375468227531\slave\]
   [junit4]   2> 215486 T847 oashc.HttpShardHandlerFactory.getParameter Setting socketTimeout to: 0
   [junit4]   2> 215486 T847 oashc.HttpShardHandlerFactory.getParameter Setting urlScheme to: http://
   [junit4]   2> 215487 T847 oashc.HttpShardHandlerFactory.getParameter Setting connTimeout to: 0
   [junit4]   2> 215487 T847 oashc.HttpShardHandlerFactory.getParameter Setting maxConnectionsPerHost to: 20
   [junit4]   2> 215487 T847 oashc.HttpShardHandlerFactory.getParameter Setting corePoolSize to: 0
   [junit4]   2> 215489 T847 oashc.HttpShardHandlerFactory.getParameter Setting maximumPoolSize to: 2147483647
   [junit4]   2> 215489 T847 oashc.HttpShardHandlerFactory.getParameter Setting maxThreadIdleTime to: 5
   [junit4]   2> 215490 T847 oashc.HttpShardHandlerFactory.getParameter Setting sizeOfQueue to: -1
   [junit4]   2> 215490 T847 oashc.HttpShardHandlerFactory.getParameter Setting fairnessPolicy to: false
   [junit4]   2> 215490 T847 oascsi.HttpClientUtil.createClient Creating new http client, config:maxConnectionsPerHost=20&maxConnections=10000&socketTimeout=0&connTimeout=0&retry=false
   [junit4]   2> 215499 T935 oasc.CoreContainer.create Creating SolrCore 'collection1' using instanceDir: .\org.apache.solr.handler.TestReplicationHandler$SolrInstance-1375468227531\slave\collection1
   [junit4]   2> 215500 T935 oasc.SolrResourceLoader.<init> new SolrResourceLoader for directory: '.\org.apache.solr.handler.TestReplicationHandler$SolrInstance-1375468227531\slave\collection1\'
   [junit4]   2> 215526 T935 oasc.SolrConfig.<init> Using Lucene MatchVersion: LUCENE_50
   [junit4]   2> 215541 T935 oasc.SolrConfig.<init> Loaded SolrConfig: solrconfig.xml
   [junit4]   2> 215541 T935 oass.IndexSchema.readSchema Reading Solr Schema from schema.xml
   [junit4]   2> 215546 T935 oass.IndexSchema.readSchema [collection1] Schema name=test
   [junit4]   2> 215548 T935 oass.IndexSchema.readSchema unique key field: id
   [junit4]   2> 215549 T935 oasc.SolrCore.initDirectoryFactory org.apache.solr.core.MockDirectoryFactory
   [junit4]   2> 215549 T935 oasc.SolrCore.<init> [collection1] Opening new SolrCore at .\org.apache.solr.handler.TestReplicationHandler$SolrInstance-1375468227531\slave\collection1\, dataDir=C:\Users\JenkinsSlave\workspace\Lucene-Solr-trunk-Windows\solr\build\solr-core\test\J0\.\org.apache.solr.handler.TestReplicationHandler$SolrInstance-1375468227531\slave\collection1\data\
   [junit4]   2> 215549 T935 oasc.SolrCore.<init> JMX monitoring not detected for core: collection1
   [junit4]   2> 215550 T935 oasc.CachingDirectoryFactory.get return new directory for C:\Users\JenkinsSlave\workspace\Lucene-Solr-trunk-Windows\solr\build\solr-core\test\J0\.\org.apache.solr.handler.TestReplicationHandler$SolrInstance-1375468227531\slave\collection1\data\
   [junit4]   2> 215550 T935 oasc.SolrCore.getNewIndexDir New index directory detected: old=null new=C:\Users\JenkinsSlave\workspace\Lucene-Solr-trunk-Windows\solr\build\solr-core\test\J0\.\org.apache.solr.handler.TestReplicationHandler$SolrInstance-1375468227531\slave\collection1\data\index/
   [junit4]   2> 215550 T935 oasc.SolrCore.initIndex WARN [collection1] Solr index directory 'C:\Users\JenkinsSlave\workspace\Lucene-Solr-trunk-Windows\solr\build\solr-core\test\J0\.\org.apache.solr.handler.TestReplicationHandler$SolrInstance-1375468227531\slave\collection1\data\index' doesn't exist. Creating new index...
   [junit4]   2> 215551 T935 oasc.CachingDirectoryFactory.get return new directory for C:\Users\JenkinsSlave\workspace\Lucene-Solr-trunk-Windows\solr\build\solr-core\test\J0\.\org.apache.solr.handler.TestReplicationHandler$SolrInstance-1375468227531\slave\collection1\data\index
   [junit4]   2> 215552 T935 oasc.SolrDeletionPolicy.onCommit SolrDeletionPolicy.onCommit: commits: num=1
   [junit4]   2> commit{dir=MockDirWrapper(org.apache.lucene.store.RAMDirectory@69ff4599 lockFactory=org.apache.lucene.store.SingleInstanceLockFactory@2d91d80c),segFN=segments_1,generation=1}
   [junit4]   2> 215552 T935 oasc.SolrDeletionPolicy.updateCommits newest commit generation = 1
   [junit4]   2> 215554 T935 oasc.RequestHandlers.initHandlersFromConfig created standard: solr.StandardRequestHandler
   [junit4]   2> 215555 T935 oasc.RequestHandlers.initHandlersFromConfig created defaults: solr.StandardRequestHandler
   [junit4]   2> 215555 T935 oasc.RequestHandlers.initHandlersFromConfig adding lazy requestHandler: solr.StandardRequestHandler
   [junit4]   2> 215555 T935 oasc.RequestHandlers.initHandlersFromConfig created lazy: solr.StandardRequestHandler
   [junit4]   2> 215555 T935 oasc.RequestHandlers.initHandlersFromConfig created /update: solr.UpdateRequestHandler
   [junit4]   2> 215556 T935 oasc.RequestHandlers.initHandlersFromConfig created /replication: solr.ReplicationHandler
   [junit4]   2> 215558 T935 oashl.XMLLoader.init xsltCacheLifetimeSeconds=60
   [junit4]   2> 215559 T935 oass.SolrIndexSearcher.<init> Opening Searcher@71ce984 main
   [junit4]   2> 215560 T935 oasu.CommitTracker.<init> Hard AutoCommit: disabled
   [junit4]   2> 215560 T935 oasu.CommitTracker.<init> Soft AutoCommit: disabled
   [junit4]   2> 215561 T935 oash.SnapPuller.startExecutorService Poll Scheduled at an interval of 1000ms
   [junit4]   2> 215561 T935 oasc.CoreContainer.registerCore registering core: collection1
   [junit4]   2> 215561 T936 oasc.SolrCore.registerSearcher [collection1] Registered new searcher Searcher@71ce984 main{StandardDirectoryReader(segments_1:1)}
   [junit4]   2> 215562 T847 oass.SolrDispatchFilter.init user.dir=C:\Users\JenkinsSlave\workspace\Lucene-Solr-trunk-Windows\solr\build\solr-core\test\J0
   [junit4]   2> 215562 T847 oass.SolrDispatchFilter.init SolrDispatchFilter.init() done
   [junit4]   2> 215562 T847 oascsi.HttpClientUtil.createClient Creating new http client, config:maxConnections=128&maxConnectionsPerHost=32&followRedirects=false
   [junit4]   2> ASYNC  NEW_CORE C265 name=collection1 org.apache.solr.core.SolrCore@56865db7
   [junit4]   2> 215570 T917 C265 oasc.SolrCore.execute [collection1] webapp=/solr path=/select params={sort=id+desc&q=*:*&wt=javabin&version=2} hits=0 status=0 QTime=0
   [junit4]   2> 215575 T918 C265 oasc.SolrCore.execute [collection1] webapp=/solr path=/replication params={command=details&_trace=getDetails&wt=javabin&qt=/replication&version=2} status=0 QTime=1
   [junit4]   2> 215585 T919 C265 oasc.SolrCore.execute [collection1] webapp=/solr path=/replication params={slave=false&command=details&wt=javabin&qt=/replication&version=2} status=0 QTime=1
   [junit4]   2> ASYNC  NEW_CORE C266 name=collection1 org.apache.solr.core.SolrCore@312dc16b
   [junit4]   2> 215586 T933 C266 oasc.SolrCore.execute [collection1] webapp=/solr path=/replication params={command=details&_trace=getDetails&wt=javabin&qt=/replication&version=2} status=0 QTime=7
   [junit4]   2> 215592 T920 C265 oasc.SolrDeletionPolicy.onInit SolrDeletionPolicy.onInit: commits: num=1
   [junit4]   2> commit{dir=MockDirWrapper(org.apache.lucene.store.RAMDirectory@6f20b0c0 lockFactory=org.apache.lucene.store.SingleInstanceLockFactory@56c922c3),segFN=segments_1,generation=1}
   [junit4]   2> 215595 T920 C265 oasc.SolrDeletionPolicy.updateCommits newest commit generation = 1
   [junit4]   2> 215596 T920 C265 oasup.LogUpdateProcessor.finish [collection1] webapp=/solr path=/update params={wt=javabin&version=2} {add=[0]} 0 5
   [junit4]   2> 215601 T921 C265 oasu.DirectUpdateHandler2.commit start commit{,optimize=false,openSearcher=true,waitSearcher=true,expungeDeletes=false,softCommit=false,prepareCommit=false}
   [junit4]   2> 215604 T921 C265 oasc.SolrDeletionPolicy.onCommit SolrDeletionPolicy.onCommit: commits: num=2
   [junit4]   2> commit{dir=MockDirWrapper(org.apache.lucene.store.RAMDirectory@6f20b0c0 lockFactory=org.apache.lucene.store.SingleInstanceLockFactory@56c922c3),segFN=segments_1,generation=1}
   [junit4]   2> commit{dir=MockDirWrapper(org.apache.lucene.store.RAMDirectory@6f20b0c0 lockFactory=org.apache.lucene.store.SingleInstanceLockFactory@56c922c3),segFN=segments_2,generation=2}
   [junit4]   2> 215604 T921 C265 oasc.SolrDeletionPolicy.updateCommits newest commit generation = 2
   [junit4]   2> 215605 T921 C265 oass.SolrIndexSearcher.<init> Opening Searcher@47114e8c main
   [junit4]   2> 215606 T921 C265 oasu.DirectUpdateHandler2.commit end_commit_flush
   [junit4]   2> 215607 T924 oasc.SolrCore.registerSearcher [collection1] Registered new searcher Searcher@47114e8c main{StandardDirectoryReader(segments_2:3:nrt _0(5.0):C1)}
   [junit4]   2> 215607 T921 C265 oasup.LogUpdateProcessor.finish [collection1] webapp=/solr path=/update params={waitSearcher=true&commit=true&wt=javabin&version=2&softCommit=false} {commit=} 0 7
   [junit4]   2> 215611 T939 oash.SnapPuller.<init> WARN 'masterUrl' must be specified without the /replication suffix
   [junit4]   2> 215611 T939 oash.SnapPuller.<init>  No value set for 'pollInterval'. Timer Task not started.
   [junit4]   2> 215614 T922 C265 oasc.SolrCore.execute [collection1] webapp=/solr path=/replication params={command=indexversion&qt=/replication&wt=javabin&version=2} status=0 QTime=1
   [junit4]   2> 215614 T939 oash.SnapPuller.fetchLatestIndex Master's generation: 2
   [junit4]   2> 215615 T939 oash.SnapPuller.fetchLatestIndex Slave's generation: 1
   [junit4]   2> 215615 T939 oash.SnapPuller.fetchLatestIndex Starting replication process
   [junit4]   2> 215626 T917 C265 oasc.SolrCore.execute [collection1] webapp=/solr path=/replication params={command=filelist&qt=/replication&wt=javabin&generation=2&version=2} status=0 QTime=9
   [junit4]   2> 215628 T939 oash.SnapPuller.fetchLatestIndex Number of files in latest index in master: 10
   [junit4]   2> 215629 T939 oasc.CachingDirectoryFactory.get return new directory for C:\Users\JenkinsSlave\workspace\Lucene-Solr-trunk-Windows\solr\build\solr-core\test\J0\.\org.apache.solr.handler.TestReplicationHandler$SolrInstance-1375468227531\slave\collection1\data\index.20130803013027716
   [junit4]   2> 215629 T939 oash.SnapPuller.fetchLatestIndex Starting download to MockDirWrapper(org.apache.lucene.store.RAMDirectory@816749b lockFactory=org.apache.lucene.store.SingleInstanceLockFactory@4321e5b6) fullCopy=false
   [junit4]   2> 215633 T918 C265 oasc.SolrCore.execute [collection1] webapp=/solr path=/replication params={file=_0.fnm&command=filecontent&checksum=true&wt=filestream&qt=/replication&generation=2} status=0 QTime=1
   [junit4]   2> ASYNC  NEW_CORE C267 name=collection1 org.apache.solr.core.SolrCore@56865db7
   [junit4]   2> 215722 T919 C267 oasc.SolrCore.execute [collection1] webapp=/solr path=/replication params={file=_0_Lucene41_0.doc&command=filecontent&checksum=true&wt=filestream&qt=/replication&generation=2} status=0 QTime=1
   [junit4]   2> ASYNC  NEW_CORE C268 name=collection1 org.apache.solr.core.SolrCore@56865db7
   [junit4]   2> 215814 T920 C268 oasc.SolrCore.execute [collection1] webapp=/solr path=/replication params={file=_0.nvd&command=filecontent&checksum=true&wt=filestream&qt=/replication&generation=2} status=0 QTime=1
   [junit4]   2> ASYNC  NEW_CORE C269 name=collection1 org.apache.solr.core.SolrCore@56865db7
   [junit4]   2> 215999 T922 C269 oasc.SolrCore.execute [collection1] webapp=/solr path=/replication params={file=segments_2&command=filecontent&checksum=true&wt=filestream&qt=/replication&generation=2} status=0 QTime=0
   [junit4]   2> 216003 T922 C269 oasc.SolrCore.execute [collection1] webapp=/solr path=/replication params={file=_0.fdx&command=filecontent&checksum=true&wt=filestream&qt=/replication&generation=2} status=0 QTime=1
   [junit4]   2> 216012 T918 C269 oasc.SolrCore.execute [collection1] webapp=/solr path=/replication params={file=_0.nvm&command=filecontent&checksum=true&wt=filestream&qt=/replication&generation=2} status=0 QTime=0
   [junit4]   2> ASYNC  NEW_CORE C270 name=collection1 org.apache.solr.core.SolrCore@56865db7
   [junit4]   2> 216070 T919 C270 oasc.SolrCore.execute [collection1] webapp=/solr path=/replication params={file=_0.si&command=filecontent&checksum=true&wt=filestream&qt=/replication&generation=2} status=0 QTime=0
   [junit4]   2> 216077 T920 C270 oasc.SolrCore.execute [collection1] webapp=/solr path=/replication params={file=_0_Lucene41_0.tim&command=filecontent&checksum=true&wt=filestream&qt=/replication&generation=2} status=0 QTime=0
   [junit4]   2> ASYNC  NEW_CORE C271 name=collection1 org.apache.solr.core.SolrCore@56865db7
   [junit4]   2> 216170 T921 C271 oasc.SolrCore.execute [collection1] webapp=/solr path=/replication params={file=_0_Lucene41_0.tip&command=filecontent&checksum=true&wt=filestream&qt=/replication&generation=2} status=0 QTime=1
   [junit4]   2> 216175 T917 C271 oasc.SolrCore.execute [collection1] webapp=/solr path=/replication params={file=_0.fdt&command=filecontent&checksum=true&wt=filestream&qt=/replication&generation=2} status=0 QTime=0
   [junit4]   2> 216186 T939 oash.SnapPuller.fetchLatestIndex Total time taken for download : 0 secs
   [junit4]   2> 216210 T939 oasu.DefaultSolrCoreState.closeIndexWriter Closing IndexWriter...
   [junit4]   2> 216210 T939 oasu.DefaultSolrCoreState.closeIndexWriter Waiting until IndexWriter is unused... core=collection1
   [junit4]   2> 216212 T939 oasu.DefaultSolrCoreState.openIndexWriter Creating new IndexWriter...
   [junit4]   2> 216219 T939 oasc.SolrDeletionPolicy.onInit SolrDeletionPolicy.onInit: commits: num=2
   [junit4]   2> commit{dir=MockDirWrapper(org.apache.lucene.store.RAMDirectory@69ff4599 lockFactory=org.apache.lucene.store.SingleInstanceLockFactory@2d91d80c),segFN=segments_1,generation=1}
   [junit4]   2> commit{dir=MockDirWrapper(org.apache.lucene.store.RAMDirectory@69ff4599 lockFactory=org.apache.lucene.store.SingleInstanceLockFactory@2d91d80c),segFN=segments_2,generation=2}
   [junit4]   2> 216219 T939 oasc.SolrDeletionPolicy.updateCommits newest commit generation = 2
   [junit4]   2> 216220 T939 oasu.DefaultSolrCoreState.openIndexWriter New IndexWriter is ready to be used.
   [junit4]   2> 216221 T939 oass.SolrIndexSearcher.<init> Opening Searcher@5314739f main
   [junit4]   2> 216221 T936 oasc.SolrCore.registerSearcher [collection1] Registered new searcher Searcher@5314739f main{StandardDirectoryReader(segments_2:3:nrt _0(5.0):C1)}
   [junit4]   2> 216222 T939 oasc.CachingDirectoryFactory.closeCacheValue looking to close C:\Users\JenkinsSlave\workspace\Lucene-Solr-trunk-Windows\solr\build\solr-core\test\J0\.\org.apache.solr.handler.TestReplicationHandler$SolrInstance-1375468227531\slave\collection1\data\index.20130803013027716 [CachedDir<<refCount=0;path=C:\Users\JenkinsSlave\workspace\Lucene-Solr-trunk-Windows\solr\build\solr-core\test\J0\.\org.apache.solr.handler.TestReplicationHandler$SolrInstance-1375468227531\slave\collection1\data\index.20130803013027716;done=true>>]
   [junit4]   2> 216222 T939 oasc.CachingDirectoryFactory.close Closing directory: C:\Users\JenkinsSlave\workspace\Lucene-Solr-trunk-Windows\solr\build\solr-core\test\J0\.\org.apache.solr.handler.TestReplicationHandler$SolrInstance-1375468227531\slave\collection1\data\index.20130803013027716
   [junit4]   2> ASYNC  NEW_CORE C272 name=collection1 org.apache.solr.core.SolrCore@312dc16b
   [junit4]   2> 216222 T931 C272 oasc.SolrCore.execute [collection1] webapp=/solr path=/replication params={masterUrl=http://127.0.0.1:65058/solr/replication&command=fetchindex&wait=true} status=0 QTime=612
   [junit4]   2> ASYNC  NEW_CORE C273 name=collection1 org.apache.solr.core.SolrCore@56865db7
   [junit4]   2> 216261 T922 C273 oasc.SolrCore.execute [collection1] webapp=/solr path=/replication params={slave=false&command=details&wt=javabin&qt=/replication&version=2} status=0 QTime=1
   [junit4]   2> 216263 T927 C272 oasc.SolrCore.execute [collection1] webapp=/solr path=/replication params={command=details&_trace=getDetails&wt=javabin&qt=/replication&version=2} status=0 QTime=26
   [junit4]   2> 216274 T919 C273 oasup.LogUpdateProcessor.finish [collection1] webapp=/solr path=/update params={wt=javabin&version=2} {add=[1]} 0 1
   [junit4]   2> 216277 T920 C273 oasu.DirectUpdateHandler2.commit start commit{,optimize=false,openSearcher=true,waitSearcher=true,expungeDeletes=false,softCommit=false,prepareCommit=false}
   [junit4]   2> 216283 T920 C273 oasc.SolrDeletionPolicy.onCommit SolrDeletionPolicy.onCommit: commits: num=2
   [junit4]   2> commit{dir=MockDirWrapper(org.apache.lucene.store.RAMDirectory@6f20b0c0 lockFactory=org.apache.lucene.store.SingleInstanceLockFactory@56c922c3),segFN=segments_2,generation=2}
   [junit4]   2> commit{dir=MockDirWrapper(org.apache.lucene.store.RAMDirectory@6f20b0c0 lockFactory=org.apache.lucene.store.SingleInstanceLockFactory@56c922c3),segFN=segments_3,generation=3}
   [junit4]   2> 216284 T920 C273 oasc.SolrDeletionPolicy.updateCommits newest commit generation = 3
   [junit4]   2> 216285 T920 C273 oass.SolrIndexSearcher.<init> Opening Searcher@4cd9d9ae main
   [junit4]   2> 216285 T920 C273 oasu.DirectUpdateHandler2.commit end_commit_flush
   [junit4]   2> 216286 T924 oasc.SolrCore.registerSearcher [collection1] Registered new searcher Searcher@4cd9d9ae main{StandardDirectoryReader(segments_3:5:nrt _0(5.0):C1 _1(5.0):C1)}
   [junit4]   2> 216286 T920 C273 oasup.LogUpdateProcessor.finish [collection1] webapp=/solr path=/update params={waitSearcher=true&commit=true&wt=javabin&version=2&softCommit=false} {commit=} 0 9
   [junit4]   2> 216289 T941 oash.SnapPuller.<init> WARN 'masterUrl' must be specified without the /replication suffix
   [junit4]   2> 216289 T941 oash.SnapPuller.<init>  No value set for 'pollInterval'. Timer Task not started.
   [junit4]   2> 216292 T921 C273 oasc.SolrCore.execute [collection1] webapp=/solr path=/replication params={command=indexversion&qt=/replication&wt=javabin&version=2} status=0 QTime=0
   [junit4]   2> 216293 T941 oash.SnapPuller.fetchLatestIndex Master's generation: 3
   [junit4]   2> 216293 T941 oash.SnapPuller.fetchLatestIndex Slave's generation: 2
   [junit4]   2> 216294 T941 oash.SnapPuller.fetchLatestIndex Starting replication process
   [junit4]   2> 216298 T917 C273 oasc.SolrCore.execute [collection1] webapp=/solr path=/replication params={command=filelist&qt=/replication&wt=javabin&generation=3&version=2} status=0 QTime=1
   [junit4]   2> 216299 T941 oash.SnapPuller.fetchLatestIndex Number of files in latest index in master: 19
   [junit4]   2> 216301 T941 oasc.CachingDirectoryFactory.get return new directory for C:\Users\JenkinsSlave\workspace\Lucene-Solr-trunk-Windows\solr\build\solr-core\test\J0\.\org.apache.solr.handler.TestReplicationHandler$SolrInstance-1375468227531\slave\collection1\data\index.20130803013028388
   [junit4]   2> 216302 T941 oash.SnapPuller.fetchLatestIndex Starting download to MockDirWrapper(org.apache.lucene.store.RAMDirectory@46e5a7d3 lockFactory=org.apache.lucene.store.SingleInstanceLockFactory@5d2572dc) fullCopy=false
   [junit4]   2> ASYNC  NEW_CORE C274 name=collection1 org.apache.solr.core.SolrCore@56865db7
   [junit4]   2> 216356 T918 C274 oasc.SolrCore.execute [collection1] webapp=/solr path=/replication params={file=_1.nvm&command=filecontent&checksum=true&wt=filestream&qt=/replication&generation=3} status=0 QTime=0
   [junit4]   2> 216376 T922 C274 oasc.SolrCore.execute [collection1] webapp=/solr path=/replication params={file=_1_Lucene41_0.doc&command=filecontent&checksum=true&wt=filestream&qt=/replication&generation=3} status=0 QTime=0
   [junit4]   2> 216378 T941 oash.SnapPuller.downloadIndexFiles Skipping download for _0.fnm because it already exists
   [junit4]   2> 216382 T919 C274 oasc.SolrCore.execute [collection1] webapp=/solr path=/replication params={file=_1_Lucene41_0.tim&command=filecontent&checksum=true&wt=filestream&qt=/replication&generation=3} status=0 QTime=1
   [junit4]   2> 216389 T920 C274 oasc.SolrCore.execute [collection1] webapp=/solr path=/replication params={file=_1.nvd&command=filecontent&checksum=true&wt=filestream&qt=/replication&generation=3} status=0 QTime=0
   [junit4]   2> 216396 T921 C274 oasc.SolrCore.execute [collection1] webapp=/solr path=/replication params={file=_1_Lucene41_0.tip&command=filecontent&checksum=true&wt=filestream&qt=/replication&generation=3} status=0 QTime=1
   [junit4]   2> 216399 T941 oash.SnapPuller.downloadIndexFiles Skipping download for _0.nvm because it already exists
   [junit4]   2> 216404 T917 C274 oasc.SolrCore.execute [collection1] webapp=/solr path=/replication params={file=_1.fnm&command=filecontent&checksum=true&wt=filestream&qt=/replication&generation=3} status=0 QTime=0
   [junit4]   2> 216408 T918 C274 oasc.SolrCore.execute [collection1] webapp=/solr path=/replication params={file=_1.fdx&command=filecontent&checksum=true&wt=filestream&qt=/replication&generation=3} status=0 QTime=0
   [junit4]   2> 216410 T941 oash.SnapPuller.downloadIndexFiles Skipping download for _0_Lucene41_0.doc because it already e

[...truncated too long message...]

eCacheValue looking to close C:\Users\JenkinsSlave\workspace\Lucene-Solr-trunk-Windows\solr\build\solr-core\test\J0\.\org.apache.solr.handler.TestReplicationHandler$SolrInstance-1375468324700\repeater\collection1\data\ [CachedDir<<refCount=0;path=C:\Users\JenkinsSlave\workspace\Lucene-Solr-trunk-Windows\solr\build\solr-core\test\J0\.\org.apache.solr.handler.TestReplicationHandler$SolrInstance-1375468324700\repeater\collection1\data\;done=false>>]
   [junit4]   2> 369099 T847 oasc.CachingDirectoryFactory.close Closing directory: C:\Users\JenkinsSlave\workspace\Lucene-Solr-trunk-Windows\solr\build\solr-core\test\J0\.\org.apache.solr.handler.TestReplicationHandler$SolrInstance-1375468324700\repeater\collection1\data\
   [junit4]   2> 369099 T847 oasc.CachingDirectoryFactory.closeCacheValue looking to close C:\Users\JenkinsSlave\workspace\Lucene-Solr-trunk-Windows\solr\build\solr-core\test\J0\.\org.apache.solr.handler.TestReplicationHandler$SolrInstance-1375468324700\repeater\collection1\data\index.20130803013300840 [CachedDir<<refCount=0;path=C:\Users\JenkinsSlave\workspace\Lucene-Solr-trunk-Windows\solr\build\solr-core\test\J0\.\org.apache.solr.handler.TestReplicationHandler$SolrInstance-1375468324700\repeater\collection1\data\index.20130803013300840;done=false>>]
   [junit4]   2> 369100 T847 oasc.CachingDirectoryFactory.close Closing directory: C:\Users\JenkinsSlave\workspace\Lucene-Solr-trunk-Windows\solr\build\solr-core\test\J0\.\org.apache.solr.handler.TestReplicationHandler$SolrInstance-1375468324700\repeater\collection1\data\index.20130803013300840
   [junit4]   2> 369102 T847 oejsh.ContextHandler.doStop stopped o.e.j.s.ServletContextHandler{/solr,null}
   [junit4]   2> 369180 T847 oas.SolrTestCaseJ4.tearDown ###Ending doTestRepeater
   [junit4]   2> 369194 T847 oasc.CoreContainer.shutdown Shutting down CoreContainer instance=301146497
   [junit4]   2> 369194 T847 oasc.SolrCore.close [collection1]  CLOSING SolrCore org.apache.solr.core.SolrCore@1a6ad013
   [junit4]   2> 369194 T847 oasu.DirectUpdateHandler2.close closing DirectUpdateHandler2{commits=2,autocommits=0,soft autocommits=0,optimizes=0,rollbacks=0,expungeDeletes=0,docsPending=0,adds=0,deletesById=0,deletesByQuery=0,errors=0,cumulative_adds=6,cumulative_deletesById=0,cumulative_deletesByQuery=0,cumulative_errors=0}
   [junit4]   2> 369195 T847 oasu.SolrCoreState.decrefSolrCoreState Closing SolrCoreState
   [junit4]   2> 369196 T847 oasu.DefaultSolrCoreState.closeIndexWriter SolrCoreState ref count has reached 0 - closing IndexWriter
   [junit4]   2> 369196 T847 oasu.DefaultSolrCoreState.closeIndexWriter closing IndexWriter with IndexWriterCloser
   [junit4]   2> 369198 T847 oasc.SolrCore.closeSearcher [collection1] Closing main searcher on request.
   [junit4]   2> 369198 T847 oasc.CachingDirectoryFactory.close Closing MockDirectoryFactory - 2 directories currently being tracked
   [junit4]   2> 369198 T847 oasc.CachingDirectoryFactory.closeCacheValue looking to close C:\Users\JenkinsSlave\workspace\Lucene-Solr-trunk-Windows\solr\build\solr-core\test\J0\.\org.apache.solr.handler.TestReplicationHandler$SolrInstance-1375468324132\master\collection1\data\index [CachedDir<<refCount=0;path=C:\Users\JenkinsSlave\workspace\Lucene-Solr-trunk-Windows\solr\build\solr-core\test\J0\.\org.apache.solr.handler.TestReplicationHandler$SolrInstance-1375468324132\master\collection1\data\index;done=false>>]
   [junit4]   2> 369198 T847 oasc.CachingDirectoryFactory.close Closing directory: C:\Users\JenkinsSlave\workspace\Lucene-Solr-trunk-Windows\solr\build\solr-core\test\J0\.\org.apache.solr.handler.TestReplicationHandler$SolrInstance-1375468324132\master\collection1\data\index
   [junit4]   2> 369199 T847 oasc.CachingDirectoryFactory.closeCacheValue looking to close C:\Users\JenkinsSlave\workspace\Lucene-Solr-trunk-Windows\solr\build\solr-core\test\J0\.\org.apache.solr.handler.TestReplicationHandler$SolrInstance-1375468324132\master\collection1\data\ [CachedDir<<refCount=0;path=C:\Users\JenkinsSlave\workspace\Lucene-Solr-trunk-Windows\solr\build\solr-core\test\J0\.\org.apache.solr.handler.TestReplicationHandler$SolrInstance-1375468324132\master\collection1\data\;done=false>>]
   [junit4]   2> 369200 T847 oasc.CachingDirectoryFactory.close Closing directory: C:\Users\JenkinsSlave\workspace\Lucene-Solr-trunk-Windows\solr\build\solr-core\test\J0\.\org.apache.solr.handler.TestReplicationHandler$SolrInstance-1375468324132\master\collection1\data\
   [junit4]   2> 369202 T847 oejsh.ContextHandler.doStop stopped o.e.j.s.ServletContextHandler{/solr,null}
   [junit4]   2> 369269 T847 oasc.CoreContainer.shutdown Shutting down CoreContainer instance=743941487
   [junit4]   2> 369271 T847 oasc.SolrCore.close [collection1]  CLOSING SolrCore org.apache.solr.core.SolrCore@1d0f05a
   [junit4]   2> 369271 T847 oasu.DirectUpdateHandler2.close closing DirectUpdateHandler2{commits=0,autocommits=0,soft autocommits=0,optimizes=0,rollbacks=0,expungeDeletes=0,docsPending=0,adds=0,deletesById=0,deletesByQuery=0,errors=0,cumulative_adds=0,cumulative_deletesById=0,cumulative_deletesByQuery=0,cumulative_errors=0}
   [junit4]   2> 369272 T847 oasu.SolrCoreState.decrefSolrCoreState Closing SolrCoreState
   [junit4]   2> 369272 T847 oasu.DefaultSolrCoreState.closeIndexWriter SolrCoreState ref count has reached 0 - closing IndexWriter
   [junit4]   2> 369273 T847 oasu.DefaultSolrCoreState.closeIndexWriter closing IndexWriter with IndexWriterCloser
   [junit4]   2> 369275 T847 oasc.SolrCore.closeSearcher [collection1] Closing main searcher on request.
   [junit4]   2> 369276 T847 oasc.CachingDirectoryFactory.close Closing MockDirectoryFactory - 2 directories currently being tracked
   [junit4]   2> 369277 T847 oasc.CachingDirectoryFactory.closeCacheValue looking to close C:\Users\JenkinsSlave\workspace\Lucene-Solr-trunk-Windows\solr\build\solr-core\test\J0\.\org.apache.solr.handler.TestReplicationHandler$SolrInstance-1375468324313\slave\collection1\data\ [CachedDir<<refCount=0;path=C:\Users\JenkinsSlave\workspace\Lucene-Solr-trunk-Windows\solr\build\solr-core\test\J0\.\org.apache.solr.handler.TestReplicationHandler$SolrInstance-1375468324313\slave\collection1\data\;done=false>>]
   [junit4]   2> 369277 T847 oasc.CachingDirectoryFactory.close Closing directory: C:\Users\JenkinsSlave\workspace\Lucene-Solr-trunk-Windows\solr\build\solr-core\test\J0\.\org.apache.solr.handler.TestReplicationHandler$SolrInstance-1375468324313\slave\collection1\data\
   [junit4]   2> 369278 T847 oasc.CachingDirectoryFactory.closeCacheValue looking to close C:\Users\JenkinsSlave\workspace\Lucene-Solr-trunk-Windows\solr\build\solr-core\test\J0\.\org.apache.solr.handler.TestReplicationHandler$SolrInstance-1375468324313\slave\collection1\data\index [CachedDir<<refCount=0;path=C:\Users\JenkinsSlave\workspace\Lucene-Solr-trunk-Windows\solr\build\solr-core\test\J0\.\org.apache.solr.handler.TestReplicationHandler$SolrInstance-1375468324313\slave\collection1\data\index;done=false>>]
   [junit4]   2> 369279 T847 oasc.CachingDirectoryFactory.close Closing directory: C:\Users\JenkinsSlave\workspace\Lucene-Solr-trunk-Windows\solr\build\solr-core\test\J0\.\org.apache.solr.handler.TestReplicationHandler$SolrInstance-1375468324313\slave\collection1\data\index
   [junit4]   2> 369280 T847 oejsh.ContextHandler.doStop stopped o.e.j.s.ServletContextHandler{/solr,null}
   [junit4]   2> 369364 T847 oas.SolrTestCaseJ4.deleteCore ###deleteCore
   [junit4]   2> NOTE: test params are: codec=Lucene42: {newname=Lucene41(blocksize=128), id=Lucene41(blocksize=128), name=Lucene41(blocksize=128)}, docValues:{}, sim=DefaultSimilarity, locale=en_MT, timezone=Asia/Omsk
   [junit4]   2> NOTE: Windows 7 6.1 amd64/Oracle Corporation 1.8.0-ea (64-bit)/cpus=2,threads=1,free=262518752,total=335544320
   [junit4]   2> NOTE: All tests run in this JVM: [DebugComponentTest, CircularListTest, TestPropInject, PeerSyncTest, TestMultiCoreConfBootstrap, DistributedQueryElevationComponentTest, SolrRequestParserTest, TestElisionMultitermQuery, TestSolrXmlPersistence, TestDynamicFieldResource, ZkCLITest, UpdateParamsTest, TestQueryTypes, DocValuesTest, TestCoreContainer, BinaryUpdateRequestHandlerTest, BadCopyFieldTest, TestInfoStreamLogging, CurrencyFieldXmlFileTest, DOMUtilTest, ChaosMonkeySafeLeaderTest, TestFieldTypeCollectionResource, EchoParamsTest, SolrPluginUtilsTest, URLClassifyProcessorTest, RAMDirectoryFactoryTest, CoreContainerCoreInitFailuresTest, PrimUtilsTest, TestSchemaNameResource, TestIndexSearcher, TestDFRSimilarityFactory, TestCollationField, TestReplicationHandler]
   [junit4] Completed in 155.44s, 14 tests, 1 failure <<< FAILURES!

[...truncated 896 lines...]
BUILD FAILED
C:\Users\JenkinsSlave\workspace\Lucene-Solr-trunk-Windows\build.xml:389: The following error occurred while executing this line:
C:\Users\JenkinsSlave\workspace\Lucene-Solr-trunk-Windows\build.xml:369: The following error occurred while executing this line:
C:\Users\JenkinsSlave\workspace\Lucene-Solr-trunk-Windows\build.xml:39: The following error occurred while executing this line:
C:\Users\JenkinsSlave\workspace\Lucene-Solr-trunk-Windows\solr\build.xml:181: The following error occurred while executing this line:
C:\Users\JenkinsSlave\workspace\Lucene-Solr-trunk-Windows\solr\common-build.xml:449: The following error occurred while executing this line:
C:\Users\JenkinsSlave\workspace\Lucene-Solr-trunk-Windows\lucene\common-build.xml:1230: The following error occurred while executing this line:
C:\Users\JenkinsSlave\workspace\Lucene-Solr-trunk-Windows\lucene\common-build.xml:873: There were test failures: 320 suites, 1347 tests, 1 failure, 42 ignored (11 assumptions)

Total time: 68 minutes 27 seconds
Build step 'Invoke Ant' marked build as failure
Description set: Java: 64bit/jdk1.8.0-ea-b99 -XX:+UseCompressedOops -XX:+UseG1GC
Archiving artifacts
Recording test results
Email was triggered for: Failure
Sending email for trigger: Failure




---------------------------------------------------------------------
To unsubscribe, e-mail: [hidden email]
For additional commands, e-mail: [hidden email]
Reply | Threaded
Open this post in threaded view
|

[JENKINS] Lucene-Solr-trunk-Windows (32bit/jdk1.7.0_25) - Build # 3103 - Still Failing!

Policeman Jenkins Server-2
Build: http://jenkins.thetaphi.de/job/Lucene-Solr-trunk-Windows/3103/
Java: 32bit/jdk1.7.0_25 -client -XX:+UseParallelGC

1 tests failed.
FAILED:  org.apache.solr.cloud.CollectionsAPIDistributedZkTest.testDistribSearch

Error Message:
Server refused connection at: http://127.0.0.1:57645

Stack Trace:
org.apache.solr.client.solrj.SolrServerException: Server refused connection at: http://127.0.0.1:57645
        at __randomizedtesting.SeedInfo.seed([A25E7672844E3346:23B8F86AF311537A]:0)
        at org.apache.solr.client.solrj.impl.HttpSolrServer.request(HttpSolrServer.java:428)
        at org.apache.solr.client.solrj.impl.HttpSolrServer.request(HttpSolrServer.java:180)
        at org.apache.solr.cloud.AbstractFullDistribZkTestBase.createCollection(AbstractFullDistribZkTestBase.java:1535)
        at org.apache.solr.cloud.CollectionsAPIDistributedZkTest.testCustomCollectionsAPI(CollectionsAPIDistributedZkTest.java:677)
        at org.apache.solr.cloud.CollectionsAPIDistributedZkTest.doTest(CollectionsAPIDistributedZkTest.java:159)
        at org.apache.solr.BaseDistributedSearchTestCase.testDistribSearch(BaseDistributedSearchTestCase.java:835)
        at sun.reflect.NativeMethodAccessorImpl.invoke0(Native Method)
        at sun.reflect.NativeMethodAccessorImpl.invoke(NativeMethodAccessorImpl.java:57)
        at sun.reflect.DelegatingMethodAccessorImpl.invoke(DelegatingMethodAccessorImpl.java:43)
        at java.lang.reflect.Method.invoke(Method.java:606)
        at com.carrotsearch.randomizedtesting.RandomizedRunner.invoke(RandomizedRunner.java:1559)
        at com.carrotsearch.randomizedtesting.RandomizedRunner.access$600(RandomizedRunner.java:79)
        at com.carrotsearch.randomizedtesting.RandomizedRunner$6.evaluate(RandomizedRunner.java:737)
        at com.carrotsearch.randomizedtesting.RandomizedRunner$7.evaluate(RandomizedRunner.java:773)
        at com.carrotsearch.randomizedtesting.RandomizedRunner$8.evaluate(RandomizedRunner.java:787)
        at com.carrotsearch.randomizedtesting.rules.SystemPropertiesRestoreRule$1.evaluate(SystemPropertiesRestoreRule.java:53)
        at org.apache.lucene.util.TestRuleSetupTeardownChained$1.evaluate(TestRuleSetupTeardownChained.java:50)
        at org.apache.lucene.util.TestRuleFieldCacheSanity$1.evaluate(TestRuleFieldCacheSanity.java:51)
        at org.apache.lucene.util.AbstractBeforeAfterRule$1.evaluate(AbstractBeforeAfterRule.java:46)
        at com.carrotsearch.randomizedtesting.rules.SystemPropertiesInvariantRule$1.evaluate(SystemPropertiesInvariantRule.java:55)
        at org.apache.lucene.util.TestRuleThreadAndTestName$1.evaluate(TestRuleThreadAndTestName.java:49)
        at org.apache.lucene.util.TestRuleIgnoreAfterMaxFailures$1.evaluate(TestRuleIgnoreAfterMaxFailures.java:70)
        at org.apache.lucene.util.TestRuleMarkFailure$1.evaluate(TestRuleMarkFailure.java:48)
        at com.carrotsearch.randomizedtesting.rules.StatementAdapter.evaluate(StatementAdapter.java:36)
        at com.carrotsearch.randomizedtesting.ThreadLeakControl$StatementRunner.run(ThreadLeakControl.java:358)
        at com.carrotsearch.randomizedtesting.ThreadLeakControl.forkTimeoutingTask(ThreadLeakControl.java:782)
        at com.carrotsearch.randomizedtesting.ThreadLeakControl$3.evaluate(ThreadLeakControl.java:442)
        at com.carrotsearch.randomizedtesting.RandomizedRunner.runSingleTest(RandomizedRunner.java:746)
        at com.carrotsearch.randomizedtesting.RandomizedRunner$3.evaluate(RandomizedRunner.java:648)
        at com.carrotsearch.randomizedtesting.RandomizedRunner$4.evaluate(RandomizedRunner.java:682)
        at com.carrotsearch.randomizedtesting.RandomizedRunner$5.evaluate(RandomizedRunner.java:693)
        at com.carrotsearch.randomizedtesting.rules.StatementAdapter.evaluate(StatementAdapter.java:36)
        at com.carrotsearch.randomizedtesting.rules.SystemPropertiesRestoreRule$1.evaluate(SystemPropertiesRestoreRule.java:53)
        at org.apache.lucene.util.AbstractBeforeAfterRule$1.evaluate(AbstractBeforeAfterRule.java:46)
        at org.apache.lucene.util.TestRuleStoreClassName$1.evaluate(TestRuleStoreClassName.java:42)
        at com.carrotsearch.randomizedtesting.rules.SystemPropertiesInvariantRule$1.evaluate(SystemPropertiesInvariantRule.java:55)
        at com.carrotsearch.randomizedtesting.rules.NoShadowingOrOverridesOnMethodsRule$1.evaluate(NoShadowingOrOverridesOnMethodsRule.java:39)
        at com.carrotsearch.randomizedtesting.rules.NoShadowingOrOverridesOnMethodsRule$1.evaluate(NoShadowingOrOverridesOnMethodsRule.java:39)
        at com.carrotsearch.randomizedtesting.rules.StatementAdapter.evaluate(StatementAdapter.java:36)
        at org.apache.lucene.util.TestRuleAssertionsRequired$1.evaluate(TestRuleAssertionsRequired.java:43)
        at org.apache.lucene.util.TestRuleMarkFailure$1.evaluate(TestRuleMarkFailure.java:48)
        at org.apache.lucene.util.TestRuleIgnoreAfterMaxFailures$1.evaluate(TestRuleIgnoreAfterMaxFailures.java:70)
        at org.apache.lucene.util.TestRuleIgnoreTestSuites$1.evaluate(TestRuleIgnoreTestSuites.java:55)
        at com.carrotsearch.randomizedtesting.rules.StatementAdapter.evaluate(StatementAdapter.java:36)
        at com.carrotsearch.randomizedtesting.ThreadLeakControl$StatementRunner.run(ThreadLeakControl.java:358)
        at java.lang.Thread.run(Thread.java:724)
Caused by: org.apache.http.conn.HttpHostConnectException: Connection to http://127.0.0.1:57645 refused
        at org.apache.http.impl.conn.DefaultClientConnectionOperator.openConnection(DefaultClientConnectionOperator.java:190)
        at org.apache.http.impl.conn.ManagedClientConnectionImpl.open(ManagedClientConnectionImpl.java:294)
        at org.apache.http.impl.client.DefaultRequestDirector.tryConnect(DefaultRequestDirector.java:645)
        at org.apache.http.impl.client.DefaultRequestDirector.execute(DefaultRequestDirector.java:480)
        at org.apache.http.impl.client.AbstractHttpClient.execute(AbstractHttpClient.java:906)
        at org.apache.http.impl.client.AbstractHttpClient.execute(AbstractHttpClient.java:805)
        at org.apache.http.impl.client.AbstractHttpClient.execute(AbstractHttpClient.java:784)
        at org.apache.solr.client.solrj.impl.HttpSolrServer.request(HttpSolrServer.java:365)
        ... 45 more
Caused by: java.net.ConnectException: Connection refused: connect
        at java.net.DualStackPlainSocketImpl.waitForConnect(Native Method)
        at java.net.DualStackPlainSocketImpl.socketConnect(DualStackPlainSocketImpl.java:85)
        at java.net.AbstractPlainSocketImpl.doConnect(AbstractPlainSocketImpl.java:339)
        at java.net.AbstractPlainSocketImpl.connectToAddress(AbstractPlainSocketImpl.java:200)
        at java.net.AbstractPlainSocketImpl.connect(AbstractPlainSocketImpl.java:182)
        at java.net.PlainSocketImpl.connect(PlainSocketImpl.java:172)
        at java.net.SocksSocketImpl.connect(SocksSocketImpl.java:392)
        at java.net.Socket.connect(Socket.java:579)
        at org.apache.http.conn.scheme.PlainSocketFactory.connectSocket(PlainSocketFactory.java:127)
        at org.apache.http.impl.conn.DefaultClientConnectionOperator.openConnection(DefaultClientConnectionOperator.java:180)
        ... 52 more




Build Log:
[...truncated 9730 lines...]
   [junit4] Suite: org.apache.solr.cloud.CollectionsAPIDistributedZkTest
   [junit4]   2> 2004427 T3957 oas.BaseDistributedSearchTestCase.initHostContext Setting hostContext system property: /
   [junit4]   2> 2004431 T3957 oas.SolrTestCaseJ4.setUp ###Starting testDistribSearch
   [junit4]   2> Creating dataDir: C:\Users\JenkinsSlave\workspace\Lucene-Solr-trunk-Windows\solr\build\solr-core\test\J0\.\solrtest-CollectionsAPIDistributedZkTest-1375478320196
   [junit4]   2> 2004432 T3957 oasc.ZkTestServer.run STARTING ZK TEST SERVER
   [junit4]   2> 2004434 T3958 oasc.ZkTestServer$ZKServerMain.runFromConfig Starting server
   [junit4]   2> 2004514 T3957 oasc.ZkTestServer.run start zk server on port:57617
   [junit4]   2> 2004516 T3957 oascc.ConnectionManager.waitForConnected Waiting for client to connect to ZooKeeper
   [junit4]   2> 2004522 T3964 oascc.ConnectionManager.process Watcher org.apache.solr.common.cloud.ConnectionManager@11fae2d name:ZooKeeperConnection Watcher:127.0.0.1:57617 got event WatchedEvent state:SyncConnected type:None path:null path:null type:None
   [junit4]   2> 2004523 T3957 oascc.ConnectionManager.waitForConnected Client is connected to ZooKeeper
   [junit4]   2> 2004523 T3957 oascc.SolrZkClient.makePath makePath: /solr
   [junit4]   2> 2004530 T3957 oascc.ConnectionManager.waitForConnected Waiting for client to connect to ZooKeeper
   [junit4]   2> 2004532 T3966 oascc.ConnectionManager.process Watcher org.apache.solr.common.cloud.ConnectionManager@19fec2a name:ZooKeeperConnection Watcher:127.0.0.1:57617/solr got event WatchedEvent state:SyncConnected type:None path:null path:null type:None
   [junit4]   2> 2004533 T3957 oascc.ConnectionManager.waitForConnected Client is connected to ZooKeeper
   [junit4]   2> 2004533 T3957 oascc.SolrZkClient.makePath makePath: /collections/collection1
   [junit4]   2> 2004538 T3957 oascc.SolrZkClient.makePath makePath: /collections/collection1/shards
   [junit4]   2> 2004542 T3957 oascc.SolrZkClient.makePath makePath: /collections/control_collection
   [junit4]   2> 2004546 T3957 oascc.SolrZkClient.makePath makePath: /collections/control_collection/shards
   [junit4]   2> 2004550 T3957 oasc.AbstractZkTestCase.putConfig put C:\Users\JenkinsSlave\workspace\Lucene-Solr-trunk-Windows\solr\build\solr-core\test-files\solr\collection1\conf\solrconfig-tlog.xml to /configs/conf1/solrconfig.xml
   [junit4]   2> 2004551 T3957 oascc.SolrZkClient.makePath makePath: /configs/conf1/solrconfig.xml
   [junit4]   2> 2004558 T3957 oasc.AbstractZkTestCase.putConfig put C:\Users\JenkinsSlave\workspace\Lucene-Solr-trunk-Windows\solr\build\solr-core\test-files\solr\collection1\conf\schema.xml to /configs/conf1/schema.xml
   [junit4]   2> 2004558 T3957 oascc.SolrZkClient.makePath makePath: /configs/conf1/schema.xml
   [junit4]   2> 2004563 T3957 oasc.AbstractZkTestCase.putConfig put C:\Users\JenkinsSlave\workspace\Lucene-Solr-trunk-Windows\solr\build\solr-core\test-files\solr\collection1\conf\stopwords.txt to /configs/conf1/stopwords.txt
   [junit4]   2> 2004563 T3957 oascc.SolrZkClient.makePath makePath: /configs/conf1/stopwords.txt
   [junit4]   2> 2004568 T3957 oasc.AbstractZkTestCase.putConfig put C:\Users\JenkinsSlave\workspace\Lucene-Solr-trunk-Windows\solr\build\solr-core\test-files\solr\collection1\conf\protwords.txt to /configs/conf1/protwords.txt
   [junit4]   2> 2004568 T3957 oascc.SolrZkClient.makePath makePath: /configs/conf1/protwords.txt
   [junit4]   2> 2004572 T3957 oasc.AbstractZkTestCase.putConfig put C:\Users\JenkinsSlave\workspace\Lucene-Solr-trunk-Windows\solr\build\solr-core\test-files\solr\collection1\conf\currency.xml to /configs/conf1/currency.xml
   [junit4]   2> 2004572 T3957 oascc.SolrZkClient.makePath makePath: /configs/conf1/currency.xml
   [junit4]   2> 2004576 T3957 oasc.AbstractZkTestCase.putConfig put C:\Users\JenkinsSlave\workspace\Lucene-Solr-trunk-Windows\solr\build\solr-core\test-files\solr\collection1\conf\open-exchange-rates.json to /configs/conf1/open-exchange-rates.json
   [junit4]   2> 2004576 T3957 oascc.SolrZkClient.makePath makePath: /configs/conf1/open-exchange-rates.json
   [junit4]   2> 2004579 T3957 oasc.AbstractZkTestCase.putConfig put C:\Users\JenkinsSlave\workspace\Lucene-Solr-trunk-Windows\solr\build\solr-core\test-files\solr\collection1\conf\mapping-ISOLatin1Accent.txt to /configs/conf1/mapping-ISOLatin1Accent.txt
   [junit4]   2> 2004580 T3957 oascc.SolrZkClient.makePath makePath: /configs/conf1/mapping-ISOLatin1Accent.txt
   [junit4]   2> 2004583 T3957 oasc.AbstractZkTestCase.putConfig put C:\Users\JenkinsSlave\workspace\Lucene-Solr-trunk-Windows\solr\build\solr-core\test-files\solr\collection1\conf\old_synonyms.txt to /configs/conf1/old_synonyms.txt
   [junit4]   2> 2004583 T3957 oascc.SolrZkClient.makePath makePath: /configs/conf1/old_synonyms.txt
   [junit4]   2> 2004587 T3957 oasc.AbstractZkTestCase.putConfig put C:\Users\JenkinsSlave\workspace\Lucene-Solr-trunk-Windows\solr\build\solr-core\test-files\solr\collection1\conf\synonyms.txt to /configs/conf1/synonyms.txt
   [junit4]   2> 2004587 T3957 oascc.SolrZkClient.makePath makePath: /configs/conf1/synonyms.txt
   [junit4]   2> 2004977 T3957 oejs.Server.doStart jetty-8.1.10.v20130312
   [junit4]   2> 2004981 T3957 oejs.AbstractConnector.doStart Started SelectChannelConnector@127.0.0.1:57624
   [junit4]   2> 2004982 T3957 oass.SolrDispatchFilter.init SolrDispatchFilter.init()
   [junit4]   2> 2004982 T3957 oasc.SolrResourceLoader.locateSolrHome JNDI not configured for solr (NoInitialContextEx)
   [junit4]   2> 2004983 T3957 oasc.SolrResourceLoader.locateSolrHome using system property solr.solr.home: C:\Users\JenkinsSlave\workspace\Lucene-Solr-trunk-Windows\solr\build\solr-core\test\J0\.\org.apache.solr.cloud.CollectionsAPIDistributedZkTest-controljetty-1375478320356
   [junit4]   2> 2004983 T3957 oasc.SolrResourceLoader.<init> new SolrResourceLoader for directory: 'C:\Users\JenkinsSlave\workspace\Lucene-Solr-trunk-Windows\solr\build\solr-core\test\J0\.\org.apache.solr.cloud.CollectionsAPIDistributedZkTest-controljetty-1375478320356\'
   [junit4]   2> 2005008 T3957 oasc.ConfigSolr.fromFile Loading container configuration from C:\Users\JenkinsSlave\workspace\Lucene-Solr-trunk-Windows\solr\build\solr-core\test\J0\.\org.apache.solr.cloud.CollectionsAPIDistributedZkTest-controljetty-1375478320356\solr.xml
   [junit4]   2> 2005077 T3957 oasc.ConfigSolrXml.<init> Config-defined core root directory:
   [junit4]   2> 2005077 T3957 oasc.CoreContainer.<init> New CoreContainer 25743380
   [junit4]   2> 2005077 T3957 oasc.CoreContainer.load Loading cores into CoreContainer [instanceDir=C:\Users\JenkinsSlave\workspace\Lucene-Solr-trunk-Windows\solr\build\solr-core\test\J0\.\org.apache.solr.cloud.CollectionsAPIDistributedZkTest-controljetty-1375478320356\]
   [junit4]   2> 2005079 T3957 oashc.HttpShardHandlerFactory.getParameter Setting socketTimeout to: 120000
   [junit4]   2> 2005079 T3957 oashc.HttpShardHandlerFactory.getParameter Setting urlScheme to: http://
   [junit4]   2> 2005079 T3957 oashc.HttpShardHandlerFactory.getParameter Setting connTimeout to: 15000
   [junit4]   2> 2005079 T3957 oashc.HttpShardHandlerFactory.getParameter Setting maxConnectionsPerHost to: 20
   [junit4]   2> 2005081 T3957 oashc.HttpShardHandlerFactory.getParameter Setting corePoolSize to: 0
   [junit4]   2> 2005081 T3957 oashc.HttpShardHandlerFactory.getParameter Setting maximumPoolSize to: 2147483647
   [junit4]   2> 2005081 T3957 oashc.HttpShardHandlerFactory.getParameter Setting maxThreadIdleTime to: 5
   [junit4]   2> 2005081 T3957 oashc.HttpShardHandlerFactory.getParameter Setting sizeOfQueue to: -1
   [junit4]   2> 2005081 T3957 oashc.HttpShardHandlerFactory.getParameter Setting fairnessPolicy to: false
   [junit4]   2> 2005082 T3957 oascsi.HttpClientUtil.createClient Creating new http client, config:maxConnectionsPerHost=20&maxConnections=10000&socketTimeout=120000&connTimeout=15000&retry=false
   [junit4]   2> 2005089 T3957 oasc.ZkContainer.initZooKeeper Zookeeper client=127.0.0.1:57617/solr
   [junit4]   2> 2005089 T3957 oasc.ZkController.checkChrootPath zkHost includes chroot
   [junit4]   2> 2005091 T3957 oascc.ConnectionManager.waitForConnected Waiting for client to connect to ZooKeeper
   [junit4]   2> 2005105 T3977 oascc.ConnectionManager.process Watcher org.apache.solr.common.cloud.ConnectionManager@1d59a86 name:ZooKeeperConnection Watcher:127.0.0.1:57617 got event WatchedEvent state:SyncConnected type:None path:null path:null type:None
   [junit4]   2> 2005106 T3957 oascc.ConnectionManager.waitForConnected Client is connected to ZooKeeper
   [junit4]   2> 2005108 T3957 oascsi.HttpClientUtil.createClient Creating new http client, config:maxConnections=500&maxConnectionsPerHost=16&socketTimeout=120000&connTimeout=15000
   [junit4]   2> 2005108 T3959 oazs.NIOServerCnxn.doIO WARN caught end of stream exception EndOfStreamException: Unable to read additional data from client sessionid 0x14040e58c4f0002, likely client has closed socket
   [junit4]   2> at org.apache.zookeeper.server.NIOServerCnxn.doIO(NIOServerCnxn.java:220)
   [junit4]   2> at org.apache.zookeeper.server.NIOServerCnxnFactory.run(NIOServerCnxnFactory.java:208)
   [junit4]   2> at java.lang.Thread.run(Thread.java:724)
   [junit4]   2>
   [junit4]   2> 2005113 T3957 oascc.ConnectionManager.waitForConnected Waiting for client to connect to ZooKeeper
   [junit4]   2> 2005115 T3979 oascc.ConnectionManager.process Watcher org.apache.solr.common.cloud.ConnectionManager@1a1298e name:ZooKeeperConnection Watcher:127.0.0.1:57617/solr got event WatchedEvent state:SyncConnected type:None path:null path:null type:None
   [junit4]   2> 2005115 T3957 oascc.ConnectionManager.waitForConnected Client is connected to ZooKeeper
   [junit4]   2> 2005118 T3957 oascc.SolrZkClient.makePath makePath: /overseer/queue
   [junit4]   2> 2005122 T3957 oascc.SolrZkClient.makePath makePath: /overseer/collection-queue-work
   [junit4]   2> 2005129 T3957 oascc.SolrZkClient.makePath makePath: /live_nodes
   [junit4]   2> 2005132 T3957 oasc.ZkController.createEphemeralLiveNode Register node as live in ZooKeeper:/live_nodes/127.0.0.1:57624_
   [junit4]   2> 2005133 T3957 oascc.SolrZkClient.makePath makePath: /live_nodes/127.0.0.1:57624_
   [junit4]   2> 2005137 T3957 oascc.SolrZkClient.makePath makePath: /overseer_elect/election
   [junit4]   2> 2005144 T3957 oascc.SolrZkClient.makePath makePath: /overseer_elect/leader
   [junit4]   2> 2005146 T3957 oasc.Overseer.start Overseer (id=90143347193085955-127.0.0.1:57624_-n_0000000000) starting
   [junit4]   2> 2005152 T3957 oascc.SolrZkClient.makePath makePath: /overseer/queue-work
   [junit4]   2> 2005156 T3981 oasc.OverseerCollectionProcessor.run Process current queue of collection creations
   [junit4]   2> 2005157 T3957 oascc.SolrZkClient.makePath makePath: /clusterstate.json
   [junit4]   2> 2005160 T3957 oascc.SolrZkClient.makePath makePath: /aliases.json
   [junit4]   2> 2005163 T3957 oascc.ZkStateReader.createClusterStateWatchersAndUpdate Updating cluster state from ZooKeeper...
   [junit4]   2> 2005166 T3980 oasc.Overseer$ClusterStateUpdater.run Starting to work on the main queue
   [junit4]   2> 2005167 T3957 oasc.CorePropertiesLocator.discover Looking for core definitions underneath C:\Users\JenkinsSlave\workspace\Lucene-Solr-trunk-Windows\solr\build\solr-core\test\J0\.\org.apache.solr.cloud.CollectionsAPIDistributedZkTest-controljetty-1375478320356
   [junit4]   2> 2005395 T3957 oasc.CorePropertiesLocator.discoverUnder Found core conf in C:\Users\JenkinsSlave\workspace\Lucene-Solr-trunk-Windows\solr\build\solr-core\test\J0\.\org.apache.solr.cloud.CollectionsAPIDistributedZkTest-controljetty-1375478320356\conf\
   [junit4]   2> 2005406 T3957 oasc.CorePropertiesLocator.discover Found 1 core definitions
   [junit4]   2> 2005407 T3957 oass.SolrDispatchFilter.init user.dir=C:\Users\JenkinsSlave\workspace\Lucene-Solr-trunk-Windows\solr\build\solr-core\test\J0
   [junit4]   2> 2005407 T3957 oass.SolrDispatchFilter.init SolrDispatchFilter.init() done
   [junit4]   2> 2005408 T3957 oascsi.HttpClientUtil.createClient Creating new http client, config:maxConnections=128&maxConnectionsPerHost=32&followRedirects=false
   [junit4]   2> 2005415 T3957 oascsi.HttpClientUtil.createClient Creating new http client, config:
   [junit4]   2> 2005416 T3957 oascc.ConnectionManager.waitForConnected Waiting for client to connect to ZooKeeper
   [junit4]   2> 2005420 T3984 oascc.ConnectionManager.process Watcher org.apache.solr.common.cloud.ConnectionManager@c6b988 name:ZooKeeperConnection Watcher:127.0.0.1:57617/solr got event WatchedEvent state:SyncConnected type:None path:null path:null type:None
   [junit4]   2> 2005420 T3957 oascc.ConnectionManager.waitForConnected Client is connected to ZooKeeper
   [junit4]   2> 2005420 T3957 oascc.ZkStateReader.createClusterStateWatchersAndUpdate Updating cluster state from ZooKeeper...
   [junit4]   2> 2005423 T3957 oasc.ChaosMonkey.monkeyLog monkey: init - expire sessions:true cause connection loss:true
   [junit4]   2> 2005800 T3957 oejs.Server.doStart jetty-8.1.10.v20130312
   [junit4]   2> 2005804 T3957 oejs.AbstractConnector.doStart Started SelectChannelConnector@127.0.0.1:57636
   [junit4]   2> 2005804 T3957 oass.SolrDispatchFilter.init SolrDispatchFilter.init()
   [junit4]   2> 2005805 T3957 oasc.SolrResourceLoader.locateSolrHome JNDI not configured for solr (NoInitialContextEx)
   [junit4]   2> 2005805 T3957 oasc.SolrResourceLoader.locateSolrHome using system property solr.solr.home: C:\Users\JenkinsSlave\workspace\Lucene-Solr-trunk-Windows\solr\build\solr-core\test\J0\.\org.apache.solr.cloud.CollectionsAPIDistributedZkTest-jetty1-1375478321187
   [junit4]   2> 2005806 T3957 oasc.SolrResourceLoader.<init> new SolrResourceLoader for directory: 'C:\Users\JenkinsSlave\workspace\Lucene-Solr-trunk-Windows\solr\build\solr-core\test\J0\.\org.apache.solr.cloud.CollectionsAPIDistributedZkTest-jetty1-1375478321187\'
   [junit4]   2> 2005828 T3957 oasc.ConfigSolr.fromFile Loading container configuration from C:\Users\JenkinsSlave\workspace\Lucene-Solr-trunk-Windows\solr\build\solr-core\test\J0\.\org.apache.solr.cloud.CollectionsAPIDistributedZkTest-jetty1-1375478321187\solr.xml
   [junit4]   2> 2005898 T3957 oasc.ConfigSolrXml.<init> Config-defined core root directory:
   [junit4]   2> 2005898 T3957 oasc.CoreContainer.<init> New CoreContainer 12745149
   [junit4]   2> 2005898 T3957 oasc.CoreContainer.load Loading cores into CoreContainer [instanceDir=C:\Users\JenkinsSlave\workspace\Lucene-Solr-trunk-Windows\solr\build\solr-core\test\J0\.\org.apache.solr.cloud.CollectionsAPIDistributedZkTest-jetty1-1375478321187\]
   [junit4]   2> 2005901 T3957 oashc.HttpShardHandlerFactory.getParameter Setting socketTimeout to: 120000
   [junit4]   2> 2005901 T3957 oashc.HttpShardHandlerFactory.getParameter Setting urlScheme to: http://
   [junit4]   2> 2005901 T3957 oashc.HttpShardHandlerFactory.getParameter Setting connTimeout to: 15000
   [junit4]   2> 2005902 T3957 oashc.HttpShardHandlerFactory.getParameter Setting maxConnectionsPerHost to: 20
   [junit4]   2> 2005903 T3957 oashc.HttpShardHandlerFactory.getParameter Setting corePoolSize to: 0
   [junit4]   2> 2005903 T3957 oashc.HttpShardHandlerFactory.getParameter Setting maximumPoolSize to: 2147483647
   [junit4]   2> 2005904 T3957 oashc.HttpShardHandlerFactory.getParameter Setting maxThreadIdleTime to: 5
   [junit4]   2> 2005905 T3957 oashc.HttpShardHandlerFactory.getParameter Setting sizeOfQueue to: -1
   [junit4]   2> 2005905 T3957 oashc.HttpShardHandlerFactory.getParameter Setting fairnessPolicy to: false
   [junit4]   2> 2005905 T3957 oascsi.HttpClientUtil.createClient Creating new http client, config:maxConnectionsPerHost=20&maxConnections=10000&socketTimeout=120000&connTimeout=15000&retry=false
   [junit4]   2> 2005913 T3957 oasc.ZkContainer.initZooKeeper Zookeeper client=127.0.0.1:57617/solr
   [junit4]   2> 2005913 T3957 oasc.ZkController.checkChrootPath zkHost includes chroot
   [junit4]   2> 2005915 T3957 oascc.ConnectionManager.waitForConnected Waiting for client to connect to ZooKeeper
   [junit4]   2> 2005929 T3995 oascc.ConnectionManager.process Watcher org.apache.solr.common.cloud.ConnectionManager@1748ffc name:ZooKeeperConnection Watcher:127.0.0.1:57617 got event WatchedEvent state:SyncConnected type:None path:null path:null type:None
   [junit4]   2> 2005929 T3957 oascc.ConnectionManager.waitForConnected Client is connected to ZooKeeper
   [junit4]   2> 2005931 T3957 oascsi.HttpClientUtil.createClient Creating new http client, config:maxConnections=500&maxConnectionsPerHost=16&socketTimeout=120000&connTimeout=15000
   [junit4]   2> 2005936 T3957 oascc.ConnectionManager.waitForConnected Waiting for client to connect to ZooKeeper
   [junit4]   2> 2005939 T3997 oascc.ConnectionManager.process Watcher org.apache.solr.common.cloud.ConnectionManager@125eb0f name:ZooKeeperConnection Watcher:127.0.0.1:57617/solr got event WatchedEvent state:SyncConnected type:None path:null path:null type:None
   [junit4]   2> 2005940 T3957 oascc.ConnectionManager.waitForConnected Client is connected to ZooKeeper
   [junit4]   2> 2005944 T3957 oascc.ZkStateReader.createClusterStateWatchersAndUpdate Updating cluster state from ZooKeeper...
   [junit4]   2> 2006744 T3957 oasc.ZkController.createEphemeralLiveNode Register node as live in ZooKeeper:/live_nodes/127.0.0.1:57636_
   [junit4]   2> 2006748 T3957 oascc.SolrZkClient.makePath makePath: /live_nodes/127.0.0.1:57636_
   [junit4]   2> 2006752 T3997 oascc.ZkStateReader$3.process Updating live nodes... (2)
   [junit4]   2> 2006752 T3979 oascc.ZkStateReader$3.process Updating live nodes... (2)
   [junit4]   2> 2006752 T3984 oascc.ZkStateReader$3.process Updating live nodes... (2)
   [junit4]   2> 2006759 T3957 oasc.CorePropertiesLocator.discover Looking for core definitions underneath C:\Users\JenkinsSlave\workspace\Lucene-Solr-trunk-Windows\solr\build\solr-core\test\J0\.\org.apache.solr.cloud.CollectionsAPIDistributedZkTest-jetty1-1375478321187
   [junit4]   2> 2006999 T3957 oasc.CorePropertiesLocator.discoverUnder Found core conf in C:\Users\JenkinsSlave\workspace\Lucene-Solr-trunk-Windows\solr\build\solr-core\test\J0\.\org.apache.solr.cloud.CollectionsAPIDistributedZkTest-jetty1-1375478321187\conf\
   [junit4]   2> 2007011 T3957 oasc.CorePropertiesLocator.discover Found 1 core definitions
   [junit4]   2> 2007012 T3957 oass.SolrDispatchFilter.init user.dir=C:\Users\JenkinsSlave\workspace\Lucene-Solr-trunk-Windows\solr\build\solr-core\test\J0
   [junit4]   2> 2007012 T3957 oass.SolrDispatchFilter.init SolrDispatchFilter.init() done
   [junit4]   2> 2007012 T3957 oascsi.HttpClientUtil.createClient Creating new http client, config:maxConnections=128&maxConnectionsPerHost=32&followRedirects=false
   [junit4]   2> 2007418 T3957 oejs.Server.doStart jetty-8.1.10.v20130312
   [junit4]   2> 2007423 T3957 oejs.AbstractConnector.doStart Started SelectChannelConnector@127.0.0.1:57645
   [junit4]   2> 2007424 T3957 oass.SolrDispatchFilter.init SolrDispatchFilter.init()
   [junit4]   2> 2007424 T3957 oasc.SolrResourceLoader.locateSolrHome JNDI not configured for solr (NoInitialContextEx)
   [junit4]   2> 2007425 T3957 oasc.SolrResourceLoader.locateSolrHome using system property solr.solr.home: C:\Users\JenkinsSlave\workspace\Lucene-Solr-trunk-Windows\solr\build\solr-core\test\J0\.\org.apache.solr.cloud.CollectionsAPIDistributedZkTest-jetty2-1375478322783
   [junit4]   2> 2007425 T3957 oasc.SolrResourceLoader.<init> new SolrResourceLoader for directory: 'C:\Users\JenkinsSlave\workspace\Lucene-Solr-trunk-Windows\solr\build\solr-core\test\J0\.\org.apache.solr.cloud.CollectionsAPIDistributedZkTest-jetty2-1375478322783\'
   [junit4]   2> 2007448 T3957 oasc.ConfigSolr.fromFile Loading container configuration from C:\Users\JenkinsSlave\workspace\Lucene-Solr-trunk-Windows\solr\build\solr-core\test\J0\.\org.apache.solr.cloud.CollectionsAPIDistributedZkTest-jetty2-1375478322783\solr.xml
   [junit4]   2> 2007522 T3957 oasc.ConfigSolrXml.<init> Config-defined core root directory:
   [junit4]   2> 2007522 T3957 oasc.CoreContainer.<init> New CoreContainer 19248607
   [junit4]   2> 2007522 T3957 oasc.CoreContainer.load Loading cores into CoreContainer [instanceDir=C:\Users\JenkinsSlave\workspace\Lucene-Solr-trunk-Windows\solr\build\solr-core\test\J0\.\org.apache.solr.cloud.CollectionsAPIDistributedZkTest-jetty2-1375478322783\]
   [junit4]   2> 2007525 T3957 oashc.HttpShardHandlerFactory.getParameter Setting socketTimeout to: 120000
   [junit4]   2> 2007525 T3957 oashc.HttpShardHandlerFactory.getParameter Setting urlScheme to: http://
   [junit4]   2> 2007525 T3957 oashc.HttpShardHandlerFactory.getParameter Setting connTimeout to: 15000
   [junit4]   2> 2007525 T3957 oashc.HttpShardHandlerFactory.getParameter Setting maxConnectionsPerHost to: 20
   [junit4]   2> 2007525 T3957 oashc.HttpShardHandlerFactory.getParameter Setting corePoolSize to: 0
   [junit4]   2> 2007525 T3957 oashc.HttpShardHandlerFactory.getParameter Setting maximumPoolSize to: 2147483647
   [junit4]   2> 2007525 T3957 oashc.HttpShardHandlerFactory.getParameter Setting maxThreadIdleTime to: 5
   [junit4]   2> 2007525 T3957 oashc.HttpShardHandlerFactory.getParameter Setting sizeOfQueue to: -1
   [junit4]   2> 2007526 T3957 oashc.HttpShardHandlerFactory.getParameter Setting fairnessPolicy to: false
   [junit4]   2> 2007526 T3957 oascsi.HttpClientUtil.createClient Creating new http client, config:maxConnectionsPerHost=20&maxConnections=10000&socketTimeout=120000&connTimeout=15000&retry=false
   [junit4]   2> 2007533 T3957 oasc.ZkContainer.initZooKeeper Zookeeper client=127.0.0.1:57617/solr
   [junit4]   2> 2007534 T3957 oasc.ZkController.checkChrootPath zkHost includes chroot
   [junit4]   2> 2007536 T3957 oascc.ConnectionManager.waitForConnected Waiting for client to connect to ZooKeeper
   [junit4]   2> 2007550 T4009 oascc.ConnectionManager.process Watcher org.apache.solr.common.cloud.ConnectionManager@1993f3d name:ZooKeeperConnection Watcher:127.0.0.1:57617 got event WatchedEvent state:SyncConnected type:None path:null path:null type:None
   [junit4]   2> 2007551 T3957 oascc.ConnectionManager.waitForConnected Client is connected to ZooKeeper
   [junit4]   2> 2007553 T3957 oascsi.HttpClientUtil.createClient Creating new http client, config:maxConnections=500&maxConnectionsPerHost=16&socketTimeout=120000&connTimeout=15000
   [junit4]   2> 2007559 T3957 oascc.ConnectionManager.waitForConnected Waiting for client to connect to ZooKeeper
   [junit4]   2> 2007563 T4011 oascc.ConnectionManager.process Watcher org.apache.solr.common.cloud.ConnectionManager@6e013b name:ZooKeeperConnection Watcher:127.0.0.1:57617/solr got event WatchedEvent state:SyncConnected type:None path:null path:null type:None
   [junit4]   2> 2007563 T3957 oascc.ConnectionManager.waitForConnected Client is connected to ZooKeeper
   [junit4]   2> 2007570 T3957 oascc.ZkStateReader.createClusterStateWatchersAndUpdate Updating cluster state from ZooKeeper...
   [junit4]   2> 2008371 T3957 oasc.ZkController.createEphemeralLiveNode Register node as live in ZooKeeper:/live_nodes/127.0.0.1:57645_
   [junit4]   2> 2008373 T3957 oascc.SolrZkClient.makePath makePath: /live_nodes/127.0.0.1:57645_
   [junit4]   2> 2008378 T3984 oascc.ZkStateReader$3.process Updating live nodes... (3)
   [junit4]   2> 2008379 T4011 oascc.ZkStateReader$3.process Updating live nodes... (3)
   [junit4]   2> 2008379 T3979 oascc.ZkStateReader$3.process Updating live nodes... (3)
   [junit4]   2> 2008379 T3997 oascc.ZkStateReader$3.process Updating live nodes... (3)
   [junit4]   2> 2008387 T3957 oasc.CorePropertiesLocator.discover Looking for core definitions underneath C:\Users\JenkinsSlave\workspace\Lucene-Solr-trunk-Windows\solr\build\solr-core\test\J0\.\org.apache.solr.cloud.CollectionsAPIDistributedZkTest-jetty2-1375478322783
   [junit4]   2> 2008622 T3957 oasc.CorePropertiesLocator.discoverUnder Found core conf in C:\Users\JenkinsSlave\workspace\Lucene-Solr-trunk-Windows\solr\build\solr-core\test\J0\.\org.apache.solr.cloud.CollectionsAPIDistributedZkTest-jetty2-1375478322783\conf\
   [junit4]   2> 2008635 T3957 oasc.CorePropertiesLocator.discover Found 1 core definitions
   [junit4]   2> 2008636 T3957 oass.SolrDispatchFilter.init user.dir=C:\Users\JenkinsSlave\workspace\Lucene-Solr-trunk-Windows\solr\build\solr-core\test\J0
   [junit4]   2> 2008636 T3957 oass.SolrDispatchFilter.init SolrDispatchFilter.init() done
   [junit4]   2> 2008636 T3957 oascsi.HttpClientUtil.createClient Creating new http client, config:maxConnections=128&maxConnectionsPerHost=32&followRedirects=false
   [junit4]   2> 2009015 T3957 oejs.Server.doStart jetty-8.1.10.v20130312
   [junit4]   2> 2009020 T3957 oejs.AbstractConnector.doStart Started SelectChannelConnector@127.0.0.1:57654
   [junit4]   2> 2009022 T3957 oass.SolrDispatchFilter.init SolrDispatchFilter.init()
   [junit4]   2> 2009022 T3957 oasc.SolrResourceLoader.locateSolrHome JNDI not configured for solr (NoInitialContextEx)
   [junit4]   2> 2009022 T3957 oasc.SolrResourceLoader.locateSolrHome using system property solr.solr.home: C:\Users\JenkinsSlave\workspace\Lucene-Solr-trunk-Windows\solr\build\solr-core\test\J0\.\org.apache.solr.cloud.CollectionsAPIDistributedZkTest-jetty3-1375478324407
   [junit4]   2> 2009022 T3957 oasc.SolrResourceLoader.<init> new SolrResourceLoader for directory: 'C:\Users\JenkinsSlave\workspace\Lucene-Solr-trunk-Windows\solr\build\solr-core\test\J0\.\org.apache.solr.cloud.CollectionsAPIDistributedZkTest-jetty3-1375478324407\'
   [junit4]   2> 2009054 T3957 oasc.ConfigSolr.fromFile Loading container configuration from C:\Users\JenkinsSlave\workspace\Lucene-Solr-trunk-Windows\solr\build\solr-core\test\J0\.\org.apache.solr.cloud.CollectionsAPIDistributedZkTest-jetty3-1375478324407\solr.xml
   [junit4]   2> 2009133 T3957 oasc.ConfigSolrXml.<init> Config-defined core root directory:
   [junit4]   2> 2009134 T3957 oasc.CoreContainer.<init> New CoreContainer 6971443
   [junit4]   2> 2009135 T3957 oasc.CoreContainer.load Loading cores into CoreContainer [instanceDir=C:\Users\JenkinsSlave\workspace\Lucene-Solr-trunk-Windows\solr\build\solr-core\test\J0\.\org.apache.solr.cloud.CollectionsAPIDistributedZkTest-jetty3-1375478324407\]
   [junit4]   2> 2009135 T3957 oashc.HttpShardHandlerFactory.getParameter Setting socketTimeout to: 120000
   [junit4]   2> 2009135 T3957 oashc.HttpShardHandlerFactory.getParameter Setting urlScheme to: http://
   [junit4]   2> 2009135 T3957 oashc.HttpShardHandlerFactory.getParameter Setting connTimeout to: 15000
   [junit4]   2> 2009136 T3957 oashc.HttpShardHandlerFactory.getParameter Setting maxConnectionsPerHost to: 20
   [junit4]   2> 2009136 T3957 oashc.HttpShardHandlerFactory.getParameter Setting corePoolSize to: 0
   [junit4]   2> 2009137 T3957 oashc.HttpShardHandlerFactory.getParameter Setting maximumPoolSize to: 2147483647
   [junit4]   2> 2009137 T3957 oashc.HttpShardHandlerFactory.getParameter Setting maxThreadIdleTime to: 5
   [junit4]   2> 2009138 T3957 oashc.HttpShardHandlerFactory.getParameter Setting sizeOfQueue to: -1
   [junit4]   2> 2009138 T3957 oashc.HttpShardHandlerFactory.getParameter Setting fairnessPolicy to: false
   [junit4]   2> 2009138 T3957 oascsi.HttpClientUtil.createClient Creating new http client, config:maxConnectionsPerHost=20&maxConnections=10000&socketTimeout=120000&connTimeout=15000&retry=false
   [junit4]   2> 2009145 T3957 oasc.ZkContainer.initZooKeeper Zookeeper client=127.0.0.1:57617/solr
   [junit4]   2> 2009145 T3957 oasc.ZkController.checkChrootPath zkHost includes chroot
   [junit4]   2> 2009146 T3957 oascc.ConnectionManager.waitForConnected Waiting for client to connect to ZooKeeper
   [junit4]   2> 2009163 T4023 oascc.ConnectionManager.process Watcher org.apache.solr.common.cloud.ConnectionManager@1176dc name:ZooKeeperConnection Watcher:127.0.0.1:57617 got event WatchedEvent state:SyncConnected type:None path:null path:null type:None
   [junit4]   2> 2009163 T3957 oascc.ConnectionManager.waitForConnected Client is connected to ZooKeeper
   [junit4]   2> 2009166 T3957 oascsi.HttpClientUtil.createClient Creating new http client, config:maxConnections=500&maxConnectionsPerHost=16&socketTimeout=120000&connTimeout=15000
   [junit4]   2> 2009171 T3957 oascc.ConnectionManager.waitForConnected Waiting for client to connect to ZooKeeper
   [junit4]   2> 2009173 T4025 oascc.ConnectionManager.process Watcher org.apache.solr.common.cloud.ConnectionManager@ef93a8 name:ZooKeeperConnection Watcher:127.0.0.1:57617/solr got event WatchedEvent state:SyncConnected type:None path:null path:null type:None
   [junit4]   2> 2009174 T3957 oascc.ConnectionManager.waitForConnected Client is connected to ZooKeeper
   [junit4]   2> 2009180 T3957 oascc.ZkStateReader.createClusterStateWatchersAndUpdate Updating cluster state from ZooKeeper...
   [junit4]   2> 2009963 T3957 oasc.ZkController.createEphemeralLiveNode Register node as live in ZooKeeper:/live_nodes/127.0.0.1:57654_
   [junit4]   2> 2009970 T3957 oascc.SolrZkClient.makePath makePath: /live_nodes/127.0.0.1:57654_
   [junit4]   2> 2009978 T4011 oascc.ZkStateReader$3.process Updating live nodes... (4)
   [junit4]   2> 2009978 T4025 oascc.ZkStateReader$3.process Updating live nodes... (4)
   [junit4]   2> 2009979 T3979 oascc.ZkStateReader$3.process Updating live nodes... (4)
   [junit4]   2> 2009979 T3997 oascc.ZkStateReader$3.process Updating live nodes... (4)
   [junit4]   2> 2009979 T3984 oascc.ZkStateReader$3.process Updating live nodes... (4)
   [junit4]   2> 2009986 T3957 oasc.CorePropertiesLocator.discover Looking for core definitions underneath C:\Users\JenkinsSlave\workspace\Lucene-Solr-trunk-Windows\solr\build\solr-core\test\J0\.\org.apache.solr.cloud.CollectionsAPIDistributedZkTest-jetty3-1375478324407
   [junit4]   2> 2010160 T3957 oasc.CorePropertiesLocator.discoverUnder Found core conf in C:\Users\JenkinsSlave\workspace\Lucene-Solr-trunk-Windows\solr\build\solr-core\test\J0\.\org.apache.solr.cloud.CollectionsAPIDistributedZkTest-jetty3-1375478324407\conf\
   [junit4]   2> 2010168 T3957 oasc.CorePropertiesLocator.discover Found 1 core definitions
   [junit4]   2> 2010169 T3957 oass.SolrDispatchFilter.init user.dir=C:\Users\JenkinsSlave\workspace\Lucene-Solr-trunk-Windows\solr\build\solr-core\test\J0
   [junit4]   2> 2010169 T3957 oass.SolrDispatchFilter.init SolrDispatchFilter.init() done
   [junit4]   2> 2010169 T3957 oascsi.HttpClientUtil.createClient Creating new http client, config:maxConnections=128&maxConnectionsPerHost=32&followRedirects=false
   [junit4]   2> 2010485 T3957 oejs.Server.doStart jetty-8.1.10.v20130312
   [junit4]   2> 2010490 T3957 oejs.AbstractConnector.doStart Started SelectChannelConnector@127.0.0.1:57663
   [junit4]   2> 2010491 T3957 oass.SolrDispatchFilter.init SolrDispatchFilter.init()
   [junit4]   2> 2010491 T3957 oasc.SolrResourceLoader.locateSolrHome JNDI not configured for solr (NoInitialContextEx)
   [junit4]   2> 2010492 T3957 oasc.SolrResourceLoader.locateSolrHome using system property solr.solr.home: C:\Users\JenkinsSlave\workspace\Lucene-Solr-trunk-Windows\solr\build\solr-core\test\J0\.\org.apache.solr.cloud.CollectionsAPIDistributedZkTest-jetty4-1375478325939
   [junit4]   2> 2010492 T3957 oasc.SolrResourceLoader.<init> new SolrResourceLoader for directory: 'C:\Users\JenkinsSlave\workspace\Lucene-Solr-trunk-Windows\solr\build\solr-core\test\J0\.\org.apache.solr.cloud.CollectionsAPIDistributedZkTest-jetty4-1375478325939\'
   [junit4]   2> 2010513 T3957 oasc.ConfigSolr.fromFile Loading container configuration from C:\Users\JenkinsSlave\workspace\Lucene-Solr-trunk-Windows\solr\build\solr-core\test\J0\.\org.apache.solr.cloud.CollectionsAPIDistributedZkTest-jetty4-1375478325939\solr.xml
   [junit4]   2> 2010575 T3957 oasc.ConfigSolrXml.<init> Config-defined core root directory:
   [junit4]   2> 2010576 T3957 oasc.CoreContainer.<init> New CoreContainer 15232480
   [junit4]   2> 2010576 T3957 oasc.CoreContainer.load Loading cores into CoreContainer [instanceDir=C:\Users\JenkinsSlave\workspace\Lucene-Solr-trunk-Windows\solr\build\solr-core\test\J0\.\org.apache.solr.cloud.CollectionsAPIDistributedZkTest-jetty4-1375478325939\]
   [junit4]   2> 2010577 T3957 oashc.HttpShardHandlerFactory.getParameter Setting socketTimeout to: 120000
   [junit4]   2> 2010578 T3957 oashc.HttpShardHandlerFactory.getParameter Setting urlScheme to: http://
   [junit4]   2> 2010578 T3957 oashc.HttpShardHandlerFactory.getParameter Setting connTimeout to: 15000
   [junit4]   2> 2010578 T3957 oashc.HttpShardHandlerFactory.getParameter Setting maxConnectionsPerHost to: 20
   [junit4]   2> 2010579 T3957 oashc.HttpShardHandlerFactory.getParameter Setting corePoolSize to: 0
   [junit4]   2> 2010579 T3957 oashc.HttpShardHandlerFactory.getParameter Setting maximumPoolSize to: 2147483647
   [junit4]   2> 2010579 T3957 oashc.HttpShardHandlerFactory.getParameter Setting maxThreadIdleTime to: 5
   [junit4]   2> 2010579 T3957 oashc.HttpShardHandlerFactory.getParameter Setting sizeOfQueue to: -1
   [junit4]   2> 2010579 T3957 oashc.HttpShardHandlerFactory.getParameter Setting fairnessPolicy to: false
   [junit4]   2> 2010580 T3957 oascsi.HttpClientUtil.createClient Creating new http client, config:maxConnectionsPerHost=20&maxConnections=10000&socketTimeout=120000&connTimeout=15000&retry=false
   [junit4]   2> 2010586 T3957 oasc.ZkContainer.initZooKeeper Zookeeper client=127.0.0.1:57617/solr
   [junit4]   2> 2010586 T3957 oasc.ZkController.checkChrootPath zkHost includes chroot
   [junit4]   2> 2010587 T3957 oascc.ConnectionManager.waitForConnected Waiting for client to connect to ZooKeeper
   [junit4]   2> 2010600 T4037 oascc.ConnectionManager.process Watcher org.apache.solr.common.cloud.ConnectionManager@36c1d9 name:ZooKeeperConnection Watcher:127.0.0.1:57617 got event WatchedEvent state:SyncConnected type:None path:null path:null type:None
   [junit4]   2> 2010600 T3957 oascc.ConnectionManager.waitForConnected Client is connected to ZooKeeper
   [junit4]   2> 2010602 T3957 oascsi.HttpClientUtil.createClient Creating new http client, config:maxConnections=500&maxConnectionsPerHost=16&socketTimeout=120000&connTimeout=15000
   [junit4]   2> 2010607 T3957 oascc.ConnectionManager.waitForConnected Waiting for client to connect to ZooKeeper
   [junit4]   2> 2010609 T4039 oascc.ConnectionManager.process Watcher org.apache.solr.common.cloud.ConnectionManager@10fb0fd name:ZooKeeperConnection Watcher:127.0.0.1:57617/solr got event WatchedEvent state:SyncConnected type:None path:null path:null type:None
   [junit4]   2> 2010610 T3957 oascc.ConnectionManager.waitForConnected Client is connected to ZooKeeper
   [junit4]   2> 2010616 T3957 oascc.ZkStateReader.createClusterStateWatchersAndUpdate Updating cluster state from ZooKeeper...
   [junit4]   2> 2011337 T3957 oasc.ZkController.createEphemeralLiveNode Register node as live in ZooKeeper:/live_nodes/127.0.0.1:57663_
   [junit4]   2> 2011344 T3957 oascc.SolrZkClient.makePath makePath: /live_nodes/127.0.0.1:57663_
   [junit4]   2> 2011349 T3984 oascc.ZkStateReader$3.process Updating live nodes... (5)
   [junit4]   2> 2011349 T4011 oascc.ZkStateReader$3.process Updating live nodes... (5)
   [junit4]   2> 2011349 T3979 oascc.ZkStateReader$3.process Updating live nodes... (5)
   [junit4]   2> 2011350 T3997 oascc.ZkStateReader$3.process Updating live nodes... (5)
   [junit4]   2> 2011350 T4025 oascc.ZkStateReader$3.process Updating live nodes... (5)
   [junit4]   2> 2011350 T4039 oascc.ZkStateReader$3.process Updating live nodes... (5)
   [junit4]   2> 2011358 T3957 oasc.CorePropertiesLocator.discover Looking for core definitions underneath C:\Users\JenkinsSlave\workspace\Lucene-Solr-trunk-Windows\solr\build\solr-core\test\J0\.\org.apache.solr.cloud.CollectionsAPIDistributedZkTest-jetty4-1375478325939
   [junit4]   2> 2011537 T3957 oasc.CorePropertiesLocator.discoverUnder Found core conf in C:\Users\JenkinsSlave\workspace\Lucene-Solr-trunk-Windows\solr\build\solr-core\test\J0\.\org.apache.solr.cloud.CollectionsAPIDistributedZkTest-jetty4-1375478325939\conf\
   [junit4]   2> 2011552 T3957 oasc.CorePropertiesLocator.discover Found 1 core definitions
   [junit4]   2> 2011553 T3957 oass.SolrDispatchFilter.init user.dir=C:\Users\JenkinsSlave\workspace\Lucene-Solr-trunk-Windows\solr\build\solr-core\test\J0
   [junit4]   2> 2011553 T3957 oass.SolrDispatchFilter.init SolrDispatchFilter.init() done
   [junit4]   2> 2011554 T3957 oascsi.HttpClientUtil.createClient Creating new http client, config:maxConnections=128&maxConnectionsPerHost=32&followRedirects=false
   [junit4]   2> 2011564 T3957 oascsi.HttpClientUtil.createClient Creating new http client, config:maxConnections=128&maxConnectionsPerHost=32&followRedirects=false
   [junit4]   2> 2011575 T3991 oasha.CollectionsHandler.handleCreateAction Creating Collection : numShards=2&name=nodes_used_collection&replicationFactor=2&action=CREATE&wt=javabin&version=2
   [junit4]   2> 2011577 T3979 oasc.DistributedQueue$LatchChildWatcher.process Watcher fired on path: /overseer/collection-queue-work state: SyncConnected type NodeChildrenChanged
   [junit4]   2> 2011579 T3979 oasc.DistributedQueue$LatchChildWatcher.process Watcher fired on path: /overseer/collection-queue-work state: SyncConnected type NodeChildrenChanged
   [junit4]   2> 2011580 T3981 oasc.OverseerCollectionProcessor.run Overseer Collection Processor: Get the message id:/overseer/collection-queue-work/qn-0000000000 message:{
   [junit4]   2>  "operation":"createcollection",
   [junit4]   2>  "numShards":"2",
   [junit4]   2>  "name":"nodes_used_collection",
   [junit4]   2>  "replicationFactor":"2"}
   [junit4]   2> 2011580 T3981 oasc.OverseerCollectionProcessor.processMessage WARN OverseerCollectionProcessor.processMessage : createcollection , {
   [junit4]   2>  "operation":"createcollection",
   [junit4]   2>  "numShards":"2",
   [junit4]   2>  "name":"nodes_used_collection",
   [junit4]   2>  "replicationFactor":"2"}
   [junit4]   2> 2012103 T3980 oascc.ZkStateReader.updateClusterState Updating cloud state from ZooKeeper...
   [junit4]   2> 2012103 T3980 oasc.Overseer$ClusterStateUpdater.buildCollection building a new collection: nodes_used_collection
   [junit4]   2> 2012103 T3980 oasc.Overseer$ClusterStateUpdater.createCollection Create collection nodes_used_collection with shards [shard1, shard2]
   [junit4]   2> 2012110 T4039 oascc.ZkStateReader$2.process A cluster state change: WatchedEvent state:SyncConnected type:NodeDataChanged path:/clusterstate.json, has occurred - updating... (live nodes size: 5)
   [junit4]   2> 2012110 T4011 oascc.ZkStateReader$2.process A cluster state change: WatchedEvent state:SyncConnected type:NodeDataChanged path:/clusterstate.json, has occurred - updating... (live nodes size: 5)
   [junit4]   2> 2012111 T3979 oascc.ZkStateReader$2.process A cluster state change: WatchedEvent state:SyncConnected type:NodeDataChanged path:/clusterstate.json, has occurred - updating... (live nodes size: 5)
   [junit4]   2> 2012111 T3997 oascc.ZkStateReader$2.process A cluster state change: WatchedEvent state:SyncConnected type:NodeDataChanged path:/clusterstate.json, has occurred - updating... (live nodes size: 5)
   [junit4]   2> 2012110 T3984 oascc.ZkStateReader$2.process A cluster state change: WatchedEvent state:SyncConnected type:NodeDataChanged path:/clusterstate.json, has occurred - updating... (live nodes size: 5)
   [junit4]   2> 2012111 T4025 oascc.ZkStateReader$2.process A cluster state change: WatchedEvent state:SyncConnected type:NodeDataChanged path:/clusterstate.json, has occurred - updating... (live nodes size: 5)
   [junit4]   2> 2012161 T3981 oasc.OverseerCollectionProcessor.createCollection going to create cores replicas shardNames [shard1, shard2] , repFactor : 2
   [junit4]   2> 2012161 T3981 oasc.OverseerCollectionProcessor.createCollection Creating shard nodes_used_collection_shard1_replica1 as part of slice shard1 of collection nodes_used_collection on 127.0.0.1:57624_
   [junit4]   2> 2012161 T3981 oasc.OverseerCollectionProcessor.createCollection Creating shard nodes_used_collection_shard1_replica2 as part of slice shard1 of collection nodes_used_collection on 127.0.0.1:57636_
   [junit4]   2> 2012162 T3981 oasc.OverseerCollectionProcessor.createCollection Creating shard nodes_used_collection_shard2_replica1 as part of slice shard2 of collection nodes_used_collection on 127.0.0.1:57645_
   [junit4]   2> 2012164 T3981 oasc.OverseerCollectionProcessor.createCollection Creating shard nodes_used_collection_shard2_replica2 as part of slice shard2 of collection nodes_used_collection on 127.0.0.1:57654_
   [junit4]   2> 2012168 T3975 oasc.ZkController.publish publishing core=nodes_used_collection_shard1_replica1 state=down
   [junit4]   2> 2012169 T3993 oasc.ZkController.publish publishing core=nodes_used_collection_shard1_replica2 state=down
   [junit4]   2> 2012170 T4003 oasc.ZkController.publish publishing core=nodes_used_collection_shard2_replica1 state=down
   [junit4]   2> 2012172 T3975 oasc.ZkController.waitForCoreNodeName look for our core node name
   [junit4]   2> 2012173 T4021 oasc.ZkController.publish publishing core=nodes_used_collection_shard2_replica2 state=down
   [junit4]   2> 2012173 T3993 oasc.ZkController.waitForCoreNodeName look for our core node name
   [junit4]   2> 2012174 T4003 oasc.ZkController.waitForCoreNodeName look for our core node name
   [junit4]   2> 2012175 T4021 oasc.ZkController.waitForCoreNodeName look for our core node name
   [junit4]   2> 2013196 T3980 oascc.ZkStateReader.updateClusterState Updating cloud state from ZooKeeper...
   [junit4]   2> 2013198 T3980 oasc.Overseer$ClusterStateUpdater.updateState WARN Could not find collection node for nodes_used_collection, skipping publish state
   [junit4]   2> 2013198 T3980 oasc.Overseer$ClusterStateUpdater.updateState Update state numShards=2 message={
   [junit4]   2>  "operation":"state",
   [junit4]   2>  "core_node_name":"core_node1",
   [junit4]   2>  "numShards":"2",
   [junit4]   2>  "shard":"shard1",
   [junit4]   2>  "roles":null,
   [junit4]   2>  "state":"down",
   [junit4]   2>  "shard_state":"active",
   [junit4]   2>  "core":"nodes_used_collection_shard1_replica1",
   [junit4]   2>  "collection":"nodes_used_collection",
   [junit4]   2>  "shard_range":null,
   [junit4]   2>  "node_name":"127.0.0.1:57624_",
   [junit4]   2>  "base_url":"http://127.0.0.1:57624"}
   [junit4]   2> 2013212 T3980 oasc.Overseer$ClusterStateUpdater.updateState WARN Could not find collection node for nodes_used_collection, skipping publish state
   [junit4]   2> 2013212 T3980 oasc.Overseer$ClusterStateUpdater.updateState Update state numShards=2 message={
   [junit4]   2>  "operation":"state",
   [junit4]   2>  "core_node_name":"core_node2",
   [junit4]   2>  "numShards":"2",
   [junit4]   2>  "shard":"shard1",
   [junit4]   2>  "roles":null,
   [junit4]   2>  "state":"down",
   [junit4]   2>  "shard_state":"active",
   [junit4]   2>  "core":"nodes_used_collection_shard1_replica2",
   [junit4]   2>  "collection":"nodes_used_collection",
   [junit4]   2>  "shard_range":null,
   [junit4]   2>  "node_name":"127.0.0.1:57636_",
   [junit4]   2>  "base_url":"http://127.0.0.1:57636"}
   [junit4]   2> 2013217 T3980 oasc.Overseer$ClusterStateUpdater.updateState WARN Could not find collection node for nodes_used_collection, skipping publish state
   [junit4]   2> 2013217 T3980 oasc.Overseer$ClusterStateUpdater.updateState Update state numShards=2 message={
   [junit4]   2>  "operation":"state",
   [junit4]   2>  "core_node_name":"core_node3",
   [junit4]   2>  "numShards":"2",
   [junit4]   2>  "shard":"shard2",
   [junit4]   2>  "roles":null,
   [junit4]   2>  "state":"down",
   [junit4]   2>  "shard_state":"active",
   [junit4]   2>  "core":"nodes_used_collection_shard2_replica1",
   [junit4]   2>  "collection":"nodes_used_collection",
   [junit4]   2>  "shard_range":null,
   [junit4]   2>  "node_name":"127.0.0.1:57645_",
   [junit4]   2>  "base_url":"http://127.0.0.1:57645"}
   [junit4]   2> 2013224 T3980 oasc.Overseer$ClusterStateUpdater.updateState WARN Could not find collection node for nodes_used_collection, skipping publish state
   [junit4]   2> 2013224 T3980 oasc.Overseer$ClusterStateUpdater.updateState Update state numShards=2 message={
   [junit4]   2>  "operation":"state",
   [junit4]   2>  "core_node_name":"core_node4",
   [junit4]   2>  "numShards":"2",
   [junit4]   2>  "shard":"shard2",
   [junit4]   2>  "roles":null,
   [junit4]   2>  "state":"down",
   [junit4]   2>  "shard_state":"active",
   [junit4]   2>  "core":"nodes_used_collection_shard2_replica2",
   [junit4]   2>  "collection":"nodes_used_collection",
   [junit4]   2>  "shard_range":null,
   [junit4]   2>  "node_name":"127.0.0.1:57654_",
   [junit4]   2>  "base_url":"http://127.0.0.1:57654"}
   [junit4]   2> 2013229 T4039 oascc.ZkStateReader$2.process A cluster state change: WatchedEvent state:SyncConnected type:NodeDataChanged path:/clusterstate.json, has occurred - updating... (live nodes size: 5)
   [junit4]   2> 2013229 T4011 oascc.ZkStateReader$2.process A cluster state change: WatchedEvent state:SyncConnected type:NodeDataChanged path:/clusterstate.json, has occurred - updating... (live nodes size: 5)
   [junit4]   2> 2013230 T3979 oascc.ZkStateReader$2.process A cluster state change: WatchedEvent state:SyncConnected type:NodeDataChanged path:/clusterstate.json, has occurred - updating... (live nodes size: 5)
   [junit4]   2> 2013230 T3997 oascc.ZkStateReader$2.process A cluster state change: WatchedEvent state:SyncConnected type:NodeDataChanged path:/clusterstate.json, has occurred - updating... (live nodes size: 5)
   [junit4]   2> 2013230 T4025 oascc.ZkStateReader$2.process A cluster state change: WatchedEvent state:SyncConnected type:NodeDataChanged path:/clusterstate.json, has occurred - updating... (live nodes size: 5)
   [junit4]   2> 2013230 T3984 oascc.ZkStateReader$2.process A cluster state change: WatchedEvent state:SyncConnected type:NodeDataChanged path:/clusterstate.json, has occurred - updating... (live nodes size: 5)
   [junit4]   2> 2013607 T3975 oasc.ZkController.waitForShardId waiting to find shard id in clusterstate for nodes_used_collection_shard1_replica1
   [junit4]   2> 2013608 T3975 oasc.CorePropertiesLocator.writePropertiesFile ERROR Couldn't persist core properties to C:\Users\JenkinsSlave\workspace\Lucene-Solr-trunk-Windows\solr\build\solr-core\test\J0\.\org.apache.solr.cloud.CollectionsAPIDistributedZkTest-controljetty-1375478320356\nodes_used_collection_shard1_replica1\core.properties: java.io.FileNotFoundException: C:\Users\JenkinsSlave\workspace\Lucene-Solr-trunk-Windows\solr\build\solr-core\test\J0\.\org.apache.solr.cloud.CollectionsAPIDistributedZkTest-controljetty-1375478320356\nodes_used_collection_shard1_replica1\core.properties (The system cannot find the path specified)
   [junit4]   2> 2013608 T3975 oasc.CoreContainer.create Creating SolrCore 'nodes_used_collection_shard1_replica1' using instanceDir: C:\Users\JenkinsSlave\workspace\Lucene-Solr-trunk-Windows\solr\build\solr-core\test\J0\.\org.apache.solr.cloud.CollectionsAPIDistributedZkTest-controljetty-1375478320356\nodes_used_collection_shard1_replica1
   [junit4]   2> 2013609 T3975 oasc.ZkController.createCollectionZkNode Check for collection zkNode:nodes_used_collection
   [junit4]   2> 2013609 T3993 oasc.ZkController.waitForShardId waiting to find shard id in clusterstate for nodes_used_collection_shard1_replica2
   [junit4]   2> 2013610 T3975 oasc.ZkController.createCollectionZkNode Creating collection in ZooKeeper:nodes_used_collection
   [junit4]   2> 2013611 T3975 oasc.ZkController.getConfName Looking for collection configName
   [junit4]   2> 2013610 T4003 oasc.ZkController.waitForShardId waiting to find shard id in clusterstate for nodes_used_collection_shard2_replica1
   [junit4]   2> 2013611 T3993 oasc.CorePropertiesLocator.writePropertiesFile ERROR Couldn't persist core properties to C:\Users\JenkinsSlave\workspace\Lucene-Solr-trunk-Windows\solr\build\solr-core\test\J0\.\org.apache.solr.cloud.CollectionsAPIDistributedZkTest-jetty1-1375478321187\nodes_used_collection_shard1_replica2\core.properties: java.io.FileNotFoundException: C:\Users\JenkinsSlave\workspace\Lucene-Solr-trunk-Windows\solr\build\solr-core\test\J0\.\org.apache.solr.cloud.CollectionsAPIDistributedZkTest-jetty1-1375478321187\nodes_used_collection_shard1_replica2\core.properties (The system cannot find the path specified)
   [junit4]   2> 2013612 T3993 oasc.CoreContainer.create Creating SolrCore 'nodes_used_collection_shard1_replica2' using instanceDir: C:\Users\JenkinsSlave\workspace\Lucene-Solr-trunk-Windows\solr\build\solr-core\test\J0\.\org.apache.solr.cloud.CollectionsAPIDistributedZkTest-jetty1-1375478321187\nodes_used_collection_shard1_replica2
   [junit4]   2> 2013612 T3993 oasc.ZkController.createCollectionZkNode Check for collection zkNode:nodes_used_collection
   [junit4]   2> 2013613 T4003 oasc.CorePropertiesLocator.writePropertiesFile ERROR Couldn't persist core properties to C:\Users\JenkinsSlave\workspace\Lucene-Solr-trunk-Windows\solr\build\solr-core\test\J0\.\org.apache.solr.cloud.CollectionsAPIDistributedZkTest-jetty2-1375478322783\nodes_used_collection_shard2_replica1\core.properties: java.io.FileNotFoundException: C:\Users\JenkinsSlave\workspace\Lucene-Solr-trunk-Windows\solr\build\solr-core\test\J0\.\org.apache.solr.cloud.CollectionsAPIDistributedZkTest-jetty2-1375478322783\nodes_used_collection_shard2_replica1\core.properties (The system cannot find the path specified)
   [junit4]   2> 2013614 T4003 oasc.CoreContainer.create Creating SolrCore 'nodes_used_collection_shard2_replica1' using instanceDir: C:\Users\JenkinsSlave\workspace\Lucene-Solr-trunk-Windows\solr\build\solr-core\test\J0\.\org.apache.solr.cloud.CollectionsAPIDistributedZkTest-jetty2-1375478322783\nodes_used_collection_shard2_replica1
   [junit4]   2> 2013614 T4003 oasc.ZkController.createCollectionZkNode Check for collection zkNode:nodes_used_collection
   [junit4]   2> 2013613 T3975 oasc.ZkController.getConfName Only one config set found in zk - using it:conf1
   [junit4]   2> 2013615 T3975 oascc.SolrZkClient.makePath makePath: /collections/nodes_used_collection
   [junit4]   2> 2013614 T4021 oasc.ZkController.waitForShardId waiting to find shard id in clusterstate for nodes_used_collection_shard2_replica2
   [junit4]   2> 2013615 T4003 oasc.ZkController.createCollectionZkNode Creating collection in ZooKeeper:nodes_used_collection
   [junit4]   2> 2013615 T4003 oasc.ZkController.getConfName Looking for collection configName
   [junit4]   2> 2013614 T3993 oasc.ZkController.createCollectionZkNode Creating collection in ZooKeeper:nodes_used_collection
   [junit4]   2> 2013616 T3993 oasc.ZkController.getConfName Looking for collection configName
   [junit4]   2> 2013616 T4021 oasc.CorePropertiesLocator.writePropertiesFile ERROR Couldn't persist core properties to C:\Users\JenkinsSlave\workspace\Lucene-Solr-trunk-Windows\solr\build\solr-core\test\J0\.\org.apache.solr.cloud.CollectionsAPIDistributedZkTest-jetty3-1375478324407\nodes_used_collection_shard2_replica2\core.properties: java.io.FileNotFoundException: C:\Users\JenkinsSlave\workspace\Lucene-Solr-trunk-Windows\solr\build\solr-core\test\J0\.\org.apache.solr.cloud.CollectionsAPIDistributedZkTest-jetty3-1375478324407\nodes_used_collection_shard2_replica2\core.properties (The system cannot find the path specified)
   [junit4]   2> 2013617 T4021 oasc.CoreContainer.create Creating SolrCore 'nodes_used_collection_shard2_replica2' using instanceDir: C:\Users\JenkinsSlave\workspace\Lucene-Solr-trunk-Windows\solr\build\solr-core\test\J0\.\org.apache.solr.cloud.CollectionsAPIDistributedZkTest-jetty3-1375478324407\nodes_used_collection_shard2_replica2
   [junit4]   2> 2013617 T4021 oasc.ZkController.createCollectionZkNode Check for collection zkNode:nodes_used_collection
   [junit4]   2> 2013618 T4003 oasc.ZkController.getConfName Only one config set found in zk - using it:conf1
   [junit4]   2> 2013618 T4021 oasc.ZkController.createCollectionZkNode Creating collection in ZooKeeper:nodes_used_collection
   [junit4]   2> 2013618 T4021 oasc.ZkController.getConfName Looking for collection configName
   [junit4]   2> 2013618 T4003 oascc.SolrZkClient.makePath makePath: /collections/nodes_used_collection
   [junit4]   2> 2013620 T3993 oasc.ZkController.getConfName Only one config set found in zk - using it:conf1
   [junit4]   2> 2013620 T3993 oascc.SolrZkClient.makePath makePath: /collections/nodes_used_collection
   [junit4]   2> 2013621 T3975 oasc.ZkController.readConfigName Load collection config from:/collections/nodes_used_collection
   [junit4]   2> 2013621 T4021 oascc.SolrZkClient.makePath makePath: /collections/nodes_used_collection
   [junit4]   2> 2013623 T4003 oasc.ZkController.readConfigName Load collection config from:/collections/nodes_used_collection
   [junit4]   2> 2013624 T3975 oasc.SolrResourceLoader.<init> new SolrResourceLoader for directory: 'C:\Users\JenkinsSlave\workspace\Lucene-Solr-trunk-Windows\solr\build\solr-core\test\J0\.\org.apache.solr.cloud.CollectionsAPIDistributedZkTest-controljetty-1375478320356\nodes_used_collection_shard1_replica1\'
   [junit4]   2> 2013627 T4021 oasc.ZkController.readConfigName Load collection config from:/collections/nodes_used_collection
   [junit4]   2> 2013628 T3993 oasc.ZkController.readConfigName Load collection config from:/collections/nodes_used_collection
   [junit4]   2> 2013629 T4003 oasc.SolrResourceLoader.<init> new SolrResourceLoader for directory: 'C:\Users\JenkinsSlave\workspace\Lucene-Solr-trunk-Windows\solr\build\solr-core\test\J0\.\org.apache.solr.cloud.CollectionsAPIDistributedZkTest-jetty2-1375478322783\nodes_used_collection_shard2_replica1\'
   [junit4]   2> 2013635 T4021 oasc.SolrResourceLoader.<init> new SolrResourceLoader for directory: 'C:\Users\JenkinsSlave\workspace\Lucene-Solr-trunk-Windows\solr\build\solr-core\test\J0\.\org.apache.solr.cloud.CollectionsAPIDistributedZkTest-jetty3-1375478324407\nodes_used_collection_shard2_replica2\'
   [junit4]   2> 2013653 T3993 oasc.SolrResourceLoader.<init> new SolrResourceLoader for directory: 'C:\Users\JenkinsSlave\workspace\Lucene-Solr-trunk-Windows\solr\build\solr-core\test\J0\.\org.apache.solr.cloud.CollectionsAPIDistributedZkTest-jetty1-1375478321187\nodes_used_collection_shard1_replica2\'
   [junit4]   2> 2013728 T4021 oasc.SolrConfig.<init> Using Lucene MatchVersion: LUCENE_50
   [junit4]   2> 2013741 T3975 oasc.SolrConfig.<init> Using Lucene MatchVersion: LUCENE_50
   [junit4]   2> 2013758 T3993 oasc.SolrConfig.<init> Using Lucene MatchVersion: LUCENE_50
   [junit4]   2> 2013797 T4021 oasc.SolrConfig.<init> Loaded SolrConfig: solrconfig.xml
   [junit4]   2> 2013809 T4003 oasc.SolrConfig.<init> Using Lucene MatchVersion: LUCENE_50
   [junit4]   2> 2013826 T3993 oasc.SolrConfig.<init> Loaded SolrConfig: solrconfig.xml
   [junit4]   2> 2013864 T4003 oasc.SolrConfig.<init> Loaded SolrConfig: solrconfig.xml
   [junit4]   2> 2013866 T3993 oass.IndexSchema.readSchema Reading Solr Schema from schema.xml
   [junit4]   2> 2013874 T3975 oasc.SolrConfig.<init> Loaded SolrConfig: solrconfig.xml
   [junit4]   2> 2013875 T4021 oass.IndexSchema.readSchema Reading Solr Schema from schema.xml
   [junit4]   2> 2013875 T3993 oass.IndexSchema.readSchema [nodes_used_collection_shard1_replica2] Schema name=test
   [junit4]   2> 2013884 T4021 oass.IndexSchema.readSchema [nodes_used_collection_shard2_replica2] Schema name=test
   [junit4]   2> 2013897 T4003 oass.IndexSchema.readSchema Reading Solr Schema from schema.xml
   [junit4]   2> 2013943 T3975 oass.IndexSchema.readSchema Reading Solr Schema from schema.xml
   [junit4]   2> 2013952 T4003 oass.IndexSchema.readSchema [nodes_used_collection_shard2_replica1] Schema name=test
   [junit4]   2> 2014017 T3975 oass.IndexSchema.readSchema [nodes_used_collection_shard1_replica1] Schema name=test
   [junit4]   2> 2014629 T4021 oass.OpenExchangeRatesOrgProvider.init Initialized with rates=open-exchange-rates.json, refreshInterval=1440.
   [junit4]   2> 2014673 T4021 oass.IndexSchema.readSchema default search field in schema is text
   [junit4]   2> 2014677 T4021 oass.IndexSchema.readSchema unique key field: id
   [junit4]   2> 2014877 T3993 oass.OpenExchangeRatesOrgProvider.init Initialized with rates=open-exchange-rates.json, refreshInterval=1440.
   [junit4]   2> 2014883 T3993 oass.IndexSchema.readSchema default search field in schema is text
   [junit4]   2> 2014886 T3993 oass.IndexSchema.readSchema unique key field: id
   [junit4]   2> 2014903 T4021 oass.FileExchangeRateProvider.reload Reloading exchange rates from file currency.xml
   [junit4]   2> 2014908 T4021 oass.FileExchangeRateProvider.reload Reloading exchange rates from file currency.xml
   [junit4]   2> 2014912 T4021 oass.OpenExchangeRatesOrgProvider.reload Reloading exchange rates from open-exchange-rates.json
   [junit4]   2> 2014913 T4021 oass.OpenExchangeRatesOrgProvider$OpenExchangeRates.<init> WARN Unknown key IMPORTANT NOTE
   [junit4]   2> 2014914 T4021 oass.OpenExchangeRatesOrgProvider$OpenExchangeRates.<init> WARN Expected key, got STRING
   [junit4]   2> 2014914 T4021 oass.OpenExchangeRatesOrgProvider.reload Reloading exchange rates from open-exchange-rates.json
   [junit4]   2> 2014915 T4021 oass.OpenExchangeRatesOrgProvider$OpenExchangeRates.<init> WARN Unknown key IMPORTANT NOTE
   [junit4]   2> 2014915 T4021 oass.OpenExchangeRatesOrgProvider$OpenExchangeRates.<init> WARN Expected key, got STRING
   [junit4]   2> 2014915 T4021 oasc.SolrCore.initDirectoryFactory org.apache.solr.core.MockDirectoryFactory
   [junit4]   2> 2014916 T4021 oasc.SolrCore.<init> [nodes_used_collection_shard2_replica2] Opening new SolrCore at C:\Users\JenkinsSlave\workspace\Lucene-Solr-trunk-Windows\solr\build\solr-core\test\J0\.\org.apache.solr.cloud.CollectionsAPIDistributedZkTest-jetty3-1375478324407\nodes_used_collection_shard2_replica2\, dataDir=C:\Users\JenkinsSlave\workspace\Lucene-Solr-trunk-Windows\solr\build\solr-core\test\J0\.\org.apache.solr.cloud.CollectionsAPIDistributedZkTest-jetty3-1375478324407\\nodes_used_collection_shard2_replica2\data\
   [junit4]   2> 2014916 T4021 oasc.JmxMonitoredMap.<init> JMX monitoring is enabled. Adding Solr mbeans to JMX Server: com.sun.jmx.mbeanserver.JmxMBeanServer@1ffb932
   [junit4]   2> 2014959 T4021 oasc.CachingDirectoryFactory.get return new directory for C:\Users\JenkinsSlave\workspace\Lucene-Solr-trunk-Windows\solr\build\solr-core\test\J0\.\org.apache.solr.cloud.CollectionsAPIDistributedZkTest-jetty3-1375478324407\\nodes_used_collection_shard2_replica2\data\
   [junit4]   2> 2015001 T3975 oass.OpenExchangeRatesOrgProvider.init Initialized with rates=open-exchange-rates.json, refreshInterval=1440.
   [junit4]   2> 2015007 T3975 oass.IndexSchema.readSchema default search field in schema is text
   [junit4]   2> 2015011 T3975 oass.IndexSchema.readSchema unique key field: id
   [junit4]   2> 2015027 T3993 oass.FileExchangeRateProvider.reload Reloading exchange rates from file currency.xml
   [junit4]   2> 2015032 T3993 oass.FileExchangeRateProvider.reload Reloading exchange rates from file currency.xml
   [junit4]   2> 2015036 T3993 oass.OpenExchangeRatesOrgProvider.reload Reloading exchange rates from open-exchange-rates.json
   [junit4]   2> 2015038 T3993 oass.OpenExchangeRatesOrgProvider$OpenExchangeRates.<init> WARN Unknown key IMPORTANT NOTE
   [junit4]   2> 2015038 T3993 oass.OpenExchangeRatesOrgProvider$OpenExchangeRates.<init> WARN Expected key, got STRING
   [junit4]   2> 2015038 T3993 oass.OpenExchangeRatesOrgProvider.reload Reloading exchange rates from open-exchange-rates.json
   [junit4]   2> 2015041 T3975 oass.FileExchangeRateProvider.reload Reloading exchange rates from file currency.xml
   [junit4]   2> 2015041 T3993 oass.OpenExchangeRatesOrgProvider$OpenExchangeRates.<init> WARN Unknown key IMPORTANT NOTE
   [junit4]   2> 2015041 T3993 oass.OpenExchangeRatesOrgProvider$OpenExchangeRates.<init> WARN Expected key, got STRING
   [junit4]   2> 2015041 T3993 oasc.SolrCore.initDirectoryFactory org.apache.solr.core.MockDirectoryFactory
   [junit4]   2> 2015042 T3993 oasc.SolrCore.<init> [nodes_used_collection_shard1_replica2] Opening new SolrCore at C:\Users\JenkinsSlave\workspace\Lucene-Solr-trunk-Windows\solr\build\solr-core\test\J0\.\org.apache.solr.cloud.CollectionsAPIDistributedZkTest-jetty1-1375478321187\nodes_used_collection_shard1_replica2\, dataDir=C:\Users\JenkinsSlave\workspace\Lucene-Solr-trunk-Windows\solr\build\solr-core\test\J0\.\org.apache.solr.cloud.CollectionsAPIDistributedZkTest-jetty1-1375478321187\\nodes_used_collection_shard1_replica2\data\
   [junit4]   2> 2015042 T3993 oasc.JmxMonitoredMap.<init> JMX monitoring is enabled. Adding Solr mbeans to JMX Server: com.sun.jmx.mbeanserver.JmxMBeanServer@1ffb932
   [junit4]   2> 2015043 T3993 oasc.CachingDirectoryFactory.get return new directory for C:\Users\JenkinsSlave\workspace\Lucene-Solr-trunk-Windows\solr\build\solr-core\test\J0\.\org.apache.solr.cloud.CollectionsAPIDistributedZkTest-jetty1-1375478321187\\nodes_used_collection_shard1_replica2\data\
   [junit4]   2> 2015043 T3993 oasc.SolrCore.getNewIndexDir New index directory detected: old=null new=C:\Users\JenkinsSlave\workspace\Lucene-Solr-trunk-Windows\solr\build\solr-core\test\J0\.\org.apache.solr.cloud.CollectionsAPIDistributedZkTest-jetty1-1375478321187\\nodes_used_collection_shard1_replica2\data\index/
   [junit4]   2> 2015043 T3993 oasc.SolrCore.initIndex WARN [nodes_used_collection_shard1_replica2] Solr index directory 'C:\Users\JenkinsSlave\workspace\Lucene-Solr-trunk-Windows\solr\build\solr-core\test\J0\.\org.apache.solr.cloud.CollectionsAPIDistributedZkTest-jetty1-1375478321187\nodes_used_collection_shard1_replica2\data\index' doesn't exist. Creating new index...
   [junit4]   2> 2015043 T3993 oasc.CachingDirectoryFactory.get return new directory for C:\Users\JenkinsSlave\workspace\Lucene-Solr-trunk-Windows\solr\build\solr-core\test\J0\.\org.apache.solr.cloud.CollectionsAPIDistributedZkTest-jetty1-1375478321187\\nodes_used_collection_shard1_replica2\data\index
   [junit4]   2> 2015046 T4003 oass.OpenExchangeRatesOrgProvider.init Initialized with rates=open-exchange-rates.json, refreshInterval=1440.
   [junit4]   2> 2015047 T3993 oasc.SolrDeletionPolicy.onCommit SolrDeletionPolicy.onCommit: commits: num=1
   [junit4]   2> commit{dir=MockDirWrapper(org.apache.lucene.store.RAMDirectory@16121df lockFactory=org.apache.lucene.store.NativeFSLockFactory@10f6266),segFN=segments_1,generation=1}
   [junit4]   2> 2015047 T3993 oasc.SolrDeletionPolicy.updateCommits newest commit generation = 1
   [junit4]   2> 2015051 T3993 oasup.UpdateRequestProcessorChain.init inserting DistributedUpdateProcessorFactory into updateRequestProcessorChain "dedupe"
   [junit4]   2> 2015051 T3993 oasup.UpdateRequestProcessorChain.init inserting DistributedUpdateProcessorFactory into updateRequestProcessorChain "stored_sig"
   [junit4]   2> 2015052 T3993 oasup.UpdateRequestProcessorChain.init inserting DistributedUpdateProcessorFactory into updateRequestProcessorChain "distrib-dup-test-chain-implicit"
   [junit4]   2> 2015052 T3993 oasc.RequestHandlers.initHandlersFromConfig created standard: solr.StandardRequestHandler
   [junit4]   2> 2015053 T3993 oasc.RequestHandlers.initHandlersFromConfig created /get: solr.RealTimeGetHandler
   [junit4]   2> 2015053 T3993 oasc.RequestHandlers.initHandlersFromConfig adding lazy requestHandler: solr.ReplicationHandler
   [junit4]   2> 2015053 T3993 oasc.RequestHandlers.initHandlersFromConfig created /replication: solr.ReplicationHandler
   [junit4]   2> 2015054 T3993 oasc.RequestHandlers.initHandlersFromConfig created /update: solr.UpdateRequestHandler
   [junit4]   2> 2015054 T3993 oasc.RequestHandlers.initHandlersFromConfig created /admin/: org.apache.solr.handler.admin.AdminHandlers
   [junit4]   2> 2015055 T4021 oasc.SolrCore.getNewIndexDir New index directory detected: old=null new=C:\Users\JenkinsSlave\workspace\Lucene-Solr-trunk-Windows\solr\build\solr-core\test\J0\.\org.apache.solr.cloud.CollectionsAPIDistributedZkTest-jetty3-1375478324407\\nodes_used_collection_shard2_replica2\data\index/
   [junit4]   2> 2015056 T4021 oasc.SolrCore.initIndex WARN [nodes_used_collection_shard2_replica2] Solr index directory 'C:\Users\JenkinsSlave\workspace\Lucene-Solr-trunk-Windows\solr\build\solr-core\test\J0\.\org.apache.solr.cloud.CollectionsAPIDistributedZkTest-jetty3-1375478324407\nodes_used_collection_shard2_replica2\data\index' doesn't exist. Creating new index...
   [junit4]   2> 2015056 T4021 oasc.CachingDirectoryFactory.get return new directory for C:\Users\JenkinsSlave\workspace\Lucene-Solr-trunk-Windows\solr\build\solr-core\test\J0\.\org.apache.solr.cloud.CollectionsAPIDistributedZkTest-jetty3-1375478324407\\nodes_used_collection_shard2_replica2\data\index
   [junit4]   2> 2015058 T4003 oass.IndexSchema.readSchema default search field in schema is text
   [junit4]   2> 2015062 T4003 oass.IndexSchema.readSchema unique key field: id
   [junit4]   2> 2015070 T3975 oass.FileExchangeRateProvider.reload Reloading exchange rates from file currency.xml
   [junit4]   2> 2015072 T3993 oashl.XMLLoader.init xsltCacheLifetimeSeconds=60
   [junit4]   2> 2015076 T3975 oass.OpenExchangeRatesOrgProvider.reload Reloading exchange rates from open-exchange-rates.json
   [junit4]   2> 2015078 T3993 oass.SolrIndexSearcher.<init> Opening Searcher@1dbf606 main
   [junit4]   2> 2015078 T4021 oasc.SolrDeletionPolicy.onCommit SolrDeletionPolicy.onCommit: commits: num=1
   [junit4]   2> commit{dir=MockDirWrapper(org.apache.lucene.store.RAMDirectory@1b53a9e lockFactory=org.apache.lucene.store.NativeFSLockFactory@3e5cd5),segFN=segments_1,generation=1}
   [junit4]   2> 2015078 T4021 oasc.SolrDeletionPolicy.updateCommits newest commit generation = 1
   [junit4]   2> 2015079 T3975 oass.OpenExchangeRatesOrgProvider$OpenExchangeRates.<init> WARN Unknown key IMPORTANT NOTE
   [junit4]   2> 2015080 T3975 oass.OpenExchangeRatesOrgProvider$OpenExchangeRates.<init> WARN Expected key, got STRING
   [junit4]   2> 2015080 T3975 oass.OpenExchangeRatesOrgProvider.reload Reloading exchange rates from open-exchange-rates.json
   [junit4]   2> 2015081 T3993 oasu.CommitTracker.<init> Hard AutoCommit: disabled
   [junit4]   2> 2015081 T3993 oasu.CommitTracker.<init> Soft AutoCommit: disabled
   [junit4]   2> 2015083 T4021 oasup.UpdateRequestProcessorChain.init inserting DistributedUpdateProcessorFactory into updateRequestProcessorChain "dedupe"
   [junit4]   2> 2015083 T4021 oasup.UpdateRequestProcessorChain.init inserting DistributedUpdateProcessorFactory into updateRequestProcessorChain "stored_sig"
   [junit4]   2> 2015083 T4021 oasup.UpdateRequestProcessorChain.init inserting DistributedUpdateProcessorFactory into updateRequestProcessorChain "distrib-dup-test-chain-implicit"
   [junit4]   2> 2015083 T4021 oasc.RequestHandlers.initHandlersFromConfig created standard: solr.StandardRequestHandler
   [junit4]   2> 2015084 T4021 oasc.RequestHandlers.initHandlersFromConfig created /get: solr.RealTimeGetHandler
   [junit4]   2> 2015084 T4021 oasc.RequestHandlers.initHandlersFromConfig adding lazy requestHandler: solr.ReplicationHandler
   [junit4]   2> 2015085 T4021 oasc.RequestHandlers.initHandlersFromConfig created /replication: solr.ReplicationHandler
   [junit4]   2> 2015085 T4021 oasc.RequestHandlers.initHandlersFromConfig created /update: solr.UpdateRequestHandler
   [junit4]   2> 2015085 T4045 oasc.SolrCore.registerSearcher [nodes_used_collection_shard1_replica2] Registered new searcher Searcher@1dbf606 main{StandardDirectoryReader(segments_1:1)}
   [junit4]   2> 2015085 T4021 oasc.RequestHandlers.initHandlersFromConfig created /admin/: org.apache.solr.handler.admin.AdminHandlers
   [junit4]   2> 2015087 T3975 oass.OpenExchangeRatesOrgProvider$OpenExchangeRates.<init> WARN Unknown key IMPORTANT NOTE
   [junit4]   2> 2015087 T3975 oass.OpenExchangeRatesOrgProvider$OpenExchangeRates.<init> WARN Expected key, got STRING
   [junit4]   2> 2015087 T3975 oasc.SolrCore.initDirectoryFactory org.apache.solr.core.MockDirectoryFactory
   [junit4]   2> 2015088 T3975 oasc.SolrCore.<init> [nodes_used_collection_shard1_replica1] Opening new SolrCore at C:\Users\JenkinsSlave\workspace\Lucene-Solr-trunk-Windows\solr\build\solr-core\test\J0\.\org.apache.solr.cloud.CollectionsAPIDistributedZkTest-controljetty-1375478320356\nodes_used_collection_shard1_replica1\, dataDir=C:\Users\JenkinsSlave\workspace\Lucene-Solr-trunk-Windows\solr\build\solr-core\test\J0\.\org.apache.solr.cloud.CollectionsAPIDistributedZkTest-controljetty-1375478320356\\nodes_used_collection_shard1_replica1\data\
   [junit4]   2> 2015088 T3975 oasc.JmxMonitoredMap.<init> JMX monitoring is enabled. Adding Solr mbeans to JMX Server: com.sun.jmx.mbeanserver.JmxMBeanServer@1ffb932
   [junit4]   2> 2015090 T3993 oasc.CoreContainer.registerCore registering core: nodes_used_collection_shard1_replica2
   [junit4]   2> 2015090 T3993 oasc.ZkController.register Register replica - core:nodes_used_collection_shard1_replica2 address:http://127.0.0.1:57636 collection:nodes_used_collection shard:shard1
   [junit4]   2> 2015090 T3993 oascsi.HttpClientUtil.createClient Creating new http client, config:maxConnections=10000&maxConnectionsPerHost=20&connTimeout=15000&socketTimeout=30000&retry=false
   [junit4]   2> 2015094 T4021 oashl.XMLLoader.init xsltCacheLifetimeSeconds=60
   [junit4]   2> 2015095 T3975 oasc.CachingDirectoryFactory.get return new directory for C:\Users\JenkinsSlave\workspace\Lucene-Solr-trunk-Windows\solr\build\solr-core\test\J0\.\org.apache.solr.cloud.CollectionsAPIDistributedZkTest-controljetty-1375478320356\\nodes_used_collection_shard1_replica1\data\
   [junit4]   2> 2015095 T3975 oasc.SolrCore.getNewIndexDir New index directory detected: old=null new=C:\Users\JenkinsSlave\workspace\Lucene-Solr-trunk-Windows\solr\build\solr-core\test\J0\.\org.apache.solr.cloud.CollectionsAPIDistributedZkTest-controljetty-1375478320356\\nodes_used_collection_shard1_replica1\data\index/
   [junit4]   2> 2015095 T3975 oasc.SolrCore.initIndex WARN [nodes_used_collection_shard1_replica1] Solr index directory 'C:\Users\JenkinsSlave\workspace\Lucene-Solr-trunk-Windows\solr\build\solr-core\test\J0\.\org.apache.solr.cloud.CollectionsAPIDistributedZkTest-controljetty-1375478320356\nodes_used_collection_shard1_replica1\data\index' doesn't exist. Creating new index...
   [junit4]   2> 2015096 T3975 oasc.CachingDirectoryFactory.get return new directory for C:\Users\JenkinsSlave\workspace\Lucene-Solr-trunk-Windows\solr\build\solr-core\test\J0\.\org.apache.solr.cloud.CollectionsAPIDistributedZkTest-controljetty-1375478320356\\nodes_used_collection_shard1_replica1\data\index
   [junit4]   2> 2015101 T4003 oass.FileExchangeRateProvider.reload Reloading exchange rates from file currency.xml
   [junit4]   2> 2015107 T4021 oass.SolrIndexSearcher.<init> Opening Searcher@3c3992 main
   [junit4]   2> 2015108 T4021 oasu.CommitTracker.<init> Hard AutoCommit: disabled
   [junit4]   2> 2015109 T4021 oasu.CommitTracker.<init> Soft AutoCommit: disabled
   [junit4]   2> 2015109 T3975 oasc.SolrDeletionPolicy.onCommit SolrDeletionPolicy.onCommit: commits: num=1
   [junit4]   2> commit{dir=MockDirWrapper(org.apache.lucene.store.RAMDirectory@19da819 lockFactory=org.apache.lucene.store.NativeFSLockFactory@1359a7b),segFN=segments_1,generation=1}
   [junit4]   2> 2015111 T3975 oasc.SolrDeletionPolicy.updateCommits newest commit generation = 1
   [junit4]   2> 2015112 T4003 oass.FileExchangeRateProvider.reload Reloading exchange rates from file currency.xml
   [junit4]   2> 2015113 T3993 oascc.SolrZkClient.makePath makePath: /collections/nodes_used_collection/leader_elect/shard1/election
   [junit4]   2> 2015115 T4021 oasc.CoreContainer.registerCore registering core: nodes_used_collection_shard2_replica2
   [junit4]   2> 2015116 T3975 oasup.UpdateRequestProcessorChain.init inserting DistributedUpdateProcessorFactory into updateRequestProcessorChain "dedupe"
   [junit4]   2> 2015116 T3975 oasup.UpdateRequestProcessorChain.init inserting DistributedUpdateProcessorFactory into updateRequestProcessorChain "stored_sig"
   [junit4]   2> 2015116 T4046 oasc.SolrCore.registerSearcher [nodes_used_collection_shard2_replica2] Registered new searcher Searcher@3c3992 main{StandardDirectoryReader(segments_1:1)}
   [junit4]   2> 2015116 T3975 oasup.UpdateRequestProcessorChain.init inserting DistributedUpdateProcessorFactory into updateRequestProcessorChain "distrib-dup-test-chain-implicit"
   [junit4]   2> 2015117 T3975 oasc.RequestHandlers.initHandlersFromConfig created standard: solr.StandardRequestHandler
   [junit4]   2> 2015118 T3975 oasc.RequestHandlers.initHandlersFromConfig created /get: solr.RealTimeGetHandler
   [junit4]   2> 2015118 T3975 oasc.RequestHandlers.initHandlersFromConfig adding lazy requestHandler: solr.ReplicationHandler
   [junit4]   2> 2015118 T3975 oasc.RequestHandlers.initHandlersFromConfig created /replication: solr.ReplicationHandler
   [junit4]   2> 2015118 T3975 oasc.RequestHandlers.initHandlersFromConfig created /update: solr.UpdateRequestHandler
   [junit4]   2> 2015119 T3975 oasc.RequestHandlers.initHandlersFromConfig created /admin/: org.apache.solr.handler.admin.AdminHandlers
   [junit4]   2> 2015123 T4021 oasc.ZkController.register Register replica - core:nodes_used_collection_shard2_replica2 address:http://127.0.0.1:57654 collection:nodes_used_collection shard:shard2
   [junit4]   2> 2015123 T4021 oascsi.HttpClientUtil.createClient Creating new http client, config:maxConnections=10000&maxConnectionsPerHost=20&connTimeout=15000&socketTimeout=30000&retry=false
   [junit4]   2> 2015129 T4003 oass.OpenExchangeRatesOrgProvider.reload Reloading exchange rates from open-exchange-rates.json
   [junit4]   2> 2015134 T4021 oascc.SolrZkClient.makePath makePath: /collections/nodes_used_collection/leader_elect/shard2/election
   [junit4]   2> 2015135 T4003 oass.OpenExchangeRatesOrgProvider$OpenExchangeRates.<init> WARN Unknown key IMPORTANT NOTE
   [junit4]   2> 2015135 T4003 oass.OpenExchangeRatesOrgProvider$OpenExchangeRates.<init> WARN Expected key, got STRING
   [junit4]   2> 2015135 T4003 oass.OpenExchangeRatesOrgProvider.reload Reloading exchange rates from open-exchange-rates.json
   [junit4]   2> 2015138 T4003 oass.OpenExchangeRatesOrgProvider$OpenExchangeRates.<init> WARN Unknown key IMPORTANT NOTE
   [junit4]   2> 2015138 T4003 oass.OpenExchangeRatesOrgProvider$OpenExchangeRates.<init> WARN Expected key, got STRING
   [junit4]   2> 2015139 T4003 oasc.SolrCore.initDirectoryFactory org.apache.solr.core.MockDirectoryFactory
   [junit4]   2> 2015139 T3975 oashl.XMLLoader.init xsltCacheLifetimeSeconds=60
   [junit4]   2> 2015139 T4003 oasc.SolrCore.<init> [nodes_used_collection_shard2_replica1] Opening new SolrCore at C:\Users\JenkinsSlave\workspace\Lucene-Solr-trunk-Windows\solr\build\solr-core\test\J0\.\org.apache.solr.cloud.CollectionsAPIDistributedZkTest-jetty2-1375478322783\nodes_used_collection_shard2_replica1\, dataDir=C:\Users\JenkinsSlave\workspace\Lucene-Solr-trunk-Windows\solr\build\solr-core\test\J0\.\org.apache.solr.cloud.CollectionsAPIDistributedZkTest-jetty2-1375478322783\\nodes_used_collection_shard2_replica1\data\
   [junit4]   2> 2015140 T4003 oasc.JmxMonitoredMap.<init> JMX monitoring is enabled. Adding Solr mbeans to JMX Server: com.sun.jmx.mbeanserver.JmxMBeanServer@1ffb932
   [junit4]   2> 2015144 T4003 oasc.CachingDirectoryFactory.get return new directory for C:\Users\JenkinsSlave\workspace\Lucene-Solr-trunk-Windows\solr\build\solr-core\test\J0\.\org.apache.solr.cloud.CollectionsAPIDistributedZkTest-jetty2-1375478322783\\nodes_used_collection_shard2_replica1\data\
   [junit4]   2> 2015144 T4003 oasc.SolrCore.getNewIndexDir New index directory detected: old=null new=C:\Users\JenkinsSlave\workspace\Lucene-Solr-trunk-Windows\solr\build\solr-core\test\J0\.\org.apache.solr.cloud.CollectionsAPIDistributedZkTest-jetty2-1375478322783\\nodes_used_collection_shard2_replica1\data\index/
   [junit4]   2> 2015144 T4003 oasc.SolrCore.initIndex WARN [nodes_used_collection_shard2_replica1] Solr index directory 'C:\Users\JenkinsSlave\workspace\Lucene-Solr-trunk-Windows\solr\build\solr-core\test\J0\.\org.apache.solr.cloud.CollectionsAPIDistributedZkTest-jetty2-1375478322783\nodes_used_collection_shard2_replica1\data\index' doesn't exist. Creating new index...
   [junit4]   2> 2015144 T4003 oasc.CachingDirectoryFactory.get return new directory for C:\Users\JenkinsSlave\workspace\Lucene-Solr-trunk-Windows\solr\build\solr-core\test\J0\.\org.apache.solr.cloud.CollectionsAPIDistributedZkTest-jetty2-1375478322783\\nodes_used_collection_shard2_replica1\data\index
   [junit4]   2> 2015151 T3993 oasc.ShardLeaderElectionContext.runLeaderProcess Running the leader process for shard shard1
   [junit4]   2> 2015153 T4003 oasc.SolrDeletionPolicy.onCommit SolrDeletionPolicy.onCommit: commits: num=1
   [junit4]   2> commit{dir=MockDirWrapper(org.apache.lucene.store.RAMDirectory@566879 lockFactory=org.apache.lucene.store.NativeFSLockFactory@1149770),segFN=segments_1,generation=1}
   [junit4]   2> 2015154 T4003 oasc.SolrDeletionPolicy.updateCommits newest commit generation = 1
   [junit4]   2> 2015156 T4021 oasc.ShardLeaderElectionContext.runLeaderProcess Running the leader process for shard shard2
   [junit4]   2> 2015157 T3975 oass.SolrIndexSearcher.<init> Opening Searcher@1e1c698 main
   [junit4]   2> 2015159 T3993 oasc.ShardLeaderElectionContext.waitForReplicasToComeUp Waiting until we see more replicas up for shard shard1: total=2 found=1 timeoutin=179998
   [junit4]   2> 2015160 T4003 oasup.UpdateRequestProcessorChain.init inserting DistributedUpdateProcessorFactory into updateRequestProcessorChain "dedupe"
   [junit4]   2> 2015160 T4003 oasup.UpdateRequestProcessorChain.init inserting DistributedUpdateProcessorFactory into updateRequestProcessorChain "stored_sig"
   [junit4]   2> 2015161 T4021 oasc.ShardLeaderElectionContext.waitForReplicasToComeUp Waiting until we see more replicas up for shard shard2: total=2 found=1 timeoutin=179999
   [junit4]   2> 2015161 T4003 oasup.UpdateRequestProcessorChain.init inserting DistributedUpdateProcessorFactory into updateRequestProcessorChain "distrib-dup-test-chain-implicit"
   [junit4]   2> 2015162 T4003 oasc.RequestHandlers.initHandlersFromConfig created standard: solr.StandardRequestHandler
   [junit4]   2> 2015162 T3975 oasu.CommitTracker.<init> Hard AutoCommit: disabled
   [junit4]   2> 2015162 T4003 oasc.RequestHandlers.initHandlersFromConfig created /get: solr.RealTimeGetHandler
   [junit4]   2> 2015163 T4003 oasc.RequestHandlers.initHandlersFromConfig adding lazy requestHandler: solr.ReplicationHandler
   [junit4]   2> 2015163 T3975 oasu.CommitTracker.<init> Soft AutoCommit: disabled
   [junit4]   2> 2015163 T4003 oasc.RequestHandlers.initHandlersFromConfig created /replication: solr.ReplicationHandler
   [junit4]   2> 2015163 T4003 oasc.RequestHandlers.initHandlersFromConfig created /update: solr.UpdateRequestHandler
   [junit4]   2> 2015164 T4003 oasc.RequestHandlers.initHandlersFromConfig created /admin/: org.apache.solr.handler.admin.AdminHandlers
   [junit4]   2> 2015165 T4047 oasc.SolrCore.registerSearcher [nodes_used_collection_shard1_replica1] Registered new searcher Searcher@1e1c698 main{StandardDirectoryReader(segments_1:1)}
   [junit4]   2> 2015167 T3975 oasc.CoreContainer.registerCore registering core: nodes_used_collection_shard1_replica1
   [junit4]   2> 2015167 T3975 oasc.ZkController.register Register replica - core:nodes_used_collection_shard1_replica1 address:http://127.0.0.1:57624 collection:nodes_used_collection shard:shard1
   [junit4]   2> 2015167 T3975 oascsi.HttpClientUtil.createClient Creating new http client, config:maxConnections=10000&maxConnectionsPerHost=20&connTimeout=15000&socketTimeout=30000&retry=false
   [junit4]   2> 2015171 T4003 oashl.XMLLoader.init xsltCacheLifetimeSeconds=60
   [junit4]   2> 2015177 T4003 oass.SolrIndexSearcher.<init> Opening Searcher@96c372 main
   [junit4]   2> 2015179 T4003 oasu.CommitTracker.<init> Hard AutoCommit: disabled
   [junit4]   2> 2015179 T4003 oasu.CommitTracker.<init> Soft AutoCommit: disabled
   [junit4]   2> 2015183 T4048 oasc.SolrCore.registerSearcher [nodes_used_collection_shard2_replica1] Registered new searcher Searcher@96c372 main{StandardDirectoryReader(segments_1:1)}
   [junit4]   2> 2015183 T4003 oasc.CoreContainer.registerCore registering core: nodes_used_collection_shard2_replica1
   [junit4]   2> 2015184 T4003 oasc.ZkController.register Register replica - core:nodes_used_collection_shard2_replica1 address:http://127.0.0.1:57645 collection:nodes_used_collection shard:shard2
   [junit4]   2> 2015184 T4003 oascsi.HttpClientUtil.createClient Creating new http client, config:maxConnections=10000&maxConnectionsPerHost=20&connTimeout=15000&socketTimeout=30000&retry=false
   [junit4]   2> 2015518 T3993 oasc.ShardLeaderElectionContext.waitForReplicasToComeUp Enough replicas found to continue.
   [junit4]   2> 2015519 T3993 oasc.ShardLeaderElectionContext.runLeaderProcess I may be the new leader - try and sync
   [junit4]   2> 2015519 T3993 oasc.SyncStrategy.sync Sync replicas to http://127.0.0.1:57636/nodes_used_collection_shard1_replica2/
   [junit4]   2> 2015519 T3993 oasu.PeerSync.sync PeerSync: core=nodes_used_collection_shard1_replica2 url=http://127.0.0.1:57636 START replicas=[http://127.0.0.1:57624/nodes_used_collection_shard1_replica1/] nUpdates=100
   [junit4]   2> 2015520 T3993 oasu.PeerSync.sync PeerSync: core=nodes_used_collection_shard1_replica2 url=http://127.0.0.1:57636 DONE.  We have no versions.  sync failed.
   [junit4]   2> 2015520 T3993 oasc.SyncStrategy.syncReplicas Leader's attempt to sync with shard failed, moving to the next candidate
   [junit4]   2> 2015520 T3993 oasc.ShardLeaderElectionContext.runLeaderProcess We failed sync, but we have no versions - we can't sync in that case - we were active before, so become leader anyway
   [junit4]   2> 2015521 T3993 oasc.ShardLeaderElectionContext.runLeaderProcess I

[...truncated too long message...]

st effort to remove C:\Users\JenkinsSlave\workspace\Lucene-Solr-trunk-Windows\solr\build\solr-core\test\J0\.\org.apache.solr.cloud.CollectionsAPIDistributedZkTest-1375478320195\zookeeper\server1 FAILED !!!!!
   [junit4]   2> !!!! WARNING: best effort to remove C:\Users\JenkinsSlave\workspace\Lucene-Solr-trunk-Windows\solr\build\solr-core\test\J0\.\org.apache.solr.cloud.CollectionsAPIDistributedZkTest-1375478320195\zookeeper FAILED !!!!!
   [junit4]   2> !!!! WARNING: best effort to remove C:\Users\JenkinsSlave\workspace\Lucene-Solr-trunk-Windows\solr\build\solr-core\test\J0\.\org.apache.solr.cloud.CollectionsAPIDistributedZkTest-1375478320195 FAILED !!!!!
   [junit4]   2> 2144832 T3957 oas.SolrTestCaseJ4.tearDown ###Ending testDistribSearch
   [junit4]   2> 2144835 T3957 oasc.ZkTestServer.send4LetterWord connecting to 127.0.0.1:57617 57617
   [junit4]   1> client port:0.0.0.0/0.0.0.0:0
   [junit4]   2> NOTE: reproduce with: ant test  -Dtestcase=CollectionsAPIDistributedZkTest -Dtests.method=testDistribSearch -Dtests.seed=A25E7672844E3346 -Dtests.slow=true -Dtests.locale=vi_VN -Dtests.timezone=America/Scoresbysund -Dtests.file.encoding=ISO-8859-1
   [junit4] ERROR    143s | CollectionsAPIDistributedZkTest.testDistribSearch <<<
   [junit4]    > Throwable #1: org.apache.solr.client.solrj.SolrServerException: Server refused connection at: http://127.0.0.1:57645
   [junit4]    > at __randomizedtesting.SeedInfo.seed([A25E7672844E3346:23B8F86AF311537A]:0)
   [junit4]    > at org.apache.solr.client.solrj.impl.HttpSolrServer.request(HttpSolrServer.java:428)
   [junit4]    > at org.apache.solr.client.solrj.impl.HttpSolrServer.request(HttpSolrServer.java:180)
   [junit4]    > at org.apache.solr.cloud.AbstractFullDistribZkTestBase.createCollection(AbstractFullDistribZkTestBase.java:1535)
   [junit4]    > at org.apache.solr.cloud.CollectionsAPIDistributedZkTest.testCustomCollectionsAPI(CollectionsAPIDistributedZkTest.java:677)
   [junit4]    > at org.apache.solr.cloud.CollectionsAPIDistributedZkTest.doTest(CollectionsAPIDistributedZkTest.java:159)
   [junit4]    > at org.apache.solr.BaseDistributedSearchTestCase.testDistribSearch(BaseDistributedSearchTestCase.java:835)
   [junit4]    > at java.lang.Thread.run(Thread.java:724)
   [junit4]    > Caused by: org.apache.http.conn.HttpHostConnectException: Connection to http://127.0.0.1:57645 refused
   [junit4]    > at org.apache.http.impl.conn.DefaultClientConnectionOperator.openConnection(DefaultClientConnectionOperator.java:190)
   [junit4]    > at org.apache.http.impl.conn.ManagedClientConnectionImpl.open(ManagedClientConnectionImpl.java:294)
   [junit4]    > at org.apache.http.impl.client.DefaultRequestDirector.tryConnect(DefaultRequestDirector.java:645)
   [junit4]    > at org.apache.http.impl.client.DefaultRequestDirector.execute(DefaultRequestDirector.java:480)
   [junit4]    > at org.apache.http.impl.client.AbstractHttpClient.execute(AbstractHttpClient.java:906)
   [junit4]    > at org.apache.http.impl.client.AbstractHttpClient.execute(AbstractHttpClient.java:805)
   [junit4]    > at org.apache.http.impl.client.AbstractHttpClient.execute(AbstractHttpClient.java:784)
   [junit4]    > at org.apache.solr.client.solrj.impl.HttpSolrServer.request(HttpSolrServer.java:365)
   [junit4]    > ... 45 more
   [junit4]    > Caused by: java.net.ConnectException: Connection refused: connect
   [junit4]    > at java.net.DualStackPlainSocketImpl.waitForConnect(Native Method)
   [junit4]    > at java.net.DualStackPlainSocketImpl.socketConnect(DualStackPlainSocketImpl.java:85)
   [junit4]    > at java.net.AbstractPlainSocketImpl.doConnect(AbstractPlainSocketImpl.java:339)
   [junit4]    > at java.net.AbstractPlainSocketImpl.connectToAddress(AbstractPlainSocketImpl.java:200)
   [junit4]    > at java.net.AbstractPlainSocketImpl.connect(AbstractPlainSocketImpl.java:182)
   [junit4]    > at java.net.PlainSocketImpl.connect(PlainSocketImpl.java:172)
   [junit4]    > at java.net.SocksSocketImpl.connect(SocksSocketImpl.java:392)
   [junit4]    > at java.net.Socket.connect(Socket.java:579)
   [junit4]    > at org.apache.http.conn.scheme.PlainSocketFactory.connectSocket(PlainSocketFactory.java:127)
   [junit4]    > at org.apache.http.impl.conn.DefaultClientConnectionOperator.openConnection(DefaultClientConnectionOperator.java:180)
   [junit4]    > ... 52 more
   [junit4]   2> 2147405 T3957 oas.SolrTestCaseJ4.deleteCore ###deleteCore
   [junit4]   2> NOTE: test params are: codec=Lucene42: {timestamp=PostingsFormat(name=TestBloomFilteredLucene41Postings), range_facet_l=PostingsFormat(name=TestBloomFilteredLucene41Postings), id=PostingsFormat(name=Lucene41WithOrds), range_facet_sl=PostingsFormat(name=Lucene41WithOrds), a_t=PostingsFormat(name=TestBloomFilteredLucene41Postings), text=PostingsFormat(name=Asserting), range_facet_si=PostingsFormat(name=TestBloomFilteredLucene41Postings), _version_=Lucene41(blocksize=128), other_tl1=Lucene41(blocksize=128), multiDefault=PostingsFormat(name=TestBloomFilteredLucene41Postings), a_si=Lucene41(blocksize=128), intDefault=Lucene41(blocksize=128)}, docValues:{timestamp=DocValuesFormat(name=Lucene42)}, sim=DefaultSimilarity, locale=vi_VN, timezone=America/Scoresbysund
   [junit4]   2> NOTE: Windows 7 6.1 x86/Oracle Corporation 1.7.0_25 (32-bit)/cpus=2,threads=1,free=57630856,total=326828032
   [junit4]   2> NOTE: All tests run in this JVM: [TestConfig, TestSolrJ, TestFastLRUCache, ShowFileRequestHandlerTest, TestSolrXmlPersistence, TestUpdate, DirectUpdateHandlerOptimizeTest, SuggesterFSTTest, HdfsLockFactoryTest, UUIDFieldTest, SimpleFacetsTest, SliceStateTest, TestLuceneMatchVersion, TestSolrIndexConfig, FastVectorHighlighterTest, TestSolrDeletionPolicy1, TestStressVersions, TestMaxScoreQueryParser, TestRecovery, ScriptEngineTest, BasicDistributedZk2Test, ResponseLogComponentTest, TestCloudManagedSchema, ReturnFieldsTest, DistributedTermsComponentTest, TestFastWriter, TestCSVLoader, TestWordDelimiterFilterFactory, DirectUpdateHandlerTest, SoftAutoCommitTest, TestCharFilters, DirectSolrConnectionTest, AlternateDirectoryTest, TestStressReorder, SolrPluginUtilsTest, TestReloadAndDeleteDocs, TestAnalyzedSuggestions, TestSolrXMLSerializer, ExternalFileFieldSortTest, SolrIndexSplitterTest, TestFastOutputStream, BadIndexSchemaTest, SampleTest, MinimalSchemaTest, ShardRoutingTest, TestBadConfig, TestAtomicUpdateErrorCases, TestXIncludeConfig, JsonLoaderTest, UnloadDistributedZkTest, TestPseudoReturnFields, TestReload, SynonymTokenizerTest, PingRequestHandlerTest, UpdateParamsTest, ChaosMonkeySafeLeaderTest, LukeRequestHandlerTest, TestLFUCache, TestSurroundQueryParser, SolrCmdDistributorTest, HighlighterConfigTest, DocValuesMultiTest, TermsComponentTest, TestDynamicFieldResource, RegexBoostProcessorTest, TestReversedWildcardFilterFactory, TestRangeQuery, XmlUpdateRequestHandlerTest, XsltUpdateRequestHandlerTest, TestPostingsSolrHighlighter, UpdateRequestProcessorFactoryTest, TestTrie, TestCollationField, NumericFieldsTest, SliceStateUpdateTest, OverseerCollectionProcessorTest, SignatureUpdateProcessorFactoryTest, CachingDirectoryFactoryTest, OverseerTest, RequiredFieldsTest, TestSolrQueryParserResource, SuggesterTSTTest, BasicFunctionalityTest, MoreLikeThisHandlerTest, ClusterStateTest, TestFiltering, TestDistributedSearch, StatsComponentTest, TestFunctionQuery, SolrTestCaseJ4Test, BasicDistributedZkTest, TestUniqueKeyFieldResource, TestFaceting, TestLMJelinekMercerSimilarityFactory, BasicZkTest, BlockCacheTest, DistributedSpellCheckComponentTest, SpellingQueryConverterTest, HdfsChaosMonkeySafeLeaderTest, TestPluginEnable, TestSolr4Spatial, TestRandomFaceting, ZkNodePropsTest, DisMaxRequestHandlerTest, TestGroupingSearch, TestPhraseSuggestions, TestSort, TestAddFieldRealTimeGet, TestDocSet, SpellCheckCollatorTest, MBeansHandlerTest, DocValuesTest, DefaultValueUpdateProcessorTest, RecoveryZkTest, BadCopyFieldTest, SolrCoreCheckLockOnStartupTest, PrimitiveFieldTypeTest, JSONWriterTest, TestCopyFieldCollectionResource, TestFieldTypeCollectionResource, LoggingHandlerTest, IndexReaderFactoryTest, TestWriterPerf, LeaderElectionTest, TestStressRecovery, HardAutoCommitTest, TestPHPSerializedResponseWriter, PolyFieldTest, TestStressLucene, TestClassNameShortening, TestSolrXml, AssignTest, HdfsDirectoryTest, SolrRequestParserTest, SimplePostToolTest, QueryParsingTest, HdfsBasicDistributedZkTest, CurrencyFieldOpenExchangeTest, SchemaVersionSpecificBehaviorTest, PeerSyncTest, TestQueryTypes, TestPartialUpdateDeduplication, TestRandomMergePolicy, CollectionsAPIDistributedZkTest]
   [junit4] Completed in 143.04s, 1 test, 1 error <<< FAILURES!

[...truncated 522 lines...]
BUILD FAILED
C:\Users\JenkinsSlave\workspace\Lucene-Solr-trunk-Windows\build.xml:389: The following error occurred while executing this line:
C:\Users\JenkinsSlave\workspace\Lucene-Solr-trunk-Windows\build.xml:369: The following error occurred while executing this line:
C:\Users\JenkinsSlave\workspace\Lucene-Solr-trunk-Windows\build.xml:39: The following error occurred while executing this line:
C:\Users\JenkinsSlave\workspace\Lucene-Solr-trunk-Windows\solr\build.xml:181: The following error occurred while executing this line:
C:\Users\JenkinsSlave\workspace\Lucene-Solr-trunk-Windows\solr\common-build.xml:449: The following error occurred while executing this line:
C:\Users\JenkinsSlave\workspace\Lucene-Solr-trunk-Windows\lucene\common-build.xml:1230: The following error occurred while executing this line:
C:\Users\JenkinsSlave\workspace\Lucene-Solr-trunk-Windows\lucene\common-build.xml:873: There were test failures: 320 suites, 1347 tests, 1 error, 39 ignored (11 assumptions)

Total time: 83 minutes 11 seconds
Build step 'Invoke Ant' marked build as failure
Description set: Java: 32bit/jdk1.7.0_25 -client -XX:+UseParallelGC
Archiving artifacts
Recording test results
Email was triggered for: Failure
Sending email for trigger: Failure




---------------------------------------------------------------------
To unsubscribe, e-mail: [hidden email]
For additional commands, e-mail: [hidden email]