Lucene-Solr-tests-only-trunk - Build # 1002 - Failure

classic Classic list List threaded Threaded
1 message Options
Reply | Threaded
Open this post in threaded view
|

Lucene-Solr-tests-only-trunk - Build # 1002 - Failure

Apache Jenkins Server
Build: https://hudson.apache.org/hudson/job/Lucene-Solr-tests-only-trunk/1002/

13 tests failed.
REGRESSION:  org.apache.solr.cloud.CloudStateUpdateTest.testCoreRegistration

Error Message:
null

Stack Trace:
org.apache.solr.common.cloud.ZooKeeperException:
        at org.apache.solr.cloud.ZkController.init(ZkController.java:280)
        at org.apache.solr.cloud.ZkController.<init>(ZkController.java:133)
        at org.apache.solr.core.CoreContainer.initZooKeeper(CoreContainer.java:159)
        at org.apache.solr.core.CoreContainer.load(CoreContainer.java:338)
        at org.apache.solr.core.CoreContainer.load(CoreContainer.java:294)
        at org.apache.solr.core.CoreContainer$Initializer.initialize(CoreContainer.java:243)
        at org.apache.solr.cloud.CloudStateUpdateTest.setUp(CloudStateUpdateTest.java:112)
        at org.apache.lucene.util.LuceneTestCase$LuceneTestCaseRunner.runChild(LuceneTestCase.java:878)
        at org.apache.lucene.util.LuceneTestCase$LuceneTestCaseRunner.runChild(LuceneTestCase.java:844)
Caused by: org.apache.zookeeper.KeeperException$ConnectionLossException: KeeperErrorCode = ConnectionLoss for /live_nodes
        at org.apache.zookeeper.KeeperException.create(KeeperException.java:90)
        at org.apache.zookeeper.KeeperException.create(KeeperException.java:42)
        at org.apache.zookeeper.ZooKeeper.create(ZooKeeper.java:637)
        at org.apache.solr.common.cloud.SolrZkClient.makePath(SolrZkClient.java:348)
        at org.apache.solr.common.cloud.SolrZkClient.makePath(SolrZkClient.java:309)
        at org.apache.solr.common.cloud.SolrZkClient.makePath(SolrZkClient.java:291)
        at org.apache.solr.common.cloud.SolrZkClient.makePath(SolrZkClient.java:256)
        at org.apache.solr.cloud.ZkController.init(ZkController.java:275)


REGRESSION:  org.apache.solr.handler.TestReplicationHandler.testReplicateAfterWrite2Slave

Error Message:
http://localhost:62529/solr/replication?command=disableReplication

Stack Trace:
java.io.FileNotFoundException: http://localhost:62529/solr/replication?command=disableReplication
        at sun.net.www.protocol.http.HttpURLConnection.getInputStream(HttpURLConnection.java:1267)
        at java.net.URL.openStream(URL.java:1029)
        at org.apache.solr.handler.TestReplicationHandler.testReplicateAfterWrite2Slave(TestReplicationHandler.java:173)
        at org.apache.lucene.util.LuceneTestCase$LuceneTestCaseRunner.runChild(LuceneTestCase.java:878)
        at org.apache.lucene.util.LuceneTestCase$LuceneTestCaseRunner.runChild(LuceneTestCase.java:844)


REGRESSION:  org.apache.solr.handler.TestReplicationHandler.testIndexAndConfigReplication

Error Message:
expected:<498> but was:<499>

Stack Trace:
junit.framework.AssertionFailedError: expected:<498> but was:<499>
        at org.apache.lucene.util.LuceneTestCase$LuceneTestCaseRunner.runChild(LuceneTestCase.java:878)
        at org.apache.lucene.util.LuceneTestCase$LuceneTestCaseRunner.runChild(LuceneTestCase.java:844)
        at org.apache.solr.handler.TestReplicationHandler.testIndexAndConfigReplication(TestReplicationHandler.java:240)


REGRESSION:  org.apache.solr.handler.TestReplicationHandler.testStopPoll

Error Message:
expected:<497> but was:<0>

Stack Trace:
junit.framework.AssertionFailedError: expected:<497> but was:<0>
        at org.apache.lucene.util.LuceneTestCase$LuceneTestCaseRunner.runChild(LuceneTestCase.java:878)
        at org.apache.lucene.util.LuceneTestCase$LuceneTestCaseRunner.runChild(LuceneTestCase.java:844)
        at org.apache.solr.handler.TestReplicationHandler.testStopPoll(TestReplicationHandler.java:303)


REGRESSION:  org.apache.solr.handler.TestReplicationHandler.testSnapPullWithMasterUrl

Error Message:
http://localhost:62735/solr/replication?command=fetchindex&masterUrl=http://localhost:62529/solr/replication

Stack Trace:
java.io.FileNotFoundException: http://localhost:62735/solr/replication?command=fetchindex&masterUrl=http://localhost:62529/solr/replication
        at sun.net.www.protocol.http.HttpURLConnection.getInputStream(HttpURLConnection.java:1267)
        at java.net.URL.openStream(URL.java:1029)
        at org.apache.solr.handler.TestReplicationHandler.testSnapPullWithMasterUrl(TestReplicationHandler.java:375)
        at org.apache.lucene.util.LuceneTestCase$LuceneTestCaseRunner.runChild(LuceneTestCase.java:878)
        at org.apache.lucene.util.LuceneTestCase$LuceneTestCaseRunner.runChild(LuceneTestCase.java:844)


REGRESSION:  org.apache.solr.handler.TestReplicationHandler.testReplicateAfterStartup

Error Message:
expected:<495> but was:<0>

Stack Trace:
junit.framework.AssertionFailedError: expected:<495> but was:<0>
        at org.apache.lucene.util.LuceneTestCase$LuceneTestCaseRunner.runChild(LuceneTestCase.java:878)
        at org.apache.lucene.util.LuceneTestCase$LuceneTestCaseRunner.runChild(LuceneTestCase.java:844)
        at org.apache.solr.handler.TestReplicationHandler.testReplicateAfterStartup(TestReplicationHandler.java:433)


REGRESSION:  org.apache.solr.handler.TestReplicationHandler.testIndexAndConfigAliasReplication

Error Message:
expected:<494> but was:<0>

Stack Trace:
junit.framework.AssertionFailedError: expected:<494> but was:<0>
        at org.apache.lucene.util.LuceneTestCase$LuceneTestCaseRunner.runChild(LuceneTestCase.java:878)
        at org.apache.lucene.util.LuceneTestCase$LuceneTestCaseRunner.runChild(LuceneTestCase.java:844)
        at org.apache.solr.handler.TestReplicationHandler.testIndexAndConfigAliasReplication(TestReplicationHandler.java:471)


REGRESSION:  org.apache.solr.handler.TestReplicationHandler.testBackup

Error Message:
http://localhost:64062/solr/replication?command=details

Stack Trace:
junit.framework.AssertionFailedError: http://localhost:64062/solr/replication?command=details
        at org.apache.lucene.util.LuceneTestCase$LuceneTestCaseRunner.runChild(LuceneTestCase.java:878)
        at org.apache.lucene.util.LuceneTestCase$LuceneTestCaseRunner.runChild(LuceneTestCase.java:844)
        at org.apache.solr.handler.TestReplicationHandler.testBackup(TestReplicationHandler.java:592)


FAILED:  junit.framework.TestSuite.org.apache.solr.handler.component.QueryElevationComponentTest

Error Message:
org.apache.solr.common.SolrException: Error initializing QueryElevationComponent.

Stack Trace:
java.lang.RuntimeException: org.apache.solr.common.SolrException: Error initializing QueryElevationComponent.
        at org.apache.solr.util.TestHarness.<init>(TestHarness.java:152)
        at org.apache.solr.util.TestHarness.<init>(TestHarness.java:134)
        at org.apache.solr.util.TestHarness.<init>(TestHarness.java:124)
        at org.apache.solr.SolrTestCaseJ4.initCore(SolrTestCaseJ4.java:233)
        at org.apache.solr.SolrTestCaseJ4.initCore(SolrTestCaseJ4.java:96)
        at org.apache.solr.SolrTestCaseJ4.initCore(SolrTestCaseJ4.java:84)
        at org.apache.solr.handler.component.QueryElevationComponentTest.beforeClass(QueryElevationComponentTest.java:50)
Caused by: org.apache.solr.common.SolrException: Error initializing QueryElevationComponent.
        at org.apache.solr.handler.component.QueryElevationComponent.inform(QueryElevationComponent.java:212)
        at org.apache.solr.core.SolrResourceLoader.inform(SolrResourceLoader.java:539)
        at org.apache.solr.core.SolrCore.<init>(SolrCore.java:592)
        at org.apache.solr.util.TestHarness$Initializer.initialize(TestHarness.java:190)
        at org.apache.solr.util.TestHarness.<init>(TestHarness.java:139)
Caused by: java.io.FileNotFoundException: /usr/home/hudson/hudson-slave/workspace/Lucene-Solr-tests-only-trunk/checkout/solr/build/test-results/temp/2/solrtest-QueryElevationComponentTest-1288938479948/elevate.xml (No such file or directory)
        at java.io.FileInputStream.open(Native Method)
        at java.io.FileInputStream.<init>(FileInputStream.java:137)
        at org.apache.solr.util.VersionedFile.getLatestFile(VersionedFile.java:79)
        at org.apache.solr.handler.component.QueryElevationComponent.getElevationMap(QueryElevationComponent.java:232)
        at org.apache.solr.handler.component.QueryElevationComponent.inform(QueryElevationComponent.java:204)


FAILED:  junit.framework.TestSuite.org.apache.solr.handler.component.QueryElevationComponentTest

Error Message:
ERROR: SolrIndexSearcher opens=1 closes=0

Stack Trace:
junit.framework.AssertionFailedError: ERROR: SolrIndexSearcher opens=1 closes=0
        at org.apache.solr.SolrTestCaseJ4.endTrackingSearchers(SolrTestCaseJ4.java:114)
        at org.apache.solr.SolrTestCaseJ4.deleteCore(SolrTestCaseJ4.java:288)
        at org.apache.solr.SolrTestCaseJ4.afterClassSolrTestCase(SolrTestCaseJ4.java:65)


REGRESSION:  org.apache.solr.servlet.NoCacheHeaderTest.testLastModified

Error Message:
Unknown request response expected:<0> but was:<500>

Stack Trace:
junit.framework.AssertionFailedError: Unknown request response expected:<0> but was:<500>
        at org.apache.lucene.util.LuceneTestCase$LuceneTestCaseRunner.runChild(LuceneTestCase.java:878)
        at org.apache.lucene.util.LuceneTestCase$LuceneTestCaseRunner.runChild(LuceneTestCase.java:844)
        at org.apache.solr.servlet.CacheHeaderTestBase.checkResponseBody(CacheHeaderTestBase.java:91)
        at org.apache.solr.servlet.NoCacheHeaderTest.doLastModified(NoCacheHeaderTest.java:64)
        at org.apache.solr.servlet.NoCacheHeaderTest.testLastModified(NoCacheHeaderTest.java:42)


REGRESSION:  org.apache.solr.servlet.NoCacheHeaderTest.testEtag

Error Message:
Unknown request response expected:<0> but was:<500>

Stack Trace:
junit.framework.AssertionFailedError: Unknown request response expected:<0> but was:<500>
        at org.apache.lucene.util.LuceneTestCase$LuceneTestCaseRunner.runChild(LuceneTestCase.java:878)
        at org.apache.lucene.util.LuceneTestCase$LuceneTestCaseRunner.runChild(LuceneTestCase.java:844)
        at org.apache.solr.servlet.CacheHeaderTestBase.checkResponseBody(CacheHeaderTestBase.java:91)
        at org.apache.solr.servlet.NoCacheHeaderTest.doETag(NoCacheHeaderTest.java:113)
        at org.apache.solr.servlet.NoCacheHeaderTest.testEtag(NoCacheHeaderTest.java:48)


REGRESSION:  org.apache.solr.servlet.NoCacheHeaderTest.testCacheControl

Error Message:
Unknown request response expected:<0> but was:<500>

Stack Trace:
junit.framework.AssertionFailedError: Unknown request response expected:<0> but was:<500>
        at org.apache.lucene.util.LuceneTestCase$LuceneTestCaseRunner.runChild(LuceneTestCase.java:878)
        at org.apache.lucene.util.LuceneTestCase$LuceneTestCaseRunner.runChild(LuceneTestCase.java:844)
        at org.apache.solr.servlet.CacheHeaderTestBase.checkResponseBody(CacheHeaderTestBase.java:91)
        at org.apache.solr.servlet.NoCacheHeaderTest.doCacheControl(NoCacheHeaderTest.java:161)
        at org.apache.solr.servlet.NoCacheHeaderTest.testCacheControl(NoCacheHeaderTest.java:54)




Build Log (for compile errors):
[...truncated 9315 lines...]



---------------------------------------------------------------------
To unsubscribe, e-mail: [hidden email]
For additional commands, e-mail: [hidden email]