Lucene-Solr-tests-only-trunk - Build # 484 - Failure

classic Classic list List threaded Threaded
1 message Options
Reply | Threaded
Open this post in threaded view
|

Lucene-Solr-tests-only-trunk - Build # 484 - Failure

Apache Jenkins Server
Build: http://hudson.zones.apache.org/hudson/job/Lucene-Solr-tests-only-trunk/484/

6 tests failed.
REGRESSION:  org.apache.solr.TestGroupingSearch.testGroupingGroupSortingScore_basic

Error Message:
Exception during query

Stack Trace:
java.lang.RuntimeException: Exception during query
        at org.apache.solr.SolrTestCaseJ4.assertQ(SolrTestCaseJ4.java:368)
        at org.apache.solr.SolrTestCaseJ4.assertQ(SolrTestCaseJ4.java:335)
        at org.apache.solr.TestGroupingSearch.testGroupingGroupSortingScore_basic(TestGroupingSearch.java:47)
        at org.apache.lucene.util.LuceneTestCase$LuceneTestCaseRunner.runChild(LuceneTestCase.java:882)
        at org.apache.lucene.util.LuceneTestCase$LuceneTestCaseRunner.runChild(LuceneTestCase.java:848)
Caused by: org.apache.solr.common.SolrException: Unknown query type 'func'
        at org.apache.solr.core.SolrCore.getQueryPlugin(SolrCore.java:1508)
        at org.apache.solr.search.QParser.getParser(QParser.java:286)
        at org.apache.solr.handler.component.QueryComponent.process(QueryComponent.java:330)
        at org.apache.solr.handler.component.SearchHandler.handleRequestBody(SearchHandler.java:231)
        at org.apache.solr.handler.RequestHandlerBase.handleRequest(RequestHandlerBase.java:131)
        at org.apache.solr.core.SolrCore.execute(SolrCore.java:1359)
        at org.apache.solr.util.TestHarness.queryAndResponse(TestHarness.java:348)
        at org.apache.solr.util.TestHarness.query(TestHarness.java:331)
        at org.apache.solr.util.TestHarness.query(TestHarness.java:316)
        at org.apache.solr.SolrTestCaseJ4.assertQ(SolrTestCaseJ4.java:342)


REGRESSION:  org.apache.solr.TestGroupingSearch.testGroupingGroupSortingScore_basicWithGroupSortEqualToSort

Error Message:
Exception during query

Stack Trace:
java.lang.RuntimeException: Exception during query
        at org.apache.solr.SolrTestCaseJ4.assertQ(SolrTestCaseJ4.java:368)
        at org.apache.solr.SolrTestCaseJ4.assertQ(SolrTestCaseJ4.java:335)
        at org.apache.solr.TestGroupingSearch.testGroupingGroupSortingScore_basicWithGroupSortEqualToSort(TestGroupingSearch.java:77)
        at org.apache.lucene.util.LuceneTestCase$LuceneTestCaseRunner.runChild(LuceneTestCase.java:882)
        at org.apache.lucene.util.LuceneTestCase$LuceneTestCaseRunner.runChild(LuceneTestCase.java:848)
Caused by: org.apache.solr.common.SolrException: Unknown query type 'func'
        at org.apache.solr.core.SolrCore.getQueryPlugin(SolrCore.java:1508)
        at org.apache.solr.search.QParser.getParser(QParser.java:286)
        at org.apache.solr.handler.component.QueryComponent.process(QueryComponent.java:330)
        at org.apache.solr.handler.component.SearchHandler.handleRequestBody(SearchHandler.java:231)
        at org.apache.solr.handler.RequestHandlerBase.handleRequest(RequestHandlerBase.java:131)
        at org.apache.solr.core.SolrCore.execute(SolrCore.java:1359)
        at org.apache.solr.util.TestHarness.queryAndResponse(TestHarness.java:348)
        at org.apache.solr.util.TestHarness.query(TestHarness.java:331)
        at org.apache.solr.util.TestHarness.query(TestHarness.java:316)
        at org.apache.solr.SolrTestCaseJ4.assertQ(SolrTestCaseJ4.java:342)


REGRESSION:  org.apache.solr.TestGroupingSearch.testGroupingGroupSortingName

Error Message:
Exception during query

Stack Trace:
java.lang.RuntimeException: Exception during query
        at org.apache.solr.SolrTestCaseJ4.assertQ(SolrTestCaseJ4.java:368)
        at org.apache.solr.SolrTestCaseJ4.assertQ(SolrTestCaseJ4.java:335)
        at org.apache.solr.TestGroupingSearch.testGroupingGroupSortingName(TestGroupingSearch.java:103)
        at org.apache.lucene.util.LuceneTestCase$LuceneTestCaseRunner.runChild(LuceneTestCase.java:882)
        at org.apache.lucene.util.LuceneTestCase$LuceneTestCaseRunner.runChild(LuceneTestCase.java:848)
Caused by: org.apache.solr.common.SolrException: Unknown query type 'func'
        at org.apache.solr.core.SolrCore.getQueryPlugin(SolrCore.java:1508)
        at org.apache.solr.search.QParser.getParser(QParser.java:286)
        at org.apache.solr.handler.component.QueryComponent.process(QueryComponent.java:330)
        at org.apache.solr.handler.component.SearchHandler.handleRequestBody(SearchHandler.java:231)
        at org.apache.solr.handler.RequestHandlerBase.handleRequest(RequestHandlerBase.java:131)
        at org.apache.solr.core.SolrCore.execute(SolrCore.java:1359)
        at org.apache.solr.util.TestHarness.queryAndResponse(TestHarness.java:348)
        at org.apache.solr.util.TestHarness.query(TestHarness.java:331)
        at org.apache.solr.util.TestHarness.query(TestHarness.java:316)
        at org.apache.solr.SolrTestCaseJ4.assertQ(SolrTestCaseJ4.java:342)


REGRESSION:  org.apache.solr.TestGroupingSearch.testGroupingGroupSortingWeight

Error Message:
Exception during query

Stack Trace:
java.lang.RuntimeException: Exception during query
        at org.apache.solr.SolrTestCaseJ4.assertQ(SolrTestCaseJ4.java:368)
        at org.apache.solr.SolrTestCaseJ4.assertQ(SolrTestCaseJ4.java:335)
        at org.apache.solr.TestGroupingSearch.testGroupingGroupSortingWeight(TestGroupingSearch.java:125)
        at org.apache.lucene.util.LuceneTestCase$LuceneTestCaseRunner.runChild(LuceneTestCase.java:882)
        at org.apache.lucene.util.LuceneTestCase$LuceneTestCaseRunner.runChild(LuceneTestCase.java:848)
Caused by: org.apache.solr.common.SolrException: Unknown query type 'func'
        at org.apache.solr.core.SolrCore.getQueryPlugin(SolrCore.java:1508)
        at org.apache.solr.search.QParser.getParser(QParser.java:286)
        at org.apache.solr.handler.component.QueryComponent.process(QueryComponent.java:330)
        at org.apache.solr.handler.component.SearchHandler.handleRequestBody(SearchHandler.java:231)
        at org.apache.solr.handler.RequestHandlerBase.handleRequest(RequestHandlerBase.java:131)
        at org.apache.solr.core.SolrCore.execute(SolrCore.java:1359)
        at org.apache.solr.util.TestHarness.queryAndResponse(TestHarness.java:348)
        at org.apache.solr.util.TestHarness.query(TestHarness.java:331)
        at org.apache.solr.util.TestHarness.query(TestHarness.java:316)
        at org.apache.solr.SolrTestCaseJ4.assertQ(SolrTestCaseJ4.java:342)


REGRESSION:  org.apache.solr.TestGroupingSearch.testGroupAPI

Error Message:
Exception during query

Stack Trace:
java.lang.RuntimeException: Exception during query
        at org.apache.solr.SolrTestCaseJ4.assertQ(SolrTestCaseJ4.java:368)
        at org.apache.solr.SolrTestCaseJ4.assertQ(SolrTestCaseJ4.java:335)
        at org.apache.solr.TestGroupingSearch.testGroupAPI(TestGroupingSearch.java:166)
        at org.apache.lucene.util.LuceneTestCase$LuceneTestCaseRunner.runChild(LuceneTestCase.java:882)
        at org.apache.lucene.util.LuceneTestCase$LuceneTestCaseRunner.runChild(LuceneTestCase.java:848)
Caused by: org.apache.solr.common.SolrException: Unknown query type 'func'
        at org.apache.solr.core.SolrCore.getQueryPlugin(SolrCore.java:1508)
        at org.apache.solr.search.QParser.getParser(QParser.java:286)
        at org.apache.solr.handler.component.QueryComponent.prepare(QueryComponent.java:92)
        at org.apache.solr.handler.component.SearchHandler.handleRequestBody(SearchHandler.java:210)
        at org.apache.solr.handler.RequestHandlerBase.handleRequest(RequestHandlerBase.java:131)
        at org.apache.solr.core.SolrCore.execute(SolrCore.java:1359)
        at org.apache.solr.util.TestHarness.queryAndResponse(TestHarness.java:348)
        at org.apache.solr.util.TestHarness.query(TestHarness.java:331)
        at org.apache.solr.util.TestHarness.query(TestHarness.java:316)
        at org.apache.solr.SolrTestCaseJ4.assertQ(SolrTestCaseJ4.java:342)


REGRESSION:  org.apache.solr.cloud.BasicDistributedZkTest.testDistribSearch

Error Message:
Error executing query

Stack Trace:
org.apache.solr.client.solrj.SolrServerException: Error executing query
        at org.apache.solr.client.solrj.request.QueryRequest.process(QueryRequest.java:95)
        at org.apache.solr.client.solrj.SolrServer.query(SolrServer.java:119)
        at org.apache.solr.BaseDistributedSearchTestCase.query(BaseDistributedSearchTestCase.java:301)
        at org.apache.solr.cloud.BasicDistributedZkTest.doTest(BasicDistributedZkTest.java:138)
        at org.apache.solr.BaseDistributedSearchTestCase.testDistribSearch(BaseDistributedSearchTestCase.java:562)
        at org.apache.lucene.util.LuceneTestCase$LuceneTestCaseRunner.runChild(LuceneTestCase.java:882)
        at org.apache.lucene.util.LuceneTestCase$LuceneTestCaseRunner.runChild(LuceneTestCase.java:848)
Caused by: org.apache.solr.common.SolrException: Unknown query type 'func'

Unknown query type 'func'

request: http://localhost:19584/solr/select?q={!func}a_si&wt=javabin&version=2
        at org.apache.solr.client.solrj.impl.CommonsHttpSolrServer.request(CommonsHttpSolrServer.java:435)
        at org.apache.solr.client.solrj.impl.CommonsHttpSolrServer.request(CommonsHttpSolrServer.java:244)
        at org.apache.solr.client.solrj.request.QueryRequest.process(QueryRequest.java:89)




Build Log (for compile errors):
[...truncated 9215 lines...]



---------------------------------------------------------------------
To unsubscribe, e-mail: [hidden email]
For additional commands, e-mail: [hidden email]