RE: [JENKINS] Lucene-Solr-master-Linux (64bit/jdk-12.0.2) - Build # 28332 - Failure!

Previous Topic Next Topic
 
classic Classic list List threaded Threaded
1 message Options
Reply | Threaded
Open this post in threaded view
|

RE: [JENKINS] Lucene-Solr-master-Linux (64bit/jdk-12.0.2) - Build # 28332 - Failure!

Uwe Schindler
Hi Noble,

this file and directory is still there, just empty:
https://github.com/apache/lucene-solr/blob/master/solr/core/src/test/org/apache/solr/cloud/rule/RulesTest.java

This causes license check to fail.

Uwe

-----
Uwe Schindler
Achterdiek 19, D-28357 Bremen
https://www.thetaphi.de
eMail: [hidden email]

> -----Original Message-----
> From: Policeman Jenkins Server <[hidden email]>
> Sent: Thursday, October 15, 2020 1:20 PM
> To: [hidden email]
> Subject: [JENKINS] Lucene-Solr-master-Linux (64bit/jdk-12.0.2) - Build # 28332 -
> Failure!
>
> Build: https://jenkins.thetaphi.de/job/Lucene-Solr-master-Linux/28332/
> Java: 64bit/jdk-12.0.2 -XX:+UseCompressedOops -XX:+UseSerialGC
>
> All tests passed
>
> Build Log:
> [...truncated 1617 lines...]
> BUILD FAILED in 49m 13s
> 854 actionable tasks: 854 executed
> Build step 'Invoke Gradle script' changed build result to FAILURE
> Build step 'Invoke Gradle script' marked build as failure
> Archiving artifacts
> [Java] Skipping execution of recorder since overall result is 'FAILURE'
> Recording test results
> [Checks API] No suitable checks publisher found.
> Email was triggered for: Failure - Any
> Sending email for trigger: Failure - Any


---------------------------------------------------------------------
To unsubscribe, e-mail: [hidden email]
For additional commands, e-mail: [hidden email]