RE: [JENKINS] Lucene-Solr-master-Windows (64bit/jdk-12.0.2) - Build # 9425 - Failure!

Previous Topic Next Topic
 
classic Classic list List threaded Threaded
1 message Options
Reply | Threaded
Open this post in threaded view
|

RE: [JENKINS] Lucene-Solr-master-Windows (64bit/jdk-12.0.2) - Build # 9425 - Failure!

Uwe Schindler
Fixed. For some reason the pull request checker was happy.

-----
Uwe Schindler
Achterdiek 19, D-28357 Bremen
https://www.thetaphi.de
eMail: [hidden email]

> -----Original Message-----
> From: Policeman Jenkins Server <[hidden email]>
> Sent: Friday, October 9, 2020 3:43 PM
> To: [hidden email]
> Subject: [JENKINS] Lucene-Solr-master-Windows (64bit/jdk-12.0.2) - Build #
> 9425 - Failure!
>
> Build: https://jenkins.thetaphi.de/job/Lucene-Solr-master-Windows/9425/
> Java: 64bit/jdk-12.0.2 -XX:+UseCompressedOops -XX:+UseSerialGC
>
> No tests ran.
>
> Build Log:
> [...truncated 47 lines...]
> BUILD FAILED in 38s
> Build step 'Invoke Gradle script' changed build result to FAILURE
> Build step 'Invoke Gradle script' marked build as failure
> Archiving artifacts
> [Java] Skipping execution of recorder since overall result is 'FAILURE'
> Recording test results
> ERROR: Step ‘Publish JUnit test result report’ failed: No test report files were
> found. Configuration error?
> [Checks API] No suitable checks publisher found.
> Email was triggered for: Failure - Any
> Sending email for trigger: Failure - Any


---------------------------------------------------------------------
To unsubscribe, e-mail: [hidden email]
For additional commands, e-mail: [hidden email]