Re: [JENKINS] Lucene » Lucene-Solr-NightlyTests-master - Build # 36 - Still unstable!

Previous Topic Next Topic
 
classic Classic list List threaded Threaded
3 messages Options
Reply | Threaded
Open this post in threaded view
|

Re: [JENKINS] Lucene » Lucene-Solr-NightlyTests-master - Build # 36 - Still unstable!

Dawid Weiss-2
Is this something that should be expected in this test?

On Tue, Sep 15, 2020 at 7:10 AM Apache Jenkins Server
<[hidden email]> wrote:

>
> Build: https://ci-builds.apache.org/job/Lucene/job/Lucene-Solr-NightlyTests-master/36/
>
> 1 tests failed.
> FAILED:  org.apache.lucene.index.TestIndexWriterOnDiskFull.testAddDocumentOnDiskFull
>
> Error Message:
> java.lang.IllegalStateException: this writer hit an unrecoverable error; cannot commit
>
> Stack Trace:
> java.lang.IllegalStateException: this writer hit an unrecoverable error; cannot commit
>         at __randomizedtesting.SeedInfo.seed([EA01BBF439B87FAE:6619838BC42DA96A]:0)
>         at org.apache.lucene.index.IndexWriter.prepareCommitInternal(IndexWriter.java:3323)
>         at org.apache.lucene.index.IndexWriter.commitInternal(IndexWriter.java:3754)
>         at org.apache.lucene.index.IndexWriter.shutdown(IndexWriter.java:1237)
>         at org.apache.lucene.index.IndexWriter.close(IndexWriter.java:1278)
>         at org.apache.lucene.index.TestIndexWriterOnDiskFull.testAddDocumentOnDiskFull(TestIndexWriterOnDiskFull.java:104)
>         at java.base/jdk.internal.reflect.NativeMethodAccessorImpl.invoke0(Native Method)
>         at java.base/jdk.internal.reflect.NativeMethodAccessorImpl.invoke(NativeMethodAccessorImpl.java:62)
>         at java.base/jdk.internal.reflect.DelegatingMethodAccessorImpl.invoke(DelegatingMethodAccessorImpl.java:43)
>         at java.base/java.lang.reflect.Method.invoke(Method.java:566)
>         at com.carrotsearch.randomizedtesting.RandomizedRunner.invoke(RandomizedRunner.java:1754)
>         at com.carrotsearch.randomizedtesting.RandomizedRunner$8.evaluate(RandomizedRunner.java:942)
>         at com.carrotsearch.randomizedtesting.RandomizedRunner$9.evaluate(RandomizedRunner.java:978)
>         at com.carrotsearch.randomizedtesting.RandomizedRunner$10.evaluate(RandomizedRunner.java:992)
>         at org.apache.lucene.util.TestRuleSetupTeardownChained$1.evaluate(TestRuleSetupTeardownChained.java:49)
>         at org.apache.lucene.util.AbstractBeforeAfterRule$1.evaluate(AbstractBeforeAfterRule.java:45)
>         at org.apache.lucene.util.TestRuleThreadAndTestName$1.evaluate(TestRuleThreadAndTestName.java:48)
>         at org.apache.lucene.util.TestRuleIgnoreAfterMaxFailures$1.evaluate(TestRuleIgnoreAfterMaxFailures.java:64)
>         at org.apache.lucene.util.TestRuleMarkFailure$1.evaluate(TestRuleMarkFailure.java:47)
>         at com.carrotsearch.randomizedtesting.rules.StatementAdapter.evaluate(StatementAdapter.java:36)
>         at com.carrotsearch.randomizedtesting.ThreadLeakControl$StatementRunner.run(ThreadLeakControl.java:370)
>         at com.carrotsearch.randomizedtesting.ThreadLeakControl.forkTimeoutingTask(ThreadLeakControl.java:819)
>         at com.carrotsearch.randomizedtesting.ThreadLeakControl$3.evaluate(ThreadLeakControl.java:470)
>         at com.carrotsearch.randomizedtesting.RandomizedRunner.runSingleTest(RandomizedRunner.java:951)
>         at com.carrotsearch.randomizedtesting.RandomizedRunner$5.evaluate(RandomizedRunner.java:836)
>         at com.carrotsearch.randomizedtesting.RandomizedRunner$6.evaluate(RandomizedRunner.java:887)
>         at com.carrotsearch.randomizedtesting.RandomizedRunner$7.evaluate(RandomizedRunner.java:898)
>         at org.apache.lucene.util.AbstractBeforeAfterRule$1.evaluate(AbstractBeforeAfterRule.java:45)
>         at com.carrotsearch.randomizedtesting.rules.StatementAdapter.evaluate(StatementAdapter.java:36)
>         at org.apache.lucene.util.TestRuleStoreClassName$1.evaluate(TestRuleStoreClassName.java:41)
>         at com.carrotsearch.randomizedtesting.rules.NoShadowingOrOverridesOnMethodsRule$1.evaluate(NoShadowingOrOverridesOnMethodsRule.java:40)
>         at com.carrotsearch.randomizedtesting.rules.NoShadowingOrOverridesOnMethodsRule$1.evaluate(NoShadowingOrOverridesOnMethodsRule.java:40)
>         at com.carrotsearch.randomizedtesting.rules.StatementAdapter.evaluate(StatementAdapter.java:36)
>         at com.carrotsearch.randomizedtesting.rules.StatementAdapter.evaluate(StatementAdapter.java:36)
>         at org.apache.lucene.util.TestRuleAssertionsRequired$1.evaluate(TestRuleAssertionsRequired.java:53)
>         at org.apache.lucene.util.TestRuleMarkFailure$1.evaluate(TestRuleMarkFailure.java:47)
>         at org.apache.lucene.util.TestRuleIgnoreAfterMaxFailures$1.evaluate(TestRuleIgnoreAfterMaxFailures.java:64)
>         at org.apache.lucene.util.TestRuleIgnoreTestSuites$1.evaluate(TestRuleIgnoreTestSuites.java:54)
>         at com.carrotsearch.randomizedtesting.rules.StatementAdapter.evaluate(StatementAdapter.java:36)
>         at com.carrotsearch.randomizedtesting.ThreadLeakControl$StatementRunner.run(ThreadLeakControl.java:370)
>         at com.carrotsearch.randomizedtesting.ThreadLeakControl.lambda$forkTimeoutingTask$0(ThreadLeakControl.java:826)
>         at java.base/java.lang.Thread.run(Thread.java:834)
> Caused by: java.io.IOException: fake disk full at 5415 bytes when writing _2.fdm (file length=0)
>         at org.apache.lucene.store.MockIndexOutputWrapper.checkDiskFull(MockIndexOutputWrapper.java:87)
>         at org.apache.lucene.store.MockIndexOutputWrapper.writeBytes(MockIndexOutputWrapper.java:133)
>         at org.apache.lucene.store.MockIndexOutputWrapper.writeByte(MockIndexOutputWrapper.java:126)
>         at org.apache.lucene.store.RateLimitedIndexOutput.writeByte(RateLimitedIndexOutput.java:66)
>         at org.apache.lucene.store.DataOutput.writeInt(DataOutput.java:70)
>         at org.apache.lucene.codecs.CodecUtil.writeHeader(CodecUtil.java:90)
>         at org.apache.lucene.codecs.CodecUtil.writeIndexHeader(CodecUtil.java:133)
>         at org.apache.lucene.codecs.compressing.CompressingStoredFieldsWriter.<init>(CompressingStoredFieldsWriter.java:119)
>         at org.apache.lucene.codecs.compressing.CompressingStoredFieldsFormat.fieldsWriter(CompressingStoredFieldsFormat.java:130)
>         at org.apache.lucene.codecs.lucene87.Lucene87StoredFieldsFormat.fieldsWriter(Lucene87StoredFieldsFormat.java:141)
>         at org.apache.lucene.codecs.asserting.AssertingStoredFieldsFormat.fieldsWriter(AssertingStoredFieldsFormat.java:48)
>         at org.apache.lucene.index.SegmentMerger.mergeFields(SegmentMerger.java:227)
>         at org.apache.lucene.index.SegmentMerger.merge(SegmentMerger.java:105)
>         at org.apache.lucene.index.IndexWriter.mergeMiddle(IndexWriter.java:4743)
>         at org.apache.lucene.index.IndexWriter.merge(IndexWriter.java:4347)
>         at org.apache.lucene.index.IndexWriter$IndexWriterMergeSource.merge(IndexWriter.java:5898)
>         at org.apache.lucene.index.ConcurrentMergeScheduler.doMerge(ConcurrentMergeScheduler.java:624)
>         at org.apache.lucene.index.ConcurrentMergeScheduler$MergeThread.run(ConcurrentMergeScheduler.java:682)
>
>
>
>
> Build Log:
> [...truncated 763 lines...]
> ERROR: The following test(s) have failed:
>   - org.apache.lucene.index.TestIndexWriterOnDiskFull.testAddDocumentOnDiskFull (:lucene:core)
>     Test output: /home/jenkins/jenkins-slave/workspace/Lucene/Lucene-Solr-NightlyTests-master/checkout/lucene/core/build/test-results/test/outputs/OUTPUT-org.apache.lucene.index.TestIndexWriterOnDiskFull.txt
>     Reproduce with: gradlew :lucene:core:test --tests "org.apache.lucene.index.TestIndexWriterOnDiskFull" -Ptests.jvms=4 -Ptests.haltonfailure=false -Ptests.jvmargs=-XX:TieredStopAtLevel=1 -Ptests.seed=EA01BBF439B87FAE -Ptests.multiplier=2 -Ptests.nightly=true -Ptests.badapples=false -Ptests.file.encoding=US-ASCII -Ptests.linedocsfile=/home/jenkins/jenkins-slave/workspace/Lucene/Lucene-Solr-NightlyTests-master/test-data/enwiki.random.lines.txt
>
>
> Deprecated Gradle features were used in this build, making it incompatible with Gradle 7.0.
> Use '--warning-mode all' to show the individual deprecation warnings.
> See https://docs.gradle.org/6.4.1/userguide/command_line_interface.html#sec:command_line_warnings
>
> BUILD SUCCESSFUL in 5h 2m 21s
> 269 actionable tasks: 269 executed
> Build step 'Invoke Gradle script' changed build result to SUCCESS
> Archiving artifacts
> java.lang.InterruptedException: no matches found within 10000
>         at hudson.FilePath$ValidateAntFileMask.hasMatch(FilePath.java:2826)
>         at hudson.FilePath$ValidateAntFileMask.invoke(FilePath.java:2705)
>         at hudson.FilePath$ValidateAntFileMask.invoke(FilePath.java:2686)
>         at hudson.FilePath$FileCallableWrapper.call(FilePath.java:3073)
> Also:   hudson.remoting.Channel$CallSiteStackTrace: Remote call to lucene1
>                 at hudson.remoting.Channel.attachCallSiteStackTrace(Channel.java:1788)
>                 at hudson.remoting.UserRequest$ExceptionResponse.retrieve(UserRequest.java:356)
>                 at hudson.remoting.Channel.call(Channel.java:998)
>                 at hudson.FilePath.act(FilePath.java:1069)
>                 at hudson.FilePath.act(FilePath.java:1058)
>                 at hudson.FilePath.validateAntFileMask(FilePath.java:2684)
>                 at hudson.tasks.ArtifactArchiver.perform(ArtifactArchiver.java:265)
>                 at hudson.tasks.BuildStepCompatibilityLayer.perform(BuildStepCompatibilityLayer.java:78)
>                 at hudson.tasks.BuildStepMonitor$1.perform(BuildStepMonitor.java:20)
>                 at hudson.model.AbstractBuild$AbstractBuildExecution.perform(AbstractBuild.java:741)
>                 at hudson.model.AbstractBuild$AbstractBuildExecution.performAllBuildSteps(AbstractBuild.java:690)
>                 at hudson.model.Build$BuildExecution.post2(Build.java:186)
>                 at hudson.model.AbstractBuild$AbstractBuildExecution.post(AbstractBuild.java:635)
>                 at hudson.model.Run.execute(Run.java:1905)
>                 at hudson.model.FreeStyleBuild.run(FreeStyleBuild.java:43)
>                 at hudson.model.ResourceController.execute(ResourceController.java:97)
>                 at hudson.model.Executor.run(Executor.java:428)
> Caused: hudson.FilePath$TunneledInterruptedException
>         at hudson.FilePath$FileCallableWrapper.call(FilePath.java:3075)
>         at hudson.remoting.UserRequest.perform(UserRequest.java:211)
>         at hudson.remoting.UserRequest.perform(UserRequest.java:54)
>         at hudson.remoting.Request$2.run(Request.java:369)
>         at hudson.remoting.InterceptingExecutorService$1.call(InterceptingExecutorService.java:72)
>         at java.util.concurrent.FutureTask.run(FutureTask.java:266)
>         at java.util.concurrent.ThreadPoolExecutor.runWorker(ThreadPoolExecutor.java:1149)
>         at java.util.concurrent.ThreadPoolExecutor$Worker.run(ThreadPoolExecutor.java:624)
>         at java.lang.Thread.run(Thread.java:748)
> Caused: java.lang.InterruptedException: java.lang.InterruptedException: no matches found within 10000
>         at hudson.FilePath.act(FilePath.java:1071)
>         at hudson.FilePath.act(FilePath.java:1058)
>         at hudson.FilePath.validateAntFileMask(FilePath.java:2684)
>         at hudson.tasks.ArtifactArchiver.perform(ArtifactArchiver.java:265)
>         at hudson.tasks.BuildStepCompatibilityLayer.perform(BuildStepCompatibilityLayer.java:78)
>         at hudson.tasks.BuildStepMonitor$1.perform(BuildStepMonitor.java:20)
>         at hudson.model.AbstractBuild$AbstractBuildExecution.perform(AbstractBuild.java:741)
>         at hudson.model.AbstractBuild$AbstractBuildExecution.performAllBuildSteps(AbstractBuild.java:690)
>         at hudson.model.Build$BuildExecution.post2(Build.java:186)
>         at hudson.model.AbstractBuild$AbstractBuildExecution.post(AbstractBuild.java:635)
>         at hudson.model.Run.execute(Run.java:1905)
>         at hudson.model.FreeStyleBuild.run(FreeStyleBuild.java:43)
>         at hudson.model.ResourceController.execute(ResourceController.java:97)
>         at hudson.model.Executor.run(Executor.java:428)
> No artifacts found that match the file pattern "**/*.events,heapdumps/**,**/hs_err_pid*". Configuration error?
> Recording test results
> Build step 'Publish JUnit test result report' changed build result to UNSTABLE
> Email was triggered for: Unstable (Test Failures)
> Sending email for trigger: Unstable (Test Failures)
>
> ---------------------------------------------------------------------
> To unsubscribe, e-mail: [hidden email]
> For additional commands, e-mail: [hidden email]

---------------------------------------------------------------------
To unsubscribe, e-mail: [hidden email]
For additional commands, e-mail: [hidden email]

Reply | Threaded
Open this post in threaded view
|

Re: [JENKINS] Lucene » Lucene-Solr-NightlyTests-master - Build # 36 - Still unstable!

Michael Sokolov-4
I guess this IndexWriter has issues with commitment? 

On Tue, Sep 15, 2020, 12:15 PM Dawid Weiss <[hidden email]> wrote:
Is this something that should be expected in this test?

On Tue, Sep 15, 2020 at 7:10 AM Apache Jenkins Server
<[hidden email]> wrote:
>
> Build: https://ci-builds.apache.org/job/Lucene/job/Lucene-Solr-NightlyTests-master/36/
>
> 1 tests failed.
> FAILED:  org.apache.lucene.index.TestIndexWriterOnDiskFull.testAddDocumentOnDiskFull
>
> Error Message:
> java.lang.IllegalStateException: this writer hit an unrecoverable error; cannot commit
>
> Stack Trace:
> java.lang.IllegalStateException: this writer hit an unrecoverable error; cannot commit
>         at __randomizedtesting.SeedInfo.seed([EA01BBF439B87FAE:6619838BC42DA96A]:0)
>         at org.apache.lucene.index.IndexWriter.prepareCommitInternal(IndexWriter.java:3323)
>         at org.apache.lucene.index.IndexWriter.commitInternal(IndexWriter.java:3754)
>         at org.apache.lucene.index.IndexWriter.shutdown(IndexWriter.java:1237)
>         at org.apache.lucene.index.IndexWriter.close(IndexWriter.java:1278)
>         at org.apache.lucene.index.TestIndexWriterOnDiskFull.testAddDocumentOnDiskFull(TestIndexWriterOnDiskFull.java:104)
>         at java.base/jdk.internal.reflect.NativeMethodAccessorImpl.invoke0(Native Method)
>         at java.base/jdk.internal.reflect.NativeMethodAccessorImpl.invoke(NativeMethodAccessorImpl.java:62)
>         at java.base/jdk.internal.reflect.DelegatingMethodAccessorImpl.invoke(DelegatingMethodAccessorImpl.java:43)
>         at java.base/java.lang.reflect.Method.invoke(Method.java:566)
>         at com.carrotsearch.randomizedtesting.RandomizedRunner.invoke(RandomizedRunner.java:1754)
>         at com.carrotsearch.randomizedtesting.RandomizedRunner$8.evaluate(RandomizedRunner.java:942)
>         at com.carrotsearch.randomizedtesting.RandomizedRunner$9.evaluate(RandomizedRunner.java:978)
>         at com.carrotsearch.randomizedtesting.RandomizedRunner$10.evaluate(RandomizedRunner.java:992)
>         at org.apache.lucene.util.TestRuleSetupTeardownChained$1.evaluate(TestRuleSetupTeardownChained.java:49)
>         at org.apache.lucene.util.AbstractBeforeAfterRule$1.evaluate(AbstractBeforeAfterRule.java:45)
>         at org.apache.lucene.util.TestRuleThreadAndTestName$1.evaluate(TestRuleThreadAndTestName.java:48)
>         at org.apache.lucene.util.TestRuleIgnoreAfterMaxFailures$1.evaluate(TestRuleIgnoreAfterMaxFailures.java:64)
>         at org.apache.lucene.util.TestRuleMarkFailure$1.evaluate(TestRuleMarkFailure.java:47)
>         at com.carrotsearch.randomizedtesting.rules.StatementAdapter.evaluate(StatementAdapter.java:36)
>         at com.carrotsearch.randomizedtesting.ThreadLeakControl$StatementRunner.run(ThreadLeakControl.java:370)
>         at com.carrotsearch.randomizedtesting.ThreadLeakControl.forkTimeoutingTask(ThreadLeakControl.java:819)
>         at com.carrotsearch.randomizedtesting.ThreadLeakControl$3.evaluate(ThreadLeakControl.java:470)
>         at com.carrotsearch.randomizedtesting.RandomizedRunner.runSingleTest(RandomizedRunner.java:951)
>         at com.carrotsearch.randomizedtesting.RandomizedRunner$5.evaluate(RandomizedRunner.java:836)
>         at com.carrotsearch.randomizedtesting.RandomizedRunner$6.evaluate(RandomizedRunner.java:887)
>         at com.carrotsearch.randomizedtesting.RandomizedRunner$7.evaluate(RandomizedRunner.java:898)
>         at org.apache.lucene.util.AbstractBeforeAfterRule$1.evaluate(AbstractBeforeAfterRule.java:45)
>         at com.carrotsearch.randomizedtesting.rules.StatementAdapter.evaluate(StatementAdapter.java:36)
>         at org.apache.lucene.util.TestRuleStoreClassName$1.evaluate(TestRuleStoreClassName.java:41)
>         at com.carrotsearch.randomizedtesting.rules.NoShadowingOrOverridesOnMethodsRule$1.evaluate(NoShadowingOrOverridesOnMethodsRule.java:40)
>         at com.carrotsearch.randomizedtesting.rules.NoShadowingOrOverridesOnMethodsRule$1.evaluate(NoShadowingOrOverridesOnMethodsRule.java:40)
>         at com.carrotsearch.randomizedtesting.rules.StatementAdapter.evaluate(StatementAdapter.java:36)
>         at com.carrotsearch.randomizedtesting.rules.StatementAdapter.evaluate(StatementAdapter.java:36)
>         at org.apache.lucene.util.TestRuleAssertionsRequired$1.evaluate(TestRuleAssertionsRequired.java:53)
>         at org.apache.lucene.util.TestRuleMarkFailure$1.evaluate(TestRuleMarkFailure.java:47)
>         at org.apache.lucene.util.TestRuleIgnoreAfterMaxFailures$1.evaluate(TestRuleIgnoreAfterMaxFailures.java:64)
>         at org.apache.lucene.util.TestRuleIgnoreTestSuites$1.evaluate(TestRuleIgnoreTestSuites.java:54)
>         at com.carrotsearch.randomizedtesting.rules.StatementAdapter.evaluate(StatementAdapter.java:36)
>         at com.carrotsearch.randomizedtesting.ThreadLeakControl$StatementRunner.run(ThreadLeakControl.java:370)
>         at com.carrotsearch.randomizedtesting.ThreadLeakControl.lambda$forkTimeoutingTask$0(ThreadLeakControl.java:826)
>         at java.base/java.lang.Thread.run(Thread.java:834)
> Caused by: java.io.IOException: fake disk full at 5415 bytes when writing _2.fdm (file length=0)
>         at org.apache.lucene.store.MockIndexOutputWrapper.checkDiskFull(MockIndexOutputWrapper.java:87)
>         at org.apache.lucene.store.MockIndexOutputWrapper.writeBytes(MockIndexOutputWrapper.java:133)
>         at org.apache.lucene.store.MockIndexOutputWrapper.writeByte(MockIndexOutputWrapper.java:126)
>         at org.apache.lucene.store.RateLimitedIndexOutput.writeByte(RateLimitedIndexOutput.java:66)
>         at org.apache.lucene.store.DataOutput.writeInt(DataOutput.java:70)
>         at org.apache.lucene.codecs.CodecUtil.writeHeader(CodecUtil.java:90)
>         at org.apache.lucene.codecs.CodecUtil.writeIndexHeader(CodecUtil.java:133)
>         at org.apache.lucene.codecs.compressing.CompressingStoredFieldsWriter.<init>(CompressingStoredFieldsWriter.java:119)
>         at org.apache.lucene.codecs.compressing.CompressingStoredFieldsFormat.fieldsWriter(CompressingStoredFieldsFormat.java:130)
>         at org.apache.lucene.codecs.lucene87.Lucene87StoredFieldsFormat.fieldsWriter(Lucene87StoredFieldsFormat.java:141)
>         at org.apache.lucene.codecs.asserting.AssertingStoredFieldsFormat.fieldsWriter(AssertingStoredFieldsFormat.java:48)
>         at org.apache.lucene.index.SegmentMerger.mergeFields(SegmentMerger.java:227)
>         at org.apache.lucene.index.SegmentMerger.merge(SegmentMerger.java:105)
>         at org.apache.lucene.index.IndexWriter.mergeMiddle(IndexWriter.java:4743)
>         at org.apache.lucene.index.IndexWriter.merge(IndexWriter.java:4347)
>         at org.apache.lucene.index.IndexWriter$IndexWriterMergeSource.merge(IndexWriter.java:5898)
>         at org.apache.lucene.index.ConcurrentMergeScheduler.doMerge(ConcurrentMergeScheduler.java:624)
>         at org.apache.lucene.index.ConcurrentMergeScheduler$MergeThread.run(ConcurrentMergeScheduler.java:682)
>
>
>
>
> Build Log:
> [...truncated 763 lines...]
> ERROR: The following test(s) have failed:
>   - org.apache.lucene.index.TestIndexWriterOnDiskFull.testAddDocumentOnDiskFull (:lucene:core)
>     Test output: /home/jenkins/jenkins-slave/workspace/Lucene/Lucene-Solr-NightlyTests-master/checkout/lucene/core/build/test-results/test/outputs/OUTPUT-org.apache.lucene.index.TestIndexWriterOnDiskFull.txt
>     Reproduce with: gradlew :lucene:core:test --tests "org.apache.lucene.index.TestIndexWriterOnDiskFull" -Ptests.jvms=4 -Ptests.haltonfailure=false -Ptests.jvmargs=-XX:TieredStopAtLevel=1 -Ptests.seed=EA01BBF439B87FAE -Ptests.multiplier=2 -Ptests.nightly=true -Ptests.badapples=false -Ptests.file.encoding=US-ASCII -Ptests.linedocsfile=/home/jenkins/jenkins-slave/workspace/Lucene/Lucene-Solr-NightlyTests-master/test-data/enwiki.random.lines.txt
>
>
> Deprecated Gradle features were used in this build, making it incompatible with Gradle 7.0.
> Use '--warning-mode all' to show the individual deprecation warnings.
> See https://docs.gradle.org/6.4.1/userguide/command_line_interface.html#sec:command_line_warnings
>
> BUILD SUCCESSFUL in 5h 2m 21s
> 269 actionable tasks: 269 executed
> Build step 'Invoke Gradle script' changed build result to SUCCESS
> Archiving artifacts
> java.lang.InterruptedException: no matches found within 10000
>         at hudson.FilePath$ValidateAntFileMask.hasMatch(FilePath.java:2826)
>         at hudson.FilePath$ValidateAntFileMask.invoke(FilePath.java:2705)
>         at hudson.FilePath$ValidateAntFileMask.invoke(FilePath.java:2686)
>         at hudson.FilePath$FileCallableWrapper.call(FilePath.java:3073)
> Also:   hudson.remoting.Channel$CallSiteStackTrace: Remote call to lucene1
>                 at hudson.remoting.Channel.attachCallSiteStackTrace(Channel.java:1788)
>                 at hudson.remoting.UserRequest$ExceptionResponse.retrieve(UserRequest.java:356)
>                 at hudson.remoting.Channel.call(Channel.java:998)
>                 at hudson.FilePath.act(FilePath.java:1069)
>                 at hudson.FilePath.act(FilePath.java:1058)
>                 at hudson.FilePath.validateAntFileMask(FilePath.java:2684)
>                 at hudson.tasks.ArtifactArchiver.perform(ArtifactArchiver.java:265)
>                 at hudson.tasks.BuildStepCompatibilityLayer.perform(BuildStepCompatibilityLayer.java:78)
>                 at hudson.tasks.BuildStepMonitor$1.perform(BuildStepMonitor.java:20)
>                 at hudson.model.AbstractBuild$AbstractBuildExecution.perform(AbstractBuild.java:741)
>                 at hudson.model.AbstractBuild$AbstractBuildExecution.performAllBuildSteps(AbstractBuild.java:690)
>                 at hudson.model.Build$BuildExecution.post2(Build.java:186)
>                 at hudson.model.AbstractBuild$AbstractBuildExecution.post(AbstractBuild.java:635)
>                 at hudson.model.Run.execute(Run.java:1905)
>                 at hudson.model.FreeStyleBuild.run(FreeStyleBuild.java:43)
>                 at hudson.model.ResourceController.execute(ResourceController.java:97)
>                 at hudson.model.Executor.run(Executor.java:428)
> Caused: hudson.FilePath$TunneledInterruptedException
>         at hudson.FilePath$FileCallableWrapper.call(FilePath.java:3075)
>         at hudson.remoting.UserRequest.perform(UserRequest.java:211)
>         at hudson.remoting.UserRequest.perform(UserRequest.java:54)
>         at hudson.remoting.Request$2.run(Request.java:369)
>         at hudson.remoting.InterceptingExecutorService$1.call(InterceptingExecutorService.java:72)
>         at java.util.concurrent.FutureTask.run(FutureTask.java:266)
>         at java.util.concurrent.ThreadPoolExecutor.runWorker(ThreadPoolExecutor.java:1149)
>         at java.util.concurrent.ThreadPoolExecutor$Worker.run(ThreadPoolExecutor.java:624)
>         at java.lang.Thread.run(Thread.java:748)
> Caused: java.lang.InterruptedException: java.lang.InterruptedException: no matches found within 10000
>         at hudson.FilePath.act(FilePath.java:1071)
>         at hudson.FilePath.act(FilePath.java:1058)
>         at hudson.FilePath.validateAntFileMask(FilePath.java:2684)
>         at hudson.tasks.ArtifactArchiver.perform(ArtifactArchiver.java:265)
>         at hudson.tasks.BuildStepCompatibilityLayer.perform(BuildStepCompatibilityLayer.java:78)
>         at hudson.tasks.BuildStepMonitor$1.perform(BuildStepMonitor.java:20)
>         at hudson.model.AbstractBuild$AbstractBuildExecution.perform(AbstractBuild.java:741)
>         at hudson.model.AbstractBuild$AbstractBuildExecution.performAllBuildSteps(AbstractBuild.java:690)
>         at hudson.model.Build$BuildExecution.post2(Build.java:186)
>         at hudson.model.AbstractBuild$AbstractBuildExecution.post(AbstractBuild.java:635)
>         at hudson.model.Run.execute(Run.java:1905)
>         at hudson.model.FreeStyleBuild.run(FreeStyleBuild.java:43)
>         at hudson.model.ResourceController.execute(ResourceController.java:97)
>         at hudson.model.Executor.run(Executor.java:428)
> No artifacts found that match the file pattern "**/*.events,heapdumps/**,**/hs_err_pid*". Configuration error?
> Recording test results
> Build step 'Publish JUnit test result report' changed build result to UNSTABLE
> Email was triggered for: Unstable (Test Failures)
> Sending email for trigger: Unstable (Test Failures)
>
> ---------------------------------------------------------------------
> To unsubscribe, e-mail: [hidden email]
> For additional commands, e-mail: [hidden email]

---------------------------------------------------------------------
To unsubscribe, e-mail: [hidden email]
For additional commands, e-mail: [hidden email]

Reply | Threaded
Open this post in threaded view
|

Re: [JENKINS] Lucene » Lucene-Solr-NightlyTests-master - Build # 36 - Still unstable!

Dawid Weiss-2
Can't reproduce. Didn't dig deeper.

On Wed, Sep 16, 2020 at 1:19 PM Michael Sokolov <[hidden email]> wrote:

>
> I guess this IndexWriter has issues with commitment?
>
> On Tue, Sep 15, 2020, 12:15 PM Dawid Weiss <[hidden email]> wrote:
>>
>> Is this something that should be expected in this test?
>>
>> On Tue, Sep 15, 2020 at 7:10 AM Apache Jenkins Server
>> <[hidden email]> wrote:
>> >
>> > Build: https://ci-builds.apache.org/job/Lucene/job/Lucene-Solr-NightlyTests-master/36/
>> >
>> > 1 tests failed.
>> > FAILED:  org.apache.lucene.index.TestIndexWriterOnDiskFull.testAddDocumentOnDiskFull
>> >
>> > Error Message:
>> > java.lang.IllegalStateException: this writer hit an unrecoverable error; cannot commit
>> >
>> > Stack Trace:
>> > java.lang.IllegalStateException: this writer hit an unrecoverable error; cannot commit
>> >         at __randomizedtesting.SeedInfo.seed([EA01BBF439B87FAE:6619838BC42DA96A]:0)
>> >         at org.apache.lucene.index.IndexWriter.prepareCommitInternal(IndexWriter.java:3323)
>> >         at org.apache.lucene.index.IndexWriter.commitInternal(IndexWriter.java:3754)
>> >         at org.apache.lucene.index.IndexWriter.shutdown(IndexWriter.java:1237)
>> >         at org.apache.lucene.index.IndexWriter.close(IndexWriter.java:1278)
>> >         at org.apache.lucene.index.TestIndexWriterOnDiskFull.testAddDocumentOnDiskFull(TestIndexWriterOnDiskFull.java:104)
>> >         at java.base/jdk.internal.reflect.NativeMethodAccessorImpl.invoke0(Native Method)
>> >         at java.base/jdk.internal.reflect.NativeMethodAccessorImpl.invoke(NativeMethodAccessorImpl.java:62)
>> >         at java.base/jdk.internal.reflect.DelegatingMethodAccessorImpl.invoke(DelegatingMethodAccessorImpl.java:43)
>> >         at java.base/java.lang.reflect.Method.invoke(Method.java:566)
>> >         at com.carrotsearch.randomizedtesting.RandomizedRunner.invoke(RandomizedRunner.java:1754)
>> >         at com.carrotsearch.randomizedtesting.RandomizedRunner$8.evaluate(RandomizedRunner.java:942)
>> >         at com.carrotsearch.randomizedtesting.RandomizedRunner$9.evaluate(RandomizedRunner.java:978)
>> >         at com.carrotsearch.randomizedtesting.RandomizedRunner$10.evaluate(RandomizedRunner.java:992)
>> >         at org.apache.lucene.util.TestRuleSetupTeardownChained$1.evaluate(TestRuleSetupTeardownChained.java:49)
>> >         at org.apache.lucene.util.AbstractBeforeAfterRule$1.evaluate(AbstractBeforeAfterRule.java:45)
>> >         at org.apache.lucene.util.TestRuleThreadAndTestName$1.evaluate(TestRuleThreadAndTestName.java:48)
>> >         at org.apache.lucene.util.TestRuleIgnoreAfterMaxFailures$1.evaluate(TestRuleIgnoreAfterMaxFailures.java:64)
>> >         at org.apache.lucene.util.TestRuleMarkFailure$1.evaluate(TestRuleMarkFailure.java:47)
>> >         at com.carrotsearch.randomizedtesting.rules.StatementAdapter.evaluate(StatementAdapter.java:36)
>> >         at com.carrotsearch.randomizedtesting.ThreadLeakControl$StatementRunner.run(ThreadLeakControl.java:370)
>> >         at com.carrotsearch.randomizedtesting.ThreadLeakControl.forkTimeoutingTask(ThreadLeakControl.java:819)
>> >         at com.carrotsearch.randomizedtesting.ThreadLeakControl$3.evaluate(ThreadLeakControl.java:470)
>> >         at com.carrotsearch.randomizedtesting.RandomizedRunner.runSingleTest(RandomizedRunner.java:951)
>> >         at com.carrotsearch.randomizedtesting.RandomizedRunner$5.evaluate(RandomizedRunner.java:836)
>> >         at com.carrotsearch.randomizedtesting.RandomizedRunner$6.evaluate(RandomizedRunner.java:887)
>> >         at com.carrotsearch.randomizedtesting.RandomizedRunner$7.evaluate(RandomizedRunner.java:898)
>> >         at org.apache.lucene.util.AbstractBeforeAfterRule$1.evaluate(AbstractBeforeAfterRule.java:45)
>> >         at com.carrotsearch.randomizedtesting.rules.StatementAdapter.evaluate(StatementAdapter.java:36)
>> >         at org.apache.lucene.util.TestRuleStoreClassName$1.evaluate(TestRuleStoreClassName.java:41)
>> >         at com.carrotsearch.randomizedtesting.rules.NoShadowingOrOverridesOnMethodsRule$1.evaluate(NoShadowingOrOverridesOnMethodsRule.java:40)
>> >         at com.carrotsearch.randomizedtesting.rules.NoShadowingOrOverridesOnMethodsRule$1.evaluate(NoShadowingOrOverridesOnMethodsRule.java:40)
>> >         at com.carrotsearch.randomizedtesting.rules.StatementAdapter.evaluate(StatementAdapter.java:36)
>> >         at com.carrotsearch.randomizedtesting.rules.StatementAdapter.evaluate(StatementAdapter.java:36)
>> >         at org.apache.lucene.util.TestRuleAssertionsRequired$1.evaluate(TestRuleAssertionsRequired.java:53)
>> >         at org.apache.lucene.util.TestRuleMarkFailure$1.evaluate(TestRuleMarkFailure.java:47)
>> >         at org.apache.lucene.util.TestRuleIgnoreAfterMaxFailures$1.evaluate(TestRuleIgnoreAfterMaxFailures.java:64)
>> >         at org.apache.lucene.util.TestRuleIgnoreTestSuites$1.evaluate(TestRuleIgnoreTestSuites.java:54)
>> >         at com.carrotsearch.randomizedtesting.rules.StatementAdapter.evaluate(StatementAdapter.java:36)
>> >         at com.carrotsearch.randomizedtesting.ThreadLeakControl$StatementRunner.run(ThreadLeakControl.java:370)
>> >         at com.carrotsearch.randomizedtesting.ThreadLeakControl.lambda$forkTimeoutingTask$0(ThreadLeakControl.java:826)
>> >         at java.base/java.lang.Thread.run(Thread.java:834)
>> > Caused by: java.io.IOException: fake disk full at 5415 bytes when writing _2.fdm (file length=0)
>> >         at org.apache.lucene.store.MockIndexOutputWrapper.checkDiskFull(MockIndexOutputWrapper.java:87)
>> >         at org.apache.lucene.store.MockIndexOutputWrapper.writeBytes(MockIndexOutputWrapper.java:133)
>> >         at org.apache.lucene.store.MockIndexOutputWrapper.writeByte(MockIndexOutputWrapper.java:126)
>> >         at org.apache.lucene.store.RateLimitedIndexOutput.writeByte(RateLimitedIndexOutput.java:66)
>> >         at org.apache.lucene.store.DataOutput.writeInt(DataOutput.java:70)
>> >         at org.apache.lucene.codecs.CodecUtil.writeHeader(CodecUtil.java:90)
>> >         at org.apache.lucene.codecs.CodecUtil.writeIndexHeader(CodecUtil.java:133)
>> >         at org.apache.lucene.codecs.compressing.CompressingStoredFieldsWriter.<init>(CompressingStoredFieldsWriter.java:119)
>> >         at org.apache.lucene.codecs.compressing.CompressingStoredFieldsFormat.fieldsWriter(CompressingStoredFieldsFormat.java:130)
>> >         at org.apache.lucene.codecs.lucene87.Lucene87StoredFieldsFormat.fieldsWriter(Lucene87StoredFieldsFormat.java:141)
>> >         at org.apache.lucene.codecs.asserting.AssertingStoredFieldsFormat.fieldsWriter(AssertingStoredFieldsFormat.java:48)
>> >         at org.apache.lucene.index.SegmentMerger.mergeFields(SegmentMerger.java:227)
>> >         at org.apache.lucene.index.SegmentMerger.merge(SegmentMerger.java:105)
>> >         at org.apache.lucene.index.IndexWriter.mergeMiddle(IndexWriter.java:4743)
>> >         at org.apache.lucene.index.IndexWriter.merge(IndexWriter.java:4347)
>> >         at org.apache.lucene.index.IndexWriter$IndexWriterMergeSource.merge(IndexWriter.java:5898)
>> >         at org.apache.lucene.index.ConcurrentMergeScheduler.doMerge(ConcurrentMergeScheduler.java:624)
>> >         at org.apache.lucene.index.ConcurrentMergeScheduler$MergeThread.run(ConcurrentMergeScheduler.java:682)
>> >
>> >
>> >
>> >
>> > Build Log:
>> > [...truncated 763 lines...]
>> > ERROR: The following test(s) have failed:
>> >   - org.apache.lucene.index.TestIndexWriterOnDiskFull.testAddDocumentOnDiskFull (:lucene:core)
>> >     Test output: /home/jenkins/jenkins-slave/workspace/Lucene/Lucene-Solr-NightlyTests-master/checkout/lucene/core/build/test-results/test/outputs/OUTPUT-org.apache.lucene.index.TestIndexWriterOnDiskFull.txt
>> >     Reproduce with: gradlew :lucene:core:test --tests "org.apache.lucene.index.TestIndexWriterOnDiskFull" -Ptests.jvms=4 -Ptests.haltonfailure=false -Ptests.jvmargs=-XX:TieredStopAtLevel=1 -Ptests.seed=EA01BBF439B87FAE -Ptests.multiplier=2 -Ptests.nightly=true -Ptests.badapples=false -Ptests.file.encoding=US-ASCII -Ptests.linedocsfile=/home/jenkins/jenkins-slave/workspace/Lucene/Lucene-Solr-NightlyTests-master/test-data/enwiki.random.lines.txt
>> >
>> >
>> > Deprecated Gradle features were used in this build, making it incompatible with Gradle 7.0.
>> > Use '--warning-mode all' to show the individual deprecation warnings.
>> > See https://docs.gradle.org/6.4.1/userguide/command_line_interface.html#sec:command_line_warnings
>> >
>> > BUILD SUCCESSFUL in 5h 2m 21s
>> > 269 actionable tasks: 269 executed
>> > Build step 'Invoke Gradle script' changed build result to SUCCESS
>> > Archiving artifacts
>> > java.lang.InterruptedException: no matches found within 10000
>> >         at hudson.FilePath$ValidateAntFileMask.hasMatch(FilePath.java:2826)
>> >         at hudson.FilePath$ValidateAntFileMask.invoke(FilePath.java:2705)
>> >         at hudson.FilePath$ValidateAntFileMask.invoke(FilePath.java:2686)
>> >         at hudson.FilePath$FileCallableWrapper.call(FilePath.java:3073)
>> > Also:   hudson.remoting.Channel$CallSiteStackTrace: Remote call to lucene1
>> >                 at hudson.remoting.Channel.attachCallSiteStackTrace(Channel.java:1788)
>> >                 at hudson.remoting.UserRequest$ExceptionResponse.retrieve(UserRequest.java:356)
>> >                 at hudson.remoting.Channel.call(Channel.java:998)
>> >                 at hudson.FilePath.act(FilePath.java:1069)
>> >                 at hudson.FilePath.act(FilePath.java:1058)
>> >                 at hudson.FilePath.validateAntFileMask(FilePath.java:2684)
>> >                 at hudson.tasks.ArtifactArchiver.perform(ArtifactArchiver.java:265)
>> >                 at hudson.tasks.BuildStepCompatibilityLayer.perform(BuildStepCompatibilityLayer.java:78)
>> >                 at hudson.tasks.BuildStepMonitor$1.perform(BuildStepMonitor.java:20)
>> >                 at hudson.model.AbstractBuild$AbstractBuildExecution.perform(AbstractBuild.java:741)
>> >                 at hudson.model.AbstractBuild$AbstractBuildExecution.performAllBuildSteps(AbstractBuild.java:690)
>> >                 at hudson.model.Build$BuildExecution.post2(Build.java:186)
>> >                 at hudson.model.AbstractBuild$AbstractBuildExecution.post(AbstractBuild.java:635)
>> >                 at hudson.model.Run.execute(Run.java:1905)
>> >                 at hudson.model.FreeStyleBuild.run(FreeStyleBuild.java:43)
>> >                 at hudson.model.ResourceController.execute(ResourceController.java:97)
>> >                 at hudson.model.Executor.run(Executor.java:428)
>> > Caused: hudson.FilePath$TunneledInterruptedException
>> >         at hudson.FilePath$FileCallableWrapper.call(FilePath.java:3075)
>> >         at hudson.remoting.UserRequest.perform(UserRequest.java:211)
>> >         at hudson.remoting.UserRequest.perform(UserRequest.java:54)
>> >         at hudson.remoting.Request$2.run(Request.java:369)
>> >         at hudson.remoting.InterceptingExecutorService$1.call(InterceptingExecutorService.java:72)
>> >         at java.util.concurrent.FutureTask.run(FutureTask.java:266)
>> >         at java.util.concurrent.ThreadPoolExecutor.runWorker(ThreadPoolExecutor.java:1149)
>> >         at java.util.concurrent.ThreadPoolExecutor$Worker.run(ThreadPoolExecutor.java:624)
>> >         at java.lang.Thread.run(Thread.java:748)
>> > Caused: java.lang.InterruptedException: java.lang.InterruptedException: no matches found within 10000
>> >         at hudson.FilePath.act(FilePath.java:1071)
>> >         at hudson.FilePath.act(FilePath.java:1058)
>> >         at hudson.FilePath.validateAntFileMask(FilePath.java:2684)
>> >         at hudson.tasks.ArtifactArchiver.perform(ArtifactArchiver.java:265)
>> >         at hudson.tasks.BuildStepCompatibilityLayer.perform(BuildStepCompatibilityLayer.java:78)
>> >         at hudson.tasks.BuildStepMonitor$1.perform(BuildStepMonitor.java:20)
>> >         at hudson.model.AbstractBuild$AbstractBuildExecution.perform(AbstractBuild.java:741)
>> >         at hudson.model.AbstractBuild$AbstractBuildExecution.performAllBuildSteps(AbstractBuild.java:690)
>> >         at hudson.model.Build$BuildExecution.post2(Build.java:186)
>> >         at hudson.model.AbstractBuild$AbstractBuildExecution.post(AbstractBuild.java:635)
>> >         at hudson.model.Run.execute(Run.java:1905)
>> >         at hudson.model.FreeStyleBuild.run(FreeStyleBuild.java:43)
>> >         at hudson.model.ResourceController.execute(ResourceController.java:97)
>> >         at hudson.model.Executor.run(Executor.java:428)
>> > No artifacts found that match the file pattern "**/*.events,heapdumps/**,**/hs_err_pid*". Configuration error?
>> > Recording test results
>> > Build step 'Publish JUnit test result report' changed build result to UNSTABLE
>> > Email was triggered for: Unstable (Test Failures)
>> > Sending email for trigger: Unstable (Test Failures)
>> >
>> > ---------------------------------------------------------------------
>> > To unsubscribe, e-mail: [hidden email]
>> > For additional commands, e-mail: [hidden email]
>>
>> ---------------------------------------------------------------------
>> To unsubscribe, e-mail: [hidden email]
>> For additional commands, e-mail: [hidden email]
>>

---------------------------------------------------------------------
To unsubscribe, e-mail: [hidden email]
For additional commands, e-mail: [hidden email]