Re: [JENKINS] Lucene » Lucene-Solr-Tests-8.x - Build # 1343 - Still Unstable!

classic Classic list List threaded Threaded
1 message Options
Reply | Threaded
Open this post in threaded view
|

Re: [JENKINS] Lucene » Lucene-Solr-Tests-8.x - Build # 1343 - Still Unstable!

MUNENDRA S N
This failure seems to be introduced in https://issues.apache.org/jira/browse/SOLR-14999


On Sat, Jan 9, 2021 at 7:44 PM Apache Jenkins Server <[hidden email]> wrote:
Build: https://ci-builds.apache.org/job/Lucene/job/Lucene-Solr-Tests-8.x/1343/

2 tests failed.
FAILED:  org.apache.solr.core.TestSolrXml.testCloudConfigRequiresHostPort

Error Message:
 Expected: (an instance of org.apache.solr.common.SolrException and exception with message a string containing "solrcloud section missing required entry 'hostPort'")      but: exception with message a string containing "solrcloud section missing required entry 'hostPort'" message was "Error parsing 'hostPort', value 'null' cannot be parsed as int" Stacktrace was: org.apache.solr.common.SolrException: Error parsing 'hostPort', value 'null' cannot be parsed as int  at org.apache.solr.core.SolrXmlConfig.parseInt(SolrXmlConfig.java:271)  at org.apache.solr.core.SolrXmlConfig.fillSolrCloudSection(SolrXmlConfig.java:425)  at org.apache.solr.core.SolrXmlConfig.fromConfig(SolrXmlConfig.java:118)  at org.apache.solr.core.SolrXmlConfig.fromInputStream(SolrXmlConfig.java:190)  at org.apache.solr.core.SolrXmlConfig.fromString(SolrXmlConfig.java:175)  at org.apache.solr.core.TestSolrXml.testCloudConfigRequiresHostPort(TestSolrXml.java:328)  at sun.reflect.NativeMethodAccessorImpl.invoke0(Native Method)  at sun.reflect.NativeMethodAccessorImpl.invoke(NativeMethodAccessorImpl.java:62)  at sun.reflect.DelegatingMethodAccessorImpl.invoke(DelegatingMethodAccessorImpl.java:43)  at java.lang.reflect.Method.invoke(Method.java:498)  at com.carrotsearch.randomizedtesting.RandomizedRunner.invoke(RandomizedRunner.java:1750)  at com.carrotsearch.randomizedtesting.RandomizedRunner$8.evaluate(RandomizedRunner.java:938)  at com.carrotsearch.randomizedtesting.RandomizedRunner$9.evaluate(RandomizedRunner.java:974)  at com.carrotsearch.randomizedtesting.RandomizedRunner$10.evaluate(RandomizedRunner.java:988)  at org.junit.rules.ExpectedException$ExpectedExceptionStatement.evaluate(ExpectedException.java:258)  at com.carrotsearch.randomizedtesting.rules.SystemPropertiesRestoreRule$1.evaluate(SystemPropertiesRestoreRule.java:57)  at org.junit.rules.RunRules.evaluate(RunRules.java:20)  at org.apache.lucene.util.TestRuleSetupTeardownChained$1.evaluate(TestRuleSetupTeardownChained.java:49)  at org.apache.lucene.util.AbstractBeforeAfterRule$1.evaluate(AbstractBeforeAfterRule.java:45)  at org.apache.lucene.util.TestRuleThreadAndTestName$1.evaluate(TestRuleThreadAndTestName.java:48)  at org.apache.lucene.util.TestRuleIgnoreAfterMaxFailures$1.evaluate(TestRuleIgnoreAfterMaxFailures.java:64)  at org.apache.lucene.util.TestRuleMarkFailure$1.evaluate(TestRuleMarkFailure.java:47)  at org.junit.rules.RunRules.evaluate(RunRules.java:20)  at com.carrotsearch.randomizedtesting.rules.StatementAdapter.evaluate(StatementAdapter.java:36)  at com.carrotsearch.randomizedtesting.ThreadLeakControl$StatementRunner.run(ThreadLeakControl.java:368)  at com.carrotsearch.randomizedtesting.ThreadLeakControl.forkTimeoutingTask(ThreadLeakControl.java:817)  at com.carrotsearch.randomizedtesting.ThreadLeakControl$3.evaluate(ThreadLeakControl.java:468)  at com.carrotsearch.randomizedtesting.RandomizedRunner.runSingleTest(RandomizedRunner.java:947)  at com.carrotsearch.randomizedtesting.RandomizedRunner$5.evaluate(RandomizedRunner.java:832)  at com.carrotsearch.randomizedtesting.RandomizedRunner$6.evaluate(RandomizedRunner.java:883)  at com.carrotsearch.randomizedtesting.RandomizedRunner$7.evaluate(RandomizedRunner.java:894)  at com.carrotsearch.randomizedtesting.rules.StatementAdapter.evaluate(StatementAdapter.java:36)  at com.carrotsearch.randomizedtesting.rules.SystemPropertiesRestoreRule$1.evaluate(SystemPropertiesRestoreRule.java:57)  at org.junit.rules.RunRules.evaluate(RunRules.java:20)  at org.apache.lucene.util.AbstractBeforeAfterRule$1.evaluate(AbstractBeforeAfterRule.java:45)  at com.carrotsearch.randomizedtesting.rules.StatementAdapter.evaluate(StatementAdapter.java:36)  at org.apache.lucene.util.TestRuleStoreClassName$1.evaluate(TestRuleStoreClassName.java:41)  at com.carrotsearch.randomizedtesting.rules.NoShadowingOrOverridesOnMethodsRule$1.evaluate(NoShadowingOrOverridesOnMethodsRule.java:40)  at com.carrotsearch.randomizedtesting.rules.NoShadowingOrOverridesOnMethodsRule$1.evaluate(NoShadowingOrOverridesOnMethodsRule.java:40)  at com.carrotsearch.randomizedtesting.rules.StatementAdapter.evaluate(StatementAdapter.java:36)  at com.carrotsearch.randomizedtesting.rules.StatementAdapter.evaluate(StatementAdapter.java:36)  at com.carrotsearch.randomizedtesting.rules.StatementAdapter.evaluate(StatementAdapter.java:36)  at org.apache.lucene.util.TestRuleAssertionsRequired$1.evaluate(TestRuleAssertionsRequired.java:53)  at org.apache.lucene.util.TestRuleMarkFailure$1.evaluate(TestRuleMarkFailure.java:47)  at org.apache.lucene.util.TestRuleIgnoreAfterMaxFailures$1.evaluate(TestRuleIgnoreAfterMaxFailures.java:64)  at org.apache.lucene.util.TestRuleIgnoreTestSuites$1.evaluate(TestRuleIgnoreTestSuites.java:54)  at org.junit.rules.RunRules.evaluate(RunRules.java:20)  at com.carrotsearch.randomizedtesting.rules.StatementAdapter.evaluate(StatementAdapter.java:36)  at com.carrotsearch.randomizedtesting.ThreadLeakControl$StatementRunner.run(ThreadLeakControl.java:368)  at java.lang.Thread.run(Thread.java:748)

Stack Trace:
java.lang.AssertionError:
Expected: (an instance of org.apache.solr.common.SolrException and exception with message a string containing "solrcloud section missing required entry 'hostPort'")
     but: exception with message a string containing "solrcloud section missing required entry 'hostPort'" message was "Error parsing 'hostPort', value 'null' cannot be parsed as int"
Stacktrace was: org.apache.solr.common.SolrException: Error parsing 'hostPort', value 'null' cannot be parsed as int
        at org.apache.solr.core.SolrXmlConfig.parseInt(SolrXmlConfig.java:271)
        at org.apache.solr.core.SolrXmlConfig.fillSolrCloudSection(SolrXmlConfig.java:425)
        at org.apache.solr.core.SolrXmlConfig.fromConfig(SolrXmlConfig.java:118)
        at org.apache.solr.core.SolrXmlConfig.fromInputStream(SolrXmlConfig.java:190)
        at org.apache.solr.core.SolrXmlConfig.fromString(SolrXmlConfig.java:175)
        at org.apache.solr.core.TestSolrXml.testCloudConfigRequiresHostPort(TestSolrXml.java:328)
        at sun.reflect.NativeMethodAccessorImpl.invoke0(Native Method)
        at sun.reflect.NativeMethodAccessorImpl.invoke(NativeMethodAccessorImpl.java:62)
        at sun.reflect.DelegatingMethodAccessorImpl.invoke(DelegatingMethodAccessorImpl.java:43)
        at java.lang.reflect.Method.invoke(Method.java:498)
        at com.carrotsearch.randomizedtesting.RandomizedRunner.invoke(RandomizedRunner.java:1750)
        at com.carrotsearch.randomizedtesting.RandomizedRunner$8.evaluate(RandomizedRunner.java:938)
        at com.carrotsearch.randomizedtesting.RandomizedRunner$9.evaluate(RandomizedRunner.java:974)
        at com.carrotsearch.randomizedtesting.RandomizedRunner$10.evaluate(RandomizedRunner.java:988)
        at org.junit.rules.ExpectedException$ExpectedExceptionStatement.evaluate(ExpectedException.java:258)
        at com.carrotsearch.randomizedtesting.rules.SystemPropertiesRestoreRule$1.evaluate(SystemPropertiesRestoreRule.java:57)
        at org.junit.rules.RunRules.evaluate(RunRules.java:20)
        at org.apache.lucene.util.TestRuleSetupTeardownChained$1.evaluate(TestRuleSetupTeardownChained.java:49)
        at org.apache.lucene.util.AbstractBeforeAfterRule$1.evaluate(AbstractBeforeAfterRule.java:45)
        at org.apache.lucene.util.TestRuleThreadAndTestName$1.evaluate(TestRuleThreadAndTestName.java:48)
        at org.apache.lucene.util.TestRuleIgnoreAfterMaxFailures$1.evaluate(TestRuleIgnoreAfterMaxFailures.java:64)
        at org.apache.lucene.util.TestRuleMarkFailure$1.evaluate(TestRuleMarkFailure.java:47)
        at org.junit.rules.RunRules.evaluate(RunRules.java:20)
        at com.carrotsearch.randomizedtesting.rules.StatementAdapter.evaluate(StatementAdapter.java:36)
        at com.carrotsearch.randomizedtesting.ThreadLeakControl$StatementRunner.run(ThreadLeakControl.java:368)
        at com.carrotsearch.randomizedtesting.ThreadLeakControl.forkTimeoutingTask(ThreadLeakControl.java:817)
        at com.carrotsearch.randomizedtesting.ThreadLeakControl$3.evaluate(ThreadLeakControl.java:468)
        at com.carrotsearch.randomizedtesting.RandomizedRunner.runSingleTest(RandomizedRunner.java:947)
        at com.carrotsearch.randomizedtesting.RandomizedRunner$5.evaluate(RandomizedRunner.java:832)
        at com.carrotsearch.randomizedtesting.RandomizedRunner$6.evaluate(RandomizedRunner.java:883)
        at com.carrotsearch.randomizedtesting.RandomizedRunner$7.evaluate(RandomizedRunner.java:894)
        at com.carrotsearch.randomizedtesting.rules.StatementAdapter.evaluate(StatementAdapter.java:36)
        at com.carrotsearch.randomizedtesting.rules.SystemPropertiesRestoreRule$1.evaluate(SystemPropertiesRestoreRule.java:57)
        at org.junit.rules.RunRules.evaluate(RunRules.java:20)
        at org.apache.lucene.util.AbstractBeforeAfterRule$1.evaluate(AbstractBeforeAfterRule.java:45)
        at com.carrotsearch.randomizedtesting.rules.StatementAdapter.evaluate(StatementAdapter.java:36)
        at org.apache.lucene.util.TestRuleStoreClassName$1.evaluate(TestRuleStoreClassName.java:41)
        at com.carrotsearch.randomizedtesting.rules.NoShadowingOrOverridesOnMethodsRule$1.evaluate(NoShadowingOrOverridesOnMethodsRule.java:40)
        at com.carrotsearch.randomizedtesting.rules.NoShadowingOrOverridesOnMethodsRule$1.evaluate(NoShadowingOrOverridesOnMethodsRule.java:40)
        at com.carrotsearch.randomizedtesting.rules.StatementAdapter.evaluate(StatementAdapter.java:36)
        at com.carrotsearch.randomizedtesting.rules.StatementAdapter.evaluate(StatementAdapter.java:36)
        at com.carrotsearch.randomizedtesting.rules.StatementAdapter.evaluate(StatementAdapter.java:36)
        at org.apache.lucene.util.TestRuleAssertionsRequired$1.evaluate(TestRuleAssertionsRequired.java:53)
        at org.apache.lucene.util.TestRuleMarkFailure$1.evaluate(TestRuleMarkFailure.java:47)
        at org.apache.lucene.util.TestRuleIgnoreAfterMaxFailures$1.evaluate(TestRuleIgnoreAfterMaxFailures.java:64)
        at org.apache.lucene.util.TestRuleIgnoreTestSuites$1.evaluate(TestRuleIgnoreTestSuites.java:54)
        at org.junit.rules.RunRules.evaluate(RunRules.java:20)
        at com.carrotsearch.randomizedtesting.rules.StatementAdapter.evaluate(StatementAdapter.java:36)
        at com.carrotsearch.randomizedtesting.ThreadLeakControl$StatementRunner.run(ThreadLeakControl.java:368)
        at java.lang.Thread.run(Thread.java:748)

        at __randomizedtesting.SeedInfo.seed([7C90141B3577CD13:F41C39F00B2AD8A8]:0)
        at org.hamcrest.MatcherAssert.assertThat(MatcherAssert.java:20)
        at org.junit.Assert.assertThat(Assert.java:964)
        at org.junit.Assert.assertThat(Assert.java:930)
        at org.junit.rules.ExpectedException.handleException(ExpectedException.java:271)
        at org.junit.rules.ExpectedException.access$000(ExpectedException.java:111)
        at org.junit.rules.ExpectedException$ExpectedExceptionStatement.evaluate(ExpectedException.java:260)
        at com.carrotsearch.randomizedtesting.rules.SystemPropertiesRestoreRule$1.evaluate(SystemPropertiesRestoreRule.java:57)
        at org.junit.rules.RunRules.evaluate(RunRules.java:20)
        at org.apache.lucene.util.TestRuleSetupTeardownChained$1.evaluate(TestRuleSetupTeardownChained.java:49)
        at org.apache.lucene.util.AbstractBeforeAfterRule$1.evaluate(AbstractBeforeAfterRule.java:45)
        at org.apache.lucene.util.TestRuleThreadAndTestName$1.evaluate(TestRuleThreadAndTestName.java:48)
        at org.apache.lucene.util.TestRuleIgnoreAfterMaxFailures$1.evaluate(TestRuleIgnoreAfterMaxFailures.java:64)
        at org.apache.lucene.util.TestRuleMarkFailure$1.evaluate(TestRuleMarkFailure.java:47)
        at org.junit.rules.RunRules.evaluate(RunRules.java:20)
        at com.carrotsearch.randomizedtesting.rules.StatementAdapter.evaluate(StatementAdapter.java:36)
        at com.carrotsearch.randomizedtesting.ThreadLeakControl$StatementRunner.run(ThreadLeakControl.java:368)
        at com.carrotsearch.randomizedtesting.ThreadLeakControl.forkTimeoutingTask(ThreadLeakControl.java:817)
        at com.carrotsearch.randomizedtesting.ThreadLeakControl$3.evaluate(ThreadLeakControl.java:468)
        at com.carrotsearch.randomizedtesting.RandomizedRunner.runSingleTest(RandomizedRunner.java:947)
        at com.carrotsearch.randomizedtesting.RandomizedRunner$5.evaluate(RandomizedRunner.java:832)
        at com.carrotsearch.randomizedtesting.RandomizedRunner$6.evaluate(RandomizedRunner.java:883)
        at com.carrotsearch.randomizedtesting.RandomizedRunner$7.evaluate(RandomizedRunner.java:894)
        at com.carrotsearch.randomizedtesting.rules.StatementAdapter.evaluate(StatementAdapter.java:36)
        at com.carrotsearch.randomizedtesting.rules.SystemPropertiesRestoreRule$1.evaluate(SystemPropertiesRestoreRule.java:57)
        at org.junit.rules.RunRules.evaluate(RunRules.java:20)
        at org.apache.lucene.util.AbstractBeforeAfterRule$1.evaluate(AbstractBeforeAfterRule.java:45)
        at com.carrotsearch.randomizedtesting.rules.StatementAdapter.evaluate(StatementAdapter.java:36)
        at org.apache.lucene.util.TestRuleStoreClassName$1.evaluate(TestRuleStoreClassName.java:41)
        at com.carrotsearch.randomizedtesting.rules.NoShadowingOrOverridesOnMethodsRule$1.evaluate(NoShadowingOrOverridesOnMethodsRule.java:40)
        at com.carrotsearch.randomizedtesting.rules.NoShadowingOrOverridesOnMethodsRule$1.evaluate(NoShadowingOrOverridesOnMethodsRule.java:40)
        at com.carrotsearch.randomizedtesting.rules.StatementAdapter.evaluate(StatementAdapter.java:36)
        at com.carrotsearch.randomizedtesting.rules.StatementAdapter.evaluate(StatementAdapter.java:36)
        at com.carrotsearch.randomizedtesting.rules.StatementAdapter.evaluate(StatementAdapter.java:36)
        at org.apache.lucene.util.TestRuleAssertionsRequired$1.evaluate(TestRuleAssertionsRequired.java:53)
        at org.apache.lucene.util.TestRuleMarkFailure$1.evaluate(TestRuleMarkFailure.java:47)
        at org.apache.lucene.util.TestRuleIgnoreAfterMaxFailures$1.evaluate(TestRuleIgnoreAfterMaxFailures.java:64)
        at org.apache.lucene.util.TestRuleIgnoreTestSuites$1.evaluate(TestRuleIgnoreTestSuites.java:54)
        at org.junit.rules.RunRules.evaluate(RunRules.java:20)
        at com.carrotsearch.randomizedtesting.rules.StatementAdapter.evaluate(StatementAdapter.java:36)
        at com.carrotsearch.randomizedtesting.ThreadLeakControl$StatementRunner.run(ThreadLeakControl.java:368)
        at java.lang.Thread.run(Thread.java:748)


FAILED:  org.apache.solr.core.TestSolrXml.testCloudConfigRequiresHost

Error Message:
 Expected: (an instance of org.apache.solr.common.SolrException and exception with message a string containing "solrcloud section missing required entry 'host'")      but: exception with message a string containing "solrcloud section missing required entry 'host'" message was "Error parsing 'hostPort', value 'null' cannot be parsed as int" Stacktrace was: org.apache.solr.common.SolrException: Error parsing 'hostPort', value 'null' cannot be parsed as int  at org.apache.solr.core.SolrXmlConfig.parseInt(SolrXmlConfig.java:271)  at org.apache.solr.core.SolrXmlConfig.fillSolrCloudSection(SolrXmlConfig.java:425)  at org.apache.solr.core.SolrXmlConfig.fromConfig(SolrXmlConfig.java:118)  at org.apache.solr.core.SolrXmlConfig.fromInputStream(SolrXmlConfig.java:190)  at org.apache.solr.core.SolrXmlConfig.fromString(SolrXmlConfig.java:175)  at org.apache.solr.core.TestSolrXml.testCloudConfigRequiresHost(TestSolrXml.java:321)  at sun.reflect.NativeMethodAccessorImpl.invoke0(Native Method)  at sun.reflect.NativeMethodAccessorImpl.invoke(NativeMethodAccessorImpl.java:62)  at sun.reflect.DelegatingMethodAccessorImpl.invoke(DelegatingMethodAccessorImpl.java:43)  at java.lang.reflect.Method.invoke(Method.java:498)  at com.carrotsearch.randomizedtesting.RandomizedRunner.invoke(RandomizedRunner.java:1750)  at com.carrotsearch.randomizedtesting.RandomizedRunner$8.evaluate(RandomizedRunner.java:938)  at com.carrotsearch.randomizedtesting.RandomizedRunner$9.evaluate(RandomizedRunner.java:974)  at com.carrotsearch.randomizedtesting.RandomizedRunner$10.evaluate(RandomizedRunner.java:988)  at org.junit.rules.ExpectedException$ExpectedExceptionStatement.evaluate(ExpectedException.java:258)  at com.carrotsearch.randomizedtesting.rules.SystemPropertiesRestoreRule$1.evaluate(SystemPropertiesRestoreRule.java:57)  at org.junit.rules.RunRules.evaluate(RunRules.java:20)  at org.apache.lucene.util.TestRuleSetupTeardownChained$1.evaluate(TestRuleSetupTeardownChained.java:49)  at org.apache.lucene.util.AbstractBeforeAfterRule$1.evaluate(AbstractBeforeAfterRule.java:45)  at org.apache.lucene.util.TestRuleThreadAndTestName$1.evaluate(TestRuleThreadAndTestName.java:48)  at org.apache.lucene.util.TestRuleIgnoreAfterMaxFailures$1.evaluate(TestRuleIgnoreAfterMaxFailures.java:64)  at org.apache.lucene.util.TestRuleMarkFailure$1.evaluate(TestRuleMarkFailure.java:47)  at org.junit.rules.RunRules.evaluate(RunRules.java:20)  at com.carrotsearch.randomizedtesting.rules.StatementAdapter.evaluate(StatementAdapter.java:36)  at com.carrotsearch.randomizedtesting.ThreadLeakControl$StatementRunner.run(ThreadLeakControl.java:368)  at com.carrotsearch.randomizedtesting.ThreadLeakControl.forkTimeoutingTask(ThreadLeakControl.java:817)  at com.carrotsearch.randomizedtesting.ThreadLeakControl$3.evaluate(ThreadLeakControl.java:468)  at com.carrotsearch.randomizedtesting.RandomizedRunner.runSingleTest(RandomizedRunner.java:947)  at com.carrotsearch.randomizedtesting.RandomizedRunner$5.evaluate(RandomizedRunner.java:832)  at com.carrotsearch.randomizedtesting.RandomizedRunner$6.evaluate(RandomizedRunner.java:883)  at com.carrotsearch.randomizedtesting.RandomizedRunner$7.evaluate(RandomizedRunner.java:894)  at com.carrotsearch.randomizedtesting.rules.StatementAdapter.evaluate(StatementAdapter.java:36)  at com.carrotsearch.randomizedtesting.rules.SystemPropertiesRestoreRule$1.evaluate(SystemPropertiesRestoreRule.java:57)  at org.junit.rules.RunRules.evaluate(RunRules.java:20)  at org.apache.lucene.util.AbstractBeforeAfterRule$1.evaluate(AbstractBeforeAfterRule.java:45)  at com.carrotsearch.randomizedtesting.rules.StatementAdapter.evaluate(StatementAdapter.java:36)  at org.apache.lucene.util.TestRuleStoreClassName$1.evaluate(TestRuleStoreClassName.java:41)  at com.carrotsearch.randomizedtesting.rules.NoShadowingOrOverridesOnMethodsRule$1.evaluate(NoShadowingOrOverridesOnMethodsRule.java:40)  at com.carrotsearch.randomizedtesting.rules.NoShadowingOrOverridesOnMethodsRule$1.evaluate(NoShadowingOrOverridesOnMethodsRule.java:40)  at com.carrotsearch.randomizedtesting.rules.StatementAdapter.evaluate(StatementAdapter.java:36)  at com.carrotsearch.randomizedtesting.rules.StatementAdapter.evaluate(StatementAdapter.java:36)  at com.carrotsearch.randomizedtesting.rules.StatementAdapter.evaluate(StatementAdapter.java:36)  at org.apache.lucene.util.TestRuleAssertionsRequired$1.evaluate(TestRuleAssertionsRequired.java:53)  at org.apache.lucene.util.TestRuleMarkFailure$1.evaluate(TestRuleMarkFailure.java:47)  at org.apache.lucene.util.TestRuleIgnoreAfterMaxFailures$1.evaluate(TestRuleIgnoreAfterMaxFailures.java:64)  at org.apache.lucene.util.TestRuleIgnoreTestSuites$1.evaluate(TestRuleIgnoreTestSuites.java:54)  at org.junit.rules.RunRules.evaluate(RunRules.java:20)  at com.carrotsearch.randomizedtesting.rules.StatementAdapter.evaluate(StatementAdapter.java:36)  at com.carrotsearch.randomizedtesting.ThreadLeakControl$StatementRunner.run(ThreadLeakControl.java:368)  at java.lang.Thread.run(Thread.java:748)

Stack Trace:
java.lang.AssertionError:
Expected: (an instance of org.apache.solr.common.SolrException and exception with message a string containing "solrcloud section missing required entry 'host'")
     but: exception with message a string containing "solrcloud section missing required entry 'host'" message was "Error parsing 'hostPort', value 'null' cannot be parsed as int"
Stacktrace was: org.apache.solr.common.SolrException: Error parsing 'hostPort', value 'null' cannot be parsed as int
        at org.apache.solr.core.SolrXmlConfig.parseInt(SolrXmlConfig.java:271)
        at org.apache.solr.core.SolrXmlConfig.fillSolrCloudSection(SolrXmlConfig.java:425)
        at org.apache.solr.core.SolrXmlConfig.fromConfig(SolrXmlConfig.java:118)
        at org.apache.solr.core.SolrXmlConfig.fromInputStream(SolrXmlConfig.java:190)
        at org.apache.solr.core.SolrXmlConfig.fromString(SolrXmlConfig.java:175)
        at org.apache.solr.core.TestSolrXml.testCloudConfigRequiresHost(TestSolrXml.java:321)
        at sun.reflect.NativeMethodAccessorImpl.invoke0(Native Method)
        at sun.reflect.NativeMethodAccessorImpl.invoke(NativeMethodAccessorImpl.java:62)
        at sun.reflect.DelegatingMethodAccessorImpl.invoke(DelegatingMethodAccessorImpl.java:43)
        at java.lang.reflect.Method.invoke(Method.java:498)
        at com.carrotsearch.randomizedtesting.RandomizedRunner.invoke(RandomizedRunner.java:1750)
        at com.carrotsearch.randomizedtesting.RandomizedRunner$8.evaluate(RandomizedRunner.java:938)
        at com.carrotsearch.randomizedtesting.RandomizedRunner$9.evaluate(RandomizedRunner.java:974)
        at com.carrotsearch.randomizedtesting.RandomizedRunner$10.evaluate(RandomizedRunner.java:988)
        at org.junit.rules.ExpectedException$ExpectedExceptionStatement.evaluate(ExpectedException.java:258)
        at com.carrotsearch.randomizedtesting.rules.SystemPropertiesRestoreRule$1.evaluate(SystemPropertiesRestoreRule.java:57)
        at org.junit.rules.RunRules.evaluate(RunRules.java:20)
        at org.apache.lucene.util.TestRuleSetupTeardownChained$1.evaluate(TestRuleSetupTeardownChained.java:49)
        at org.apache.lucene.util.AbstractBeforeAfterRule$1.evaluate(AbstractBeforeAfterRule.java:45)
        at org.apache.lucene.util.TestRuleThreadAndTestName$1.evaluate(TestRuleThreadAndTestName.java:48)
        at org.apache.lucene.util.TestRuleIgnoreAfterMaxFailures$1.evaluate(TestRuleIgnoreAfterMaxFailures.java:64)
        at org.apache.lucene.util.TestRuleMarkFailure$1.evaluate(TestRuleMarkFailure.java:47)
        at org.junit.rules.RunRules.evaluate(RunRules.java:20)
        at com.carrotsearch.randomizedtesting.rules.StatementAdapter.evaluate(StatementAdapter.java:36)
        at com.carrotsearch.randomizedtesting.ThreadLeakControl$StatementRunner.run(ThreadLeakControl.java:368)
        at com.carrotsearch.randomizedtesting.ThreadLeakControl.forkTimeoutingTask(ThreadLeakControl.java:817)
        at com.carrotsearch.randomizedtesting.ThreadLeakControl$3.evaluate(ThreadLeakControl.java:468)
        at com.carrotsearch.randomizedtesting.RandomizedRunner.runSingleTest(RandomizedRunner.java:947)
        at com.carrotsearch.randomizedtesting.RandomizedRunner$5.evaluate(RandomizedRunner.java:832)
        at com.carrotsearch.randomizedtesting.RandomizedRunner$6.evaluate(RandomizedRunner.java:883)
        at com.carrotsearch.randomizedtesting.RandomizedRunner$7.evaluate(RandomizedRunner.java:894)
        at com.carrotsearch.randomizedtesting.rules.StatementAdapter.evaluate(StatementAdapter.java:36)
        at com.carrotsearch.randomizedtesting.rules.SystemPropertiesRestoreRule$1.evaluate(SystemPropertiesRestoreRule.java:57)
        at org.junit.rules.RunRules.evaluate(RunRules.java:20)
        at org.apache.lucene.util.AbstractBeforeAfterRule$1.evaluate(AbstractBeforeAfterRule.java:45)
        at com.carrotsearch.randomizedtesting.rules.StatementAdapter.evaluate(StatementAdapter.java:36)
        at org.apache.lucene.util.TestRuleStoreClassName$1.evaluate(TestRuleStoreClassName.java:41)
        at com.carrotsearch.randomizedtesting.rules.NoShadowingOrOverridesOnMethodsRule$1.evaluate(NoShadowingOrOverridesOnMethodsRule.java:40)
        at com.carrotsearch.randomizedtesting.rules.NoShadowingOrOverridesOnMethodsRule$1.evaluate(NoShadowingOrOverridesOnMethodsRule.java:40)
        at com.carrotsearch.randomizedtesting.rules.StatementAdapter.evaluate(StatementAdapter.java:36)
        at com.carrotsearch.randomizedtesting.rules.StatementAdapter.evaluate(StatementAdapter.java:36)
        at com.carrotsearch.randomizedtesting.rules.StatementAdapter.evaluate(StatementAdapter.java:36)
        at org.apache.lucene.util.TestRuleAssertionsRequired$1.evaluate(TestRuleAssertionsRequired.java:53)
        at org.apache.lucene.util.TestRuleMarkFailure$1.evaluate(TestRuleMarkFailure.java:47)
        at org.apache.lucene.util.TestRuleIgnoreAfterMaxFailures$1.evaluate(TestRuleIgnoreAfterMaxFailures.java:64)
        at org.apache.lucene.util.TestRuleIgnoreTestSuites$1.evaluate(TestRuleIgnoreTestSuites.java:54)
        at org.junit.rules.RunRules.evaluate(RunRules.java:20)
        at com.carrotsearch.randomizedtesting.rules.StatementAdapter.evaluate(StatementAdapter.java:36)
        at com.carrotsearch.randomizedtesting.ThreadLeakControl$StatementRunner.run(ThreadLeakControl.java:368)
        at java.lang.Thread.run(Thread.java:748)

        at __randomizedtesting.SeedInfo.seed([7C90141B3577CD13:E29757CA442C43F2]:0)
        at org.hamcrest.MatcherAssert.assertThat(MatcherAssert.java:20)
        at org.junit.Assert.assertThat(Assert.java:964)
        at org.junit.Assert.assertThat(Assert.java:930)
        at org.junit.rules.ExpectedException.handleException(ExpectedException.java:271)
        at org.junit.rules.ExpectedException.access$000(ExpectedException.java:111)
        at org.junit.rules.ExpectedException$ExpectedExceptionStatement.evaluate(ExpectedException.java:260)
        at com.carrotsearch.randomizedtesting.rules.SystemPropertiesRestoreRule$1.evaluate(SystemPropertiesRestoreRule.java:57)
        at org.junit.rules.RunRules.evaluate(RunRules.java:20)
        at org.apache.lucene.util.TestRuleSetupTeardownChained$1.evaluate(TestRuleSetupTeardownChained.java:49)
        at org.apache.lucene.util.AbstractBeforeAfterRule$1.evaluate(AbstractBeforeAfterRule.java:45)
        at org.apache.lucene.util.TestRuleThreadAndTestName$1.evaluate(TestRuleThreadAndTestName.java:48)
        at org.apache.lucene.util.TestRuleIgnoreAfterMaxFailures$1.evaluate(TestRuleIgnoreAfterMaxFailures.java:64)
        at org.apache.lucene.util.TestRuleMarkFailure$1.evaluate(TestRuleMarkFailure.java:47)
        at org.junit.rules.RunRules.evaluate(RunRules.java:20)
        at com.carrotsearch.randomizedtesting.rules.StatementAdapter.evaluate(StatementAdapter.java:36)
        at com.carrotsearch.randomizedtesting.ThreadLeakControl$StatementRunner.run(ThreadLeakControl.java:368)
        at com.carrotsearch.randomizedtesting.ThreadLeakControl.forkTimeoutingTask(ThreadLeakControl.java:817)
        at com.carrotsearch.randomizedtesting.ThreadLeakControl$3.evaluate(ThreadLeakControl.java:468)
        at com.carrotsearch.randomizedtesting.RandomizedRunner.runSingleTest(RandomizedRunner.java:947)
        at com.carrotsearch.randomizedtesting.RandomizedRunner$5.evaluate(RandomizedRunner.java:832)
        at com.carrotsearch.randomizedtesting.RandomizedRunner$6.evaluate(RandomizedRunner.java:883)
        at com.carrotsearch.randomizedtesting.RandomizedRunner$7.evaluate(RandomizedRunner.java:894)
        at com.carrotsearch.randomizedtesting.rules.StatementAdapter.evaluate(StatementAdapter.java:36)
        at com.carrotsearch.randomizedtesting.rules.SystemPropertiesRestoreRule$1.evaluate(SystemPropertiesRestoreRule.java:57)
        at org.junit.rules.RunRules.evaluate(RunRules.java:20)
        at org.apache.lucene.util.AbstractBeforeAfterRule$1.evaluate(AbstractBeforeAfterRule.java:45)
        at com.carrotsearch.randomizedtesting.rules.StatementAdapter.evaluate(StatementAdapter.java:36)
        at org.apache.lucene.util.TestRuleStoreClassName$1.evaluate(TestRuleStoreClassName.java:41)
        at com.carrotsearch.randomizedtesting.rules.NoShadowingOrOverridesOnMethodsRule$1.evaluate(NoShadowingOrOverridesOnMethodsRule.java:40)
        at com.carrotsearch.randomizedtesting.rules.NoShadowingOrOverridesOnMethodsRule$1.evaluate(NoShadowingOrOverridesOnMethodsRule.java:40)
        at com.carrotsearch.randomizedtesting.rules.StatementAdapter.evaluate(StatementAdapter.java:36)
        at com.carrotsearch.randomizedtesting.rules.StatementAdapter.evaluate(StatementAdapter.java:36)
        at com.carrotsearch.randomizedtesting.rules.StatementAdapter.evaluate(StatementAdapter.java:36)
        at org.apache.lucene.util.TestRuleAssertionsRequired$1.evaluate(TestRuleAssertionsRequired.java:53)
        at org.apache.lucene.util.TestRuleMarkFailure$1.evaluate(TestRuleMarkFailure.java:47)
        at org.apache.lucene.util.TestRuleIgnoreAfterMaxFailures$1.evaluate(TestRuleIgnoreAfterMaxFailures.java:64)
        at org.apache.lucene.util.TestRuleIgnoreTestSuites$1.evaluate(TestRuleIgnoreTestSuites.java:54)
        at org.junit.rules.RunRules.evaluate(RunRules.java:20)
        at com.carrotsearch.randomizedtesting.rules.StatementAdapter.evaluate(StatementAdapter.java:36)
        at com.carrotsearch.randomizedtesting.ThreadLeakControl$StatementRunner.run(ThreadLeakControl.java:368)
        at java.lang.Thread.run(Thread.java:748)




Build Log:
[...truncated 13762 lines...]
   [junit4] Suite: org.apache.solr.core.TestSolrXml
   [junit4]   2> 305345 INFO  (SUITE-TestSolrXml-seed#[7C90141B3577CD13]-worker) [     ] o.a.s.SolrTestCase Setting 'solr.default.confdir' system property to test-framework derived value of '/home/jenkins/jenkins-slave/workspace/Lucene/Lucene-Solr-Tests-8.x/solr/server/solr/configsets/_default/conf'
   [junit4]   2> 305345 INFO  (SUITE-TestSolrXml-seed#[7C90141B3577CD13]-worker) [     ] o.a.s.SolrTestCaseJ4 Created dataDir: /home/jenkins/jenkins-slave/workspace/Lucene/Lucene-Solr-Tests-8.x/solr/build/solr-core/test/J1/temp/solr.core.TestSolrXml_7C90141B3577CD13-001/data-dir-40-001
   [junit4]   2> 305345 WARN  (SUITE-TestSolrXml-seed#[7C90141B3577CD13]-worker) [     ] o.a.s.SolrTestCaseJ4 startTrackingSearchers: numOpens=4 numCloses=4
   [junit4]   2> 305345 INFO  (SUITE-TestSolrXml-seed#[7C90141B3577CD13]-worker) [     ] o.a.s.SolrTestCaseJ4 Using TrieFields (NUMERIC_POINTS_SYSPROP=false) w/NUMERIC_DOCVALUES_SYSPROP=true
   [junit4]   2> 305347 INFO  (SUITE-TestSolrXml-seed#[7C90141B3577CD13]-worker) [     ] o.a.s.SolrTestCaseJ4 Randomized ssl (true) and clientAuth (false) via: @org.apache.solr.util.RandomizeSSL(reason=, value=NaN, ssl=NaN, clientAuth=NaN)
   [junit4]   2> 305347 INFO  (SUITE-TestSolrXml-seed#[7C90141B3577CD13]-worker) [     ] o.a.s.SolrTestCaseJ4 SecureRandom sanity checks: test.solr.allowed.securerandom=null & java.security.egd=file:/dev/./urandom
   [junit4]   2> 305352 INFO  (TEST-TestSolrXml.testFailAtConfigParseTimeWhenSolrCloudConfigParamsAreDuplicated-seed#[7C90141B3577CD13]) [     ] o.a.s.SolrTestCaseJ4 ###Starting testFailAtConfigParseTimeWhenSolrCloudConfigParamsAreDuplicated
   [junit4]   2> 305370 INFO  (TEST-TestSolrXml.testFailAtConfigParseTimeWhenSolrCloudConfigParamsAreDuplicated-seed#[7C90141B3577CD13]) [     ] o.a.s.SolrTestCaseJ4 ###Ending testFailAtConfigParseTimeWhenSolrCloudConfigParamsAreDuplicated
   [junit4]   2> 305375 INFO  (TEST-TestSolrXml.testPropertySub-seed#[7C90141B3577CD13]) [     ] o.a.s.SolrTestCaseJ4 ###Starting testPropertySub
   [junit4]   2> 305377 INFO  (TEST-TestSolrXml.testPropertySub-seed#[7C90141B3577CD13]) [     ] o.a.s.c.SolrXmlConfig Loading container configuration from /home/jenkins/jenkins-slave/workspace/Lucene/Lucene-Solr-Tests-8.x/solr/build/solr-core/test/J1/temp/solr.core.TestSolrXml_7C90141B3577CD13-001/tempDir-002/solr.xml
   [junit4]   2> 305380 INFO  (TEST-TestSolrXml.testPropertySub-seed#[7C90141B3577CD13]) [     ] o.a.s.c.SolrXmlConfig MBean server found: com.sun.jmx.mbeanserver.JmxMBeanServer@6ef35b0, but no JMX reporters were configured - adding default JMX reporter.
   [junit4]   2> 305381 INFO  (TEST-TestSolrXml.testPropertySub-seed#[7C90141B3577CD13]) [     ] o.a.s.SolrTestCaseJ4 ###Ending testPropertySub
   [junit4]   2> 305385 INFO  (TEST-TestSolrXml.testValidStringValueWhenBoolTypeIsExpected-seed#[7C90141B3577CD13]) [     ] o.a.s.SolrTestCaseJ4 ###Starting testValidStringValueWhenBoolTypeIsExpected
   [junit4]   2> 305387 INFO  (TEST-TestSolrXml.testValidStringValueWhenBoolTypeIsExpected-seed#[7C90141B3577CD13]) [     ] o.a.s.c.SolrXmlConfig MBean server found: com.sun.jmx.mbeanserver.JmxMBeanServer@6ef35b0, but no JMX reporters were configured - adding default JMX reporter.
   [junit4]   2> 305387 INFO  (TEST-TestSolrXml.testValidStringValueWhenBoolTypeIsExpected-seed#[7C90141B3577CD13]) [     ] o.a.s.SolrTestCaseJ4 ###Ending testValidStringValueWhenBoolTypeIsExpected
   [junit4]   2> 305390 INFO  (TEST-TestSolrXml.testCloudConfigRequiresHostPort-seed#[7C90141B3577CD13]) [     ] o.a.s.SolrTestCaseJ4 ###Starting testCloudConfigRequiresHostPort
   [junit4]   2> 305391 INFO  (TEST-TestSolrXml.testCloudConfigRequiresHostPort-seed#[7C90141B3577CD13]) [     ] o.a.s.SolrTestCaseJ4 ###Ending testCloudConfigRequiresHostPort
   [junit4]   2> NOTE: reproduce with: ant test  -Dtestcase=TestSolrXml -Dtests.method=testCloudConfigRequiresHostPort -Dtests.seed=7C90141B3577CD13 -Dtests.multiplier=2 -Dtests.slow=true -Dtests.locale=sq -Dtests.timezone=Asia/Pyongyang -Dtests.asserts=true -Dtests.file.encoding=UTF-8
   [junit4] FAILURE 0.01s J1 | TestSolrXml.testCloudConfigRequiresHostPort <<<
   [junit4]    > Throwable #1: java.lang.AssertionError:
   [junit4]    > Expected: (an instance of org.apache.solr.common.SolrException and exception with message a string containing "solrcloud section missing required entry 'hostPort'")
   [junit4]    >      but: exception with message a string containing "solrcloud section missing required entry 'hostPort'" message was "Error parsing 'hostPort', value 'null' cannot be parsed as int"
   [junit4]    > Stacktrace was: org.apache.solr.common.SolrException: Error parsing 'hostPort', value 'null' cannot be parsed as int
   [junit4]    >        at org.apache.solr.core.SolrXmlConfig.parseInt(SolrXmlConfig.java:271)
   [junit4]    >        at org.apache.solr.core.SolrXmlConfig.fillSolrCloudSection(SolrXmlConfig.java:425)
   [junit4]    >        at org.apache.solr.core.SolrXmlConfig.fromConfig(SolrXmlConfig.java:118)
   [junit4]    >        at org.apache.solr.core.SolrXmlConfig.fromInputStream(SolrXmlConfig.java:190)
   [junit4]    >        at org.apache.solr.core.SolrXmlConfig.fromString(SolrXmlConfig.java:175)
   [junit4]    >        at org.apache.solr.core.TestSolrXml.testCloudConfigRequiresHostPort(TestSolrXml.java:328)
   [junit4]    >        at java.lang.Thread.run(Thread.java:748)
   [junit4]    >        at __randomizedtesting.SeedInfo.seed([7C90141B3577CD13:F41C39F00B2AD8A8]:0)
   [junit4]    >        at org.hamcrest.MatcherAssert.assertThat(MatcherAssert.java:20)
   [junit4]    >        at java.lang.Thread.run(Thread.java:748)
   [junit4]   2> 305395 INFO  (TEST-TestSolrXml.testExplicitNullGivesDefaults-seed#[7C90141B3577CD13]) [     ] o.a.s.SolrTestCaseJ4 ###Starting testExplicitNullGivesDefaults
   [junit4]   2> 305398 INFO  (TEST-TestSolrXml.testExplicitNullGivesDefaults-seed#[7C90141B3577CD13]) [     ] o.a.s.c.SolrXmlConfig MBean server found: com.sun.jmx.mbeanserver.JmxMBeanServer@6ef35b0, but no JMX reporters were configured - adding default JMX reporter.
   [junit4]   2> 305398 INFO  (TEST-TestSolrXml.testExplicitNullGivesDefaults-seed#[7C90141B3577CD13]) [     ] o.a.s.SolrTestCaseJ4 ###Ending testExplicitNullGivesDefaults
   [junit4]   2> 305401 INFO  (TEST-TestSolrXml.testIntAsLongBad-seed#[7C90141B3577CD13]) [     ] o.a.s.SolrTestCaseJ4 ###Starting testIntAsLongBad
   [junit4]   2> 305403 INFO  (TEST-TestSolrXml.testIntAsLongBad-seed#[7C90141B3577CD13]) [     ] o.a.s.c.SolrXmlConfig MBean server found: com.sun.jmx.mbeanserver.JmxMBeanServer@6ef35b0, but no JMX reporters were configured - adding default JMX reporter.
   [junit4]   2> 305404 INFO  (TEST-TestSolrXml.testIntAsLongBad-seed#[7C90141B3577CD13]) [     ] o.a.s.SolrTestCaseJ4 ###Ending testIntAsLongBad
   [junit4]   2> 305406 INFO  (TEST-TestSolrXml.testMultiLoggingWatcherSectionError-seed#[7C90141B3577CD13]) [     ] o.a.s.SolrTestCaseJ4 ###Starting testMultiLoggingWatcherSectionError
   [junit4]   2> 305408 INFO  (TEST-TestSolrXml.testMultiLoggingWatcherSectionError-seed#[7C90141B3577CD13]) [     ] o.a.s.SolrTestCaseJ4 ###Ending testMultiLoggingWatcherSectionError
   [junit4]   2> 305410 INFO  (TEST-TestSolrXml.testMultiLoggingSectionError-seed#[7C90141B3577CD13]) [     ] o.a.s.SolrTestCaseJ4 ###Starting testMultiLoggingSectionError
   [junit4]   2> 305412 INFO  (TEST-TestSolrXml.testMultiLoggingSectionError-seed#[7C90141B3577CD13]) [     ] o.a.s.SolrTestCaseJ4 ###Ending testMultiLoggingSectionError
   [junit4]   2> 305414 INFO  (TEST-TestSolrXml.testIntAsLongOk-seed#[7C90141B3577CD13]) [     ] o.a.s.SolrTestCaseJ4 ###Starting testIntAsLongOk
   [junit4]   2> 305416 INFO  (TEST-TestSolrXml.testIntAsLongOk-seed#[7C90141B3577CD13]) [     ] o.a.s.c.SolrXmlConfig MBean server found: com.sun.jmx.mbeanserver.JmxMBeanServer@6ef35b0, but no JMX reporters were configured - adding default JMX reporter.
   [junit4]   2> 305417 INFO  (TEST-TestSolrXml.testIntAsLongOk-seed#[7C90141B3577CD13]) [     ] o.a.s.SolrTestCaseJ4 ###Ending testIntAsLongOk
   [junit4]   2> 305419 INFO  (TEST-TestSolrXml.testCloudConfigRequiresHost-seed#[7C90141B3577CD13]) [     ] o.a.s.SolrTestCaseJ4 ###Starting testCloudConfigRequiresHost
   [junit4]   2> 305441 INFO  (TEST-TestSolrXml.testCloudConfigRequiresHost-seed#[7C90141B3577CD13]) [     ] o.a.s.SolrTestCaseJ4 ###Ending testCloudConfigRequiresHost
   [junit4]   2> NOTE: reproduce with: ant test  -Dtestcase=TestSolrXml -Dtests.method=testCloudConfigRequiresHost -Dtests.seed=7C90141B3577CD13 -Dtests.multiplier=2 -Dtests.slow=true -Dtests.locale=sq -Dtests.timezone=Asia/Pyongyang -Dtests.asserts=true -Dtests.file.encoding=UTF-8
   [junit4] FAILURE 0.02s J1 | TestSolrXml.testCloudConfigRequiresHost <<<
   [junit4]    > Throwable #1: java.lang.AssertionError:
   [junit4]    > Expected: (an instance of org.apache.solr.common.SolrException and exception with message a string containing "solrcloud section missing required entry 'host'")
   [junit4]    >      but: exception with message a string containing "solrcloud section missing required entry 'host'" message was "Error parsing 'hostPort', value 'null' cannot be parsed as int"
   [junit4]    > Stacktrace was: org.apache.solr.common.SolrException: Error parsing 'hostPort', value 'null' cannot be parsed as int
   [junit4]    >        at org.apache.solr.core.SolrXmlConfig.parseInt(SolrXmlConfig.java:271)
   [junit4]    >        at org.apache.solr.core.SolrXmlConfig.fillSolrCloudSection(SolrXmlConfig.java:425)
   [junit4]    >        at org.apache.solr.core.SolrXmlConfig.fromConfig(SolrXmlConfig.java:118)
   [junit4]    >        at org.apache.solr.core.SolrXmlConfig.fromInputStream(SolrXmlConfig.java:190)
   [junit4]    >        at org.apache.solr.core.SolrXmlConfig.fromString(SolrXmlConfig.java:175)
   [junit4]    >        at org.apache.solr.core.TestSolrXml.testCloudConfigRequiresHost(TestSolrXml.java:321)
   [junit4]    >        at java.lang.Thread.run(Thread.java:748)
   [junit4]    >        at __randomizedtesting.SeedInfo.seed([7C90141B3577CD13:E29757CA442C43F2]:0)
   [junit4]    >        at org.hamcrest.MatcherAssert.assertThat(MatcherAssert.java:20)
   [junit4]    >        at java.lang.Thread.run(Thread.java:748)
   [junit4]   2> 305444 INFO  (TEST-TestSolrXml.testFailAtConfigParseTimeWhenUnrecognizedSolrCloudOptionWasFound-seed#[7C90141B3577CD13]) [     ] o.a.s.SolrTestCaseJ4 ###Starting testFailAtConfigParseTimeWhenUnrecognizedSolrCloudOptionWasFound
   [junit4]   2> 305446 INFO  (TEST-TestSolrXml.testFailAtConfigParseTimeWhenUnrecognizedSolrCloudOptionWasFound-seed#[7C90141B3577CD13]) [     ] o.a.s.SolrTestCaseJ4 ###Ending testFailAtConfigParseTimeWhenUnrecognizedSolrCloudOptionWasFound
   [junit4]   2> 305448 INFO  (TEST-TestSolrXml.testFailAtConfigParseTimeWhenUnrecognizedSolrOptionWasFound-seed#[7C90141B3577CD13]) [     ] o.a.s.SolrTestCaseJ4 ###Starting testFailAtConfigParseTimeWhenUnrecognizedSolrOptionWasFound
   [junit4]   2> 305451 INFO  (TEST-TestSolrXml.testFailAtConfigParseTimeWhenUnrecognizedSolrOptionWasFound-seed#[7C90141B3577CD13]) [     ] o.a.s.c.SolrXmlConfig MBean server found: com.sun.jmx.mbeanserver.JmxMBeanServer@6ef35b0, but no JMX reporters were configured - adding default JMX reporter.
   [junit4]   2> 305451 INFO  (TEST-TestSolrXml.testFailAtConfigParseTimeWhenUnrecognizedSolrOptionWasFound-seed#[7C90141B3577CD13]) [     ] o.a.s.SolrTestCaseJ4 ###Ending testFailAtConfigParseTimeWhenUnrecognizedSolrOptionWasFound
   [junit4]   2> 305453 INFO  (TEST-TestSolrXml.testFailAtConfigParseTimeWhenIntTypeIsExpectedAndBoolTypeIsGiven-seed#[7C90141B3577CD13]) [     ] o.a.s.SolrTestCaseJ4 ###Starting testFailAtConfigParseTimeWhenIntTypeIsExpectedAndBoolTypeIsGiven
   [junit4]   2> 305456 INFO  (TEST-TestSolrXml.testFailAtConfigParseTimeWhenIntTypeIsExpectedAndBoolTypeIsGiven-seed#[7C90141B3577CD13]) [     ] o.a.s.SolrTestCaseJ4 ###Ending testFailAtConfigParseTimeWhenIntTypeIsExpectedAndBoolTypeIsGiven
   [junit4]   2> 305458 INFO  (TEST-TestSolrXml.testFailAtConfigParseTimeWhenUnrecognizedLoggingOptionWasFound-seed#[7C90141B3577CD13]) [     ] o.a.s.SolrTestCaseJ4 ###Starting testFailAtConfigParseTimeWhenUnrecognizedLoggingOptionWasFound
   [junit4]   2> 305460 INFO  (TEST-TestSolrXml.testFailAtConfigParseTimeWhenUnrecognizedLoggingOptionWasFound-seed#[7C90141B3577CD13]) [     ] o.a.s.SolrTestCaseJ4 ###Ending testFailAtConfigParseTimeWhenUnrecognizedLoggingOptionWasFound
   [junit4]   2> 305463 INFO  (TEST-TestSolrXml.testFailAtConfigParseTimeWhenLoggingConfigParamsAreDuplicated-seed#[7C90141B3577CD13]) [     ] o.a.s.SolrTestCaseJ4 ###Starting testFailAtConfigParseTimeWhenLoggingConfigParamsAreDuplicated
   [junit4]   2> 305465 INFO  (TEST-TestSolrXml.testFailAtConfigParseTimeWhenLoggingConfigParamsAreDuplicated-seed#[7C90141B3577CD13]) [     ] o.a.s.SolrTestCaseJ4 ###Ending testFailAtConfigParseTimeWhenLoggingConfigParamsAreDuplicated
   [junit4]   2> 305467 INFO  (TEST-TestSolrXml.testCloudConfigRequiresHostContext-seed#[7C90141B3577CD13]) [     ] o.a.s.SolrTestCaseJ4 ###Starting testCloudConfigRequiresHostContext
   [junit4]   2> 305470 INFO  (TEST-TestSolrXml.testCloudConfigRequiresHostContext-seed#[7C90141B3577CD13]) [     ] o.a.s.SolrTestCaseJ4 ###Ending testCloudConfigRequiresHostContext
   [junit4]   2> 305472 INFO  (TEST-TestSolrXml.testValidStringValueWhenIntTypeIsExpected-seed#[7C90141B3577CD13]) [     ] o.a.s.SolrTestCaseJ4 ###Starting testValidStringValueWhenIntTypeIsExpected
   [junit4]   2> 305474 INFO  (TEST-TestSolrXml.testValidStringValueWhenIntTypeIsExpected-seed#[7C90141B3577CD13]) [     ] o.a.s.c.SolrXmlConfig MBean server found: com.sun.jmx.mbeanserver.JmxMBeanServer@6ef35b0, but no JMX reporters were configured - adding default JMX reporter.
   [junit4]   2> 305475 INFO  (TEST-TestSolrXml.testValidStringValueWhenIntTypeIsExpected-seed#[7C90141B3577CD13]) [     ] o.a.s.SolrTestCaseJ4 ###Ending testValidStringValueWhenIntTypeIsExpected
   [junit4]   2> 305477 INFO  (TEST-TestSolrXml.testMultiCloudSectionError-seed#[7C90141B3577CD13]) [     ] o.a.s.SolrTestCaseJ4 ###Starting testMultiCloudSectionError
   [junit4]   2> 305479 INFO  (TEST-TestSolrXml.testMultiCloudSectionError-seed#[7C90141B3577CD13]) [     ] o.a.s.SolrTestCaseJ4 ###Ending testMultiCloudSectionError
   [junit4]   2> 305481 INFO  (TEST-TestSolrXml.testFailAtConfigParseTimeWhenIntTypeIsExpectedAndLongTypeIsGiven-seed#[7C90141B3577CD13]) [     ] o.a.s.SolrTestCaseJ4 ###Starting testFailAtConfigParseTimeWhenIntTypeIsExpectedAndLongTypeIsGiven
   [junit4]   2> 305484 INFO  (TEST-TestSolrXml.testFailAtConfigParseTimeWhenIntTypeIsExpectedAndLongTypeIsGiven-seed#[7C90141B3577CD13]) [     ] o.a.s.SolrTestCaseJ4 ###Ending testFailAtConfigParseTimeWhenIntTypeIsExpectedAndLongTypeIsGiven
   [junit4]   2> 305486 INFO  (TEST-TestSolrXml.testMultiBackupSectionError-seed#[7C90141B3577CD13]) [     ] o.a.s.SolrTestCaseJ4 ###Starting testMultiBackupSectionError
   [junit4]   2> 305488 INFO  (TEST-TestSolrXml.testMultiBackupSectionError-seed#[7C90141B3577CD13]) [     ] o.a.s.SolrTestCaseJ4 ###Ending testMultiBackupSectionError
   [junit4]   2> 305490 INFO  (TEST-TestSolrXml.testAllInfoPresent-seed#[7C90141B3577CD13]) [     ] o.a.s.SolrTestCaseJ4 ###Starting testAllInfoPresent
   [junit4]   2> 305492 INFO  (TEST-TestSolrXml.testAllInfoPresent-seed#[7C90141B3577CD13]) [     ] o.a.s.c.SolrXmlConfig Loading container configuration from /home/jenkins/jenkins-slave/workspace/Lucene/Lucene-Solr-Tests-8.x/solr/build/solr-core/test/J1/temp/solr.core.TestSolrXml_7C90141B3577CD13-001/tempDir-021/solr.xml
   [junit4]   2> 305495 INFO  (TEST-TestSolrXml.testAllInfoPresent-seed#[7C90141B3577CD13]) [     ] o.a.s.c.SolrXmlConfig MBean server found: com.sun.jmx.mbeanserver.JmxMBeanServer@6ef35b0, but no JMX reporters were configured - adding default JMX reporter.
   [junit4]   2> 305497 INFO  (TEST-TestSolrXml.testAllInfoPresent-seed#[7C90141B3577CD13]) [     ] o.a.s.SolrTestCaseJ4 ###Ending testAllInfoPresent
   [junit4]   2> 305500 INFO  (TEST-TestSolrXml.testFailAtConfigParseTimeWhenBoolTypeIsExpectedAndValueIsInvalidString-seed#[7C90141B3577CD13]) [     ] o.a.s.SolrTestCaseJ4 ###Starting testFailAtConfigParseTimeWhenBoolTypeIsExpectedAndValueIsInvalidString
   [junit4]   2> 305502 INFO  (TEST-TestSolrXml.testFailAtConfigParseTimeWhenBoolTypeIsExpectedAndValueIsInvalidString-seed#[7C90141B3577CD13]) [     ] o.a.s.SolrTestCaseJ4 ###Ending testFailAtConfigParseTimeWhenBoolTypeIsExpectedAndValueIsInvalidString
   [junit4]   2> NOTE: leaving temporary files on disk at: /home/jenkins/jenkins-slave/workspace/Lucene/Lucene-Solr-Tests-8.x/solr/build/solr-core/test/J1/temp/solr.core.TestSolrXml_7C90141B3577CD13-001
   [junit4]   2> NOTE: test params are: codec=Asserting(Lucene87): {}, docValues:{}, maxPointsInLeafNode=1601, maxMBSortInHeap=5.068237930578239, sim=Asserting(RandomSimilarity(queryNorm=true): {}), locale=sq, timezone=Asia/Pyongyang
   [junit4]   2> NOTE: Linux 5.4.0-45-generic amd64/Oracle Corporation 1.8.0_252 (64-bit)/cpus=4,threads=1,free=129047856,total=498597888
   [junit4]   2> NOTE: All tests run in this JVM: [MergeStrategyTest, DistributedDebugComponentTest, ResponseBuilderTest, TestPerFieldSimilarityWithDefaultOverride, V2ApiIntegrationTest, TestApiFramework, ScheduledMaintenanceTriggerTest, RankQueryTest, TriggerEventQueueTest, TestOrdValues, LeaderTragicEventTest, SimpleMLTQParserTest, TestDistributedMap, TestSolr4Spatial, GraphQueryTest, CircularListTest, TestCloudSchemaless, RoutingToNodesWithPropertiesTest, ByteBuffersDirectoryFactoryTest, TestPullReplicaErrorHandling, TestDelegationWithHadoopAuth, TestSubQueryTransformer, SolrCmdDistributorTest, TestCloudDeleteByQuery, TestStressUserVersions, TestCollectionAPI, ConnectionReuseTest, TestSimNodeLostTrigger, TestSolrQueryResponse, TestSimUtils, TestSolrCoreProperties, TestFastLRUCache, TestFoldingMultitermQuery, TestCircuitBreaker, DocValuesMultiTest, ScriptEngineTest, TestConfigOverlay, TestDynamicFieldCollectionResource, HdfsBasicDistributedZkTest, MetricsHistoryWithAuthIntegrationTest, PingRequestHandlerTest, NestedShardedAtomicUpdateTest, IndexSchemaRuntimeFieldTest, PackageManagerCLITest, MoveReplicaHDFSTest, NodeLostTriggerIntegrationTest, AsyncCallRequestStatusResponseTest, TestSolrXml]
   [junit4] Completed [157/924 (1!)] on J1 in 0.26s, 23 tests, 2 failures, 1 skipped <<< FAILURES!

[...truncated 53319 lines...]

---------------------------------------------------------------------
To unsubscribe, e-mail: [hidden email]
For additional commands, e-mail: [hidden email]