Re: [JENKINS] Lucene-Solr-8.x-Linux (64bit/jdk-12.0.1) - Build # 1434 - Failure!

classic Classic list List threaded Threaded
1 message Options
Reply | Threaded
Open this post in threaded view
|

Re: [JENKINS] Lucene-Solr-8.x-Linux (64bit/jdk-12.0.1) - Build # 1434 - Failure!

Mikhail Khludnev-2
I'm on it. 

On Fri, Nov 1, 2019 at 3:53 PM Policeman Jenkins Server <[hidden email]> wrote:
Build: https://jenkins.thetaphi.de/job/Lucene-Solr-8.x-Linux/1434/
Java: 64bit/jdk-12.0.1 -XX:-UseCompressedOops -XX:+UseG1GC

All tests passed

Build Log:
[...truncated 9780 lines...]
    [javac] Compiling 27 source files to /home/jenkins/workspace/Lucene-Solr-8.x-Linux/lucene/build/queries/classes/test
    [javac] /home/jenkins/workspace/Lucene-Solr-8.x-Linux/lucene/queries/src/test/org/apache/lucene/queries/function/TestValueSources.java:553: warning: [rawtypes] found raw type: Map
    [javac]     final Map context = ValueSource.newContext(searcher);
    [javac]           ^
    [javac]   missing type arguments for generic class Map<K,V>
    [javac]   where K,V are type-variables:
    [javac]     K extends Object declared in interface Map
    [javac]     V extends Object declared in interface Map
    [javac] /home/jenkins/workspace/Lucene-Solr-8.x-Linux/lucene/queries/src/test/org/apache/lucene/queries/function/TestValueSources.java:636: warning: [rawtypes] found raw type: Map
    [javac]     Map context = ValueSource.newContext(searcher);
    [javac]     ^
    [javac]   missing type arguments for generic class Map<K,V>
    [javac]   where K,V are type-variables:
    [javac]     K extends Object declared in interface Map
    [javac]     V extends Object declared in interface Map
    [javac] /home/jenkins/workspace/Lucene-Solr-8.x-Linux/lucene/queries/src/test/org/apache/lucene/queries/function/TestValueSources.java:700: warning: [rawtypes] found raw type: Map
    [javac]     public FunctionValues getValues(Map context, LeafReaderContext readerContext) {
    [javac]                                     ^
    [javac]   missing type arguments for generic class Map<K,V>
    [javac]   where K,V are type-variables:
    [javac]     K extends Object declared in interface Map
    [javac]     V extends Object declared in interface Map
    [javac] /home/jenkins/workspace/Lucene-Solr-8.x-Linux/lucene/queries/src/test/org/apache/lucene/queries/intervals/TestIntervals.java:743: error: cannot find symbol
    [javac]     for (IntervalsSource source : List.of(Intervals.prefix(new BytesRef("p")),
    [javac]                                       ^
    [javac]   symbol:   method of(IntervalsSource,IntervalsSource)
    [javac]   location: interface List
    [javac] /home/jenkins/workspace/Lucene-Solr-8.x-Linux/lucene/queries/src/test/org/apache/lucene/queries/intervals/TestIntervals.java:759: error: cannot find symbol
    [javac]     for (IntervalsSource noSuch : List.of(Intervals.prefix(new BytesRef("qqq")),
    [javac]                                       ^
    [javac]   symbol:   method of(IntervalsSource,IntervalsSource)
    [javac]   location: interface List
    [javac] /home/jenkins/workspace/Lucene-Solr-8.x-Linux/lucene/queries/src/test/org/apache/lucene/queries/intervals/TestIntervals.java:764: error: cannot find symbol
    [javac]     for (IntervalsSource source : List.of(Intervals.prefix(new BytesRef("p"), 1),
    [javac]                                       ^
    [javac]   symbol:   method of(IntervalsSource,IntervalsSource)
    [javac]   location: interface List
    [javac] /home/jenkins/workspace/Lucene-Solr-8.x-Linux/lucene/queries/src/test/org/apache/lucene/queries/payloads/TestPayloadCheckQuery.java:214: warning: [rawtypes] found raw type: SpanMultiTermQueryWrapper
    [javac]     SpanMultiTermQueryWrapper fiv = new SpanMultiTermQueryWrapper(new WildcardQuery(new Term("field", "fiv*")));
    [javac]     ^
    [javac]   missing type arguments for generic class SpanMultiTermQueryWrapper<Q>
    [javac]   where Q is a type-variable:
    [javac]     Q extends MultiTermQuery declared in class SpanMultiTermQueryWrapper
    [javac] /home/jenkins/workspace/Lucene-Solr-8.x-Linux/lucene/queries/src/test/org/apache/lucene/queries/payloads/TestPayloadCheckQuery.java:214: warning: [rawtypes] found raw type: SpanMultiTermQueryWrapper
    [javac]     SpanMultiTermQueryWrapper fiv = new SpanMultiTermQueryWrapper(new WildcardQuery(new Term("field", "fiv*")));
    [javac]                                         ^
    [javac]   missing type arguments for generic class SpanMultiTermQueryWrapper<Q>
    [javac]   where Q is a type-variable:
    [javac]     Q extends MultiTermQuery declared in class SpanMultiTermQueryWrapper
    [javac] /home/jenkins/workspace/Lucene-Solr-8.x-Linux/lucene/queries/src/test/org/apache/lucene/queries/payloads/TestPayloadCheckQuery.java:214: warning: [unchecked] unchecked call to SpanMultiTermQueryWrapper(Q) as a member of the raw type SpanMultiTermQueryWrapper
    [javac]     SpanMultiTermQueryWrapper fiv = new SpanMultiTermQueryWrapper(new WildcardQuery(new Term("field", "fiv*")));
    [javac]                                     ^
    [javac]   where Q is a type-variable:
    [javac]     Q extends MultiTermQuery declared in class SpanMultiTermQueryWrapper
    [javac] /home/jenkins/workspace/Lucene-Solr-8.x-Linux/lucene/queries/src/test/org/apache/lucene/queries/payloads/TestPayloadCheckQuery.java:215: warning: [rawtypes] found raw type: SpanMultiTermQueryWrapper
    [javac]     SpanMultiTermQueryWrapper hund = new SpanMultiTermQueryWrapper(new WildcardQuery(new Term("field", "hund*")));
    [javac]     ^
    [javac]   missing type arguments for generic class SpanMultiTermQueryWrapper<Q>
    [javac]   where Q is a type-variable:
    [javac]     Q extends MultiTermQuery declared in class SpanMultiTermQueryWrapper
    [javac] /home/jenkins/workspace/Lucene-Solr-8.x-Linux/lucene/queries/src/test/org/apache/lucene/queries/payloads/TestPayloadCheckQuery.java:215: warning: [rawtypes] found raw type: SpanMultiTermQueryWrapper
    [javac]     SpanMultiTermQueryWrapper hund = new SpanMultiTermQueryWrapper(new WildcardQuery(new Term("field", "hund*")));
    [javac]                                          ^
    [javac]   missing type arguments for generic class SpanMultiTermQueryWrapper<Q>
    [javac]   where Q is a type-variable:
    [javac]     Q extends MultiTermQuery declared in class SpanMultiTermQueryWrapper
    [javac] /home/jenkins/workspace/Lucene-Solr-8.x-Linux/lucene/queries/src/test/org/apache/lucene/queries/payloads/TestPayloadCheckQuery.java:215: warning: [unchecked] unchecked call to SpanMultiTermQueryWrapper(Q) as a member of the raw type SpanMultiTermQueryWrapper
    [javac]     SpanMultiTermQueryWrapper hund = new SpanMultiTermQueryWrapper(new WildcardQuery(new Term("field", "hund*")));
    [javac]                                      ^
    [javac]   where Q is a type-variable:
    [javac]     Q extends MultiTermQuery declared in class SpanMultiTermQueryWrapper
    [javac] /home/jenkins/workspace/Lucene-Solr-8.x-Linux/lucene/queries/src/test/org/apache/lucene/queries/payloads/TestPayloadCheckQuery.java:216: warning: [rawtypes] found raw type: SpanMultiTermQueryWrapper
    [javac]     SpanMultiTermQueryWrapper twent = new SpanMultiTermQueryWrapper(new WildcardQuery(new Term("field", "twent*")));
    [javac]     ^
    [javac]   missing type arguments for generic class SpanMultiTermQueryWrapper<Q>
    [javac]   where Q is a type-variable:
    [javac]     Q extends MultiTermQuery declared in class SpanMultiTermQueryWrapper
    [javac] /home/jenkins/workspace/Lucene-Solr-8.x-Linux/lucene/queries/src/test/org/apache/lucene/queries/payloads/TestPayloadCheckQuery.java:216: warning: [rawtypes] found raw type: SpanMultiTermQueryWrapper
    [javac]     SpanMultiTermQueryWrapper twent = new SpanMultiTermQueryWrapper(new WildcardQuery(new Term("field", "twent*")));
    [javac]                                           ^
    [javac]   missing type arguments for generic class SpanMultiTermQueryWrapper<Q>
    [javac]   where Q is a type-variable:
    [javac]     Q extends MultiTermQuery declared in class SpanMultiTermQueryWrapper
    [javac] /home/jenkins/workspace/Lucene-Solr-8.x-Linux/lucene/queries/src/test/org/apache/lucene/queries/payloads/TestPayloadCheckQuery.java:216: warning: [unchecked] unchecked call to SpanMultiTermQueryWrapper(Q) as a member of the raw type SpanMultiTermQueryWrapper
    [javac]     SpanMultiTermQueryWrapper twent = new SpanMultiTermQueryWrapper(new WildcardQuery(new Term("field", "twent*")));
    [javac]                                       ^
    [javac]   where Q is a type-variable:
    [javac]     Q extends MultiTermQuery declared in class SpanMultiTermQueryWrapper
    [javac] /home/jenkins/workspace/Lucene-Solr-8.x-Linux/lucene/queries/src/test/org/apache/lucene/queries/payloads/TestPayloadCheckQuery.java:217: warning: [rawtypes] found raw type: SpanMultiTermQueryWrapper
    [javac]     SpanMultiTermQueryWrapper nin = new SpanMultiTermQueryWrapper(new WildcardQuery(new Term("field", "nin*")));
    [javac]     ^
    [javac]   missing type arguments for generic class SpanMultiTermQueryWrapper<Q>
    [javac]   where Q is a type-variable:
    [javac]     Q extends MultiTermQuery declared in class SpanMultiTermQueryWrapper
    [javac] /home/jenkins/workspace/Lucene-Solr-8.x-Linux/lucene/queries/src/test/org/apache/lucene/queries/payloads/TestPayloadCheckQuery.java:217: warning: [rawtypes] found raw type: SpanMultiTermQueryWrapper
    [javac]     SpanMultiTermQueryWrapper nin = new SpanMultiTermQueryWrapper(new WildcardQuery(new Term("field", "nin*")));
    [javac]                                         ^
    [javac]   missing type arguments for generic class SpanMultiTermQueryWrapper<Q>
    [javac]   where Q is a type-variable:
    [javac]     Q extends MultiTermQuery declared in class SpanMultiTermQueryWrapper
    [javac] /home/jenkins/workspace/Lucene-Solr-8.x-Linux/lucene/queries/src/test/org/apache/lucene/queries/payloads/TestPayloadCheckQuery.java:217: warning: [unchecked] unchecked call to SpanMultiTermQueryWrapper(Q) as a member of the raw type SpanMultiTermQueryWrapper
    [javac]     SpanMultiTermQueryWrapper nin = new SpanMultiTermQueryWrapper(new WildcardQuery(new Term("field", "nin*")));
    [javac]                                     ^
    [javac]   where Q is a type-variable:
    [javac]     Q extends MultiTermQuery declared in class SpanMultiTermQueryWrapper
    [javac] /home/jenkins/workspace/Lucene-Solr-8.x-Linux/lucene/queries/src/test/org/apache/lucene/queries/payloads/TestPayloadScoreQuery.java:198: warning: [rawtypes] found raw type: SpanMultiTermQueryWrapper
    [javac]     SpanMultiTermQueryWrapper xyz = new SpanMultiTermQueryWrapper<>(new WildcardQuery(new Term("field", "xyz*")));
    [javac]     ^
    [javac]   missing type arguments for generic class SpanMultiTermQueryWrapper<Q>
    [javac]   where Q is a type-variable:
    [javac]     Q extends MultiTermQuery declared in class SpanMultiTermQueryWrapper
    [javac] Note: /home/jenkins/workspace/Lucene-Solr-8.x-Linux/lucene/queries/src/test/org/apache/lucene/queries/payloads/PayloadHelper.java uses or overrides a deprecated API.
    [javac] Note: Recompile with -Xlint:deprecation for details.
    [javac] 3 errors

[...truncated 1 lines...]
BUILD FAILED
/home/jenkins/workspace/Lucene-Solr-8.x-Linux/build.xml:634: The following error occurred while executing this line:
/home/jenkins/workspace/Lucene-Solr-8.x-Linux/build.xml:578: The following error occurred while executing this line:
/home/jenkins/workspace/Lucene-Solr-8.x-Linux/build.xml:59: The following error occurred while executing this line:
/home/jenkins/workspace/Lucene-Solr-8.x-Linux/lucene/build.xml:481: The following error occurred while executing this line:
/home/jenkins/workspace/Lucene-Solr-8.x-Linux/lucene/common-build.xml:2290: The following error occurred while executing this line:
/home/jenkins/workspace/Lucene-Solr-8.x-Linux/lucene/module-build.xml:67: The following error occurred while executing this line:
/home/jenkins/workspace/Lucene-Solr-8.x-Linux/lucene/module-build.xml:64: The following error occurred while executing this line:
/home/jenkins/workspace/Lucene-Solr-8.x-Linux/lucene/common-build.xml:921: The following error occurred while executing this line:
/home/jenkins/workspace/Lucene-Solr-8.x-Linux/lucene/common-build.xml:933: The following error occurred while executing this line:
/home/jenkins/workspace/Lucene-Solr-8.x-Linux/lucene/common-build.xml:2074: Compile failed; see the compiler error output for details.

Total time: 25 minutes 43 seconds
Build step 'Invoke Ant' marked build as failure
Archiving artifacts
Setting ANT_1_8_2_HOME=/home/jenkins/tools/hudson.tasks.Ant_AntInstallation/ANT_1.8.2
[WARNINGS] Skipping publisher since build result is FAILURE
Recording test results
Setting ANT_1_8_2_HOME=/home/jenkins/tools/hudson.tasks.Ant_AntInstallation/ANT_1.8.2
Email was triggered for: Failure - Any
Sending email for trigger: Failure - Any
Setting ANT_1_8_2_HOME=/home/jenkins/tools/hudson.tasks.Ant_AntInstallation/ANT_1.8.2
Setting ANT_1_8_2_HOME=/home/jenkins/tools/hudson.tasks.Ant_AntInstallation/ANT_1.8.2
Setting ANT_1_8_2_HOME=/home/jenkins/tools/hudson.tasks.Ant_AntInstallation/ANT_1.8.2
Setting ANT_1_8_2_HOME=/home/jenkins/tools/hudson.tasks.Ant_AntInstallation/ANT_1.8.2
Setting ANT_1_8_2_HOME=/home/jenkins/tools/hudson.tasks.Ant_AntInstallation/ANT_1.8.2
Setting ANT_1_8_2_HOME=/home/jenkins/tools/hudson.tasks.Ant_AntInstallation/ANT_1.8.2

---------------------------------------------------------------------
To unsubscribe, e-mail: [hidden email]
For additional commands, e-mail: [hidden email]


--
Sincerely yours
Mikhail Khludnev