Re: [JENKINS] Lucene-Solr-8.x-MacOSX (64bit/jdk1.8.0) - Build # 1005 - Still Unstable!

classic Classic list List threaded Threaded
1 message Options
Reply | Threaded
Open this post in threaded view
|

Re: [JENKINS] Lucene-Solr-8.x-MacOSX (64bit/jdk1.8.0) - Build # 1005 - Still Unstable!

Uwe Schindler
Hi,

This still seems to be a problem, although fixed already. Maybe difference in master and branch_8x.

Uwe

Am May 16, 2020 9:04:58 PM UTC schrieb Policeman Jenkins Server <[hidden email]>:
Build: https://jenkins.thetaphi.de/job/Lucene-Solr-8.x-MacOSX/1005/
Java: 64bit/jdk1.8.0 -XX:+UseCompressedOops -XX:+UseConcMarkSweepGC

6 tests failed.
FAILED: org.apache.lucene.index.TestBackwardsCompatibility.testAllVersionsTested

Error Message:
Extra backcompat test files: 7.7.3-cfs

Stack Trace:
java.lang.AssertionError: Extra backcompat test files:
7.7.3-cfs

at __randomizedtesting.SeedInfo.seed([A3D94F2F510C4E05:B306A06FE59B5829]:0)
at org.junit.Assert.fail(Assert.java:88)
at org.apache.lucene.index.TestBackwardsCompatibility.testAllVersionsTested(TestBackwardsCompatibility.java:706)
at sun.reflect.NativeMethodAccessorImpl.invoke0(Native Method)
at sun.reflect.NativeMethodAccessorImpl.invoke(NativeMethodAccessorImpl.java:62)
at sun.reflect.DelegatingMethodAccessorImpl.invoke(DelegatingMethodAccessorImpl.java:43)
at java.lang.reflect.Method.invoke(Method.java:498)
at com.carrotsearch.randomizedtesting.RandomizedRunner.invoke(RandomizedRunner.java:1750)
at com.carrotsearch.randomizedtesting.RandomizedRunner$8.evaluate(RandomizedRunner.java:938)
at com.carrotsearch.randomizedtesting.RandomizedRunner$9.evaluate(RandomizedRunner.java:974)
at com.carrotsearch.randomizedtesting.RandomizedRunner$10.evaluate(RandomizedRunner.java:988)
at org.apache.lucene.util.TestRuleSetupTeardownChained$1.evaluate(TestRuleSetupTeardownChained.java:49)
at org.apache.lucene.util.AbstractBeforeAfterRule$1.evaluate(AbstractBeforeAfterRule.java:45)
at org.apache.lucene.util.TestRuleThreadAndTestName$1.evaluate(TestRuleThreadAndTestName.java:48)
at org.apache.lucene.util.TestRuleIgnoreAfterMaxFailures$1.evaluate(TestRuleIgnoreAfterMaxFailures.java:64)
at org.apache.lucene.util.TestRuleMarkFailure$1.evaluate(TestRuleMarkFailure.java:47)
at com.carrotsearch.randomizedtesting.rules.StatementAdapter.evaluate(StatementAdapter.java:36)
at com.carrotsearch.randomizedtesting.ThreadLeakControl$StatementRunner.run(ThreadLeakControl.java:368)
at com.carrotsearch.randomizedtesting.ThreadLeakControl.forkTimeoutingTask(ThreadLeakControl.java:817)
at com.carrotsearch.randomizedtesting.ThreadLeakControl$3.evaluate(ThreadLeakControl.java:468)
at com.carrotsearch.randomizedtesting.RandomizedRunner.runSingleTest(RandomizedRunner.java:947)
at com.carrotsearch.randomizedtesting.RandomizedRunner$5.evaluate(RandomizedRunner.java:832)
at com.carrotsearch.randomizedtesting.RandomizedRunner$6.evaluate(RandomizedRunner.java:883)
at com.carrotsearch.randomizedtesting.RandomizedRunner$7.evaluate(RandomizedRunner.java:894)
at org.apache.lucene.util.AbstractBeforeAfterRule$1.evaluate(AbstractBeforeAfterRule.java:45)
at com.carrotsearch.randomizedtesting.rules.StatementAdapter.evaluate(StatementAdapter.java:36)
at org.apache.lucene.util.TestRuleStoreClassName$1.evaluate(TestRuleStoreClassName.java:41)
at com.carrotsearch.randomizedtesting.rules.NoShadowingOrOverridesOnMethodsRule$1.evaluate(NoShadowingOrOverridesOnMethodsRule.java:40)
at com.carrotsearch.randomizedtesting.rules.NoShadowingOrOverridesOnMethodsRule$1.evaluate(NoShadowingOrOverridesOnMethodsRule.java:40)
at com.carrotsearch.randomizedtesting.rules.StatementAdapter.evaluate(StatementAdapter.java:36)
at com.carrotsearch.randomizedtesting.rules.StatementAdapter.evaluate(StatementAdapter.java:36)
at com.carrotsearch.randomizedtesting.rules.StatementAdapter.evaluate(StatementAdapter.java:36)
at org.apache.lucene.util.TestRuleAssertionsRequired$1.evaluate(TestRuleAssertionsRequired.java:53)
at org.apache.lucene.util.TestRuleMarkFailure$1.evaluate(TestRuleMarkFailure.java:47)
at org.apache.lucene.util.TestRuleIgnoreAfterMaxFailures$1.evaluate(TestRuleIgnoreAfterMaxFailures.java:64)
at org.apache.lucene.util.TestRuleIgnoreTestSuites$1.evaluate(TestRuleIgnoreTestSuites.java:54)
at com.carrotsearch.randomizedtesting.rules.StatementAdapter.evaluate(StatementAdapter.java:36)
at com.carrotsearch.randomizedtesting.ThreadLeakControl$StatementRunner.run(ThreadLeakControl.java:368)
at java.lang.Thread.run(Thread.java:748)


FAILED: org.apache.lucene.index.TestBackwardsCompatibility.testAllVersionsTested

Error Message:
Extra backcompat test files: 7.7.3-cfs

Stack Trace:
java.lang.AssertionError: Extra backcompat test files:
7.7.3-cfs

at __randomizedtesting.SeedInfo.seed([A3D94F2F510C4E05:B306A06FE59B5829]:0)
at org.junit.Assert.fail(Assert.java:88)
at org.apache.lucene.index.TestBackwardsCompatibility.testAllVersionsTested(TestBackwardsCompatibility.java:706)
at sun.reflect.NativeMethodAccessorImpl.invoke0(Native Method)
at sun.reflect.NativeMethodAccessorImpl.invoke(NativeMethodAccessorImpl.java:62)
at sun.reflect.DelegatingMethodAccessorImpl.invoke(DelegatingMethodAccessorImpl.java:43)
at java.lang.reflect.Method.invoke(Method.java:498)
at com.carrotsearch.randomizedtesting.RandomizedRunner.invoke(RandomizedRunner.java:1750)
at com.carrotsearch.randomizedtesting.RandomizedRunner$8.evaluate(RandomizedRunner.java:938)
at com.carrotsearch.randomizedtesting.RandomizedRunner$9.evaluate(RandomizedRunner.java:974)
at com.carrotsearch.randomizedtesting.RandomizedRunner$10.evaluate(RandomizedRunner.java:988)
at org.apache.lucene.util.TestRuleSetupTeardownChained$1.evaluate(TestRuleSetupTeardownChained.java:49)
at org.apache.lucene.util.AbstractBeforeAfterRule$1.evaluate(AbstractBeforeAfterRule.java:45)
at org.apache.lucene.util.TestRuleThreadAndTestName$1.evaluate(TestRuleThreadAndTestName.java:48)
at org.apache.lucene.util.TestRuleIgnoreAfterMaxFailures$1.evaluate(TestRuleIgnoreAfterMaxFailures.java:64)
at org.apache.lucene.util.TestRuleMarkFailure$1.evaluate(TestRuleMarkFailure.java:47)
at com.carrotsearch.randomizedtesting.rules.StatementAdapter.evaluate(StatementAdapter.java:36)
at com.carrotsearch.randomizedtesting.ThreadLeakControl$StatementRunner.run(ThreadLeakControl.java:368)
at com.carrotsearch.randomizedtesting.ThreadLeakControl.forkTimeoutingTask(ThreadLeakControl.java:817)
at com.carrotsearch.randomizedtesting.ThreadLeakControl$3.evaluate(ThreadLeakControl.java:468)
at com.carrotsearch.randomizedtesting.RandomizedRunner.runSingleTest(RandomizedRunner.java:947)
at com.carrotsearch.randomizedtesting.RandomizedRunner$5.evaluate(RandomizedRunner.java:832)
at com.carrotsearch.randomizedtesting.RandomizedRunner$6.evaluate(RandomizedRunner.java:883)
at com.carrotsearch.randomizedtesting.RandomizedRunner$7.evaluate(RandomizedRunner.java:894)
at org.apache.lucene.util.AbstractBeforeAfterRule$1.evaluate(AbstractBeforeAfterRule.java:45)
at com.carrotsearch.randomizedtesting.rules.StatementAdapter.evaluate(StatementAdapter.java:36)
at org.apache.lucene.util.TestRuleStoreClassName$1.evaluate(TestRuleStoreClassName.java:41)
at com.carrotsearch.randomizedtesting.rules.NoShadowingOrOverridesOnMethodsRule$1.evaluate(NoShadowingOrOverridesOnMethodsRule.java:40)
at com.carrotsearch.randomizedtesting.rules.NoShadowingOrOverridesOnMethodsRule$1.evaluate(NoShadowingOrOverridesOnMethodsRule.java:40)
at com.carrotsearch.randomizedtesting.rules.StatementAdapter.evaluate(StatementAdapter.java:36)
at com.carrotsearch.randomizedtesting.rules.StatementAdapter.evaluate(StatementAdapter.java:36)
at com.carrotsearch.randomizedtesting.rules.StatementAdapter.evaluate(StatementAdapter.java:36)
at org.apache.lucene.util.TestRuleAssertionsRequired$1.evaluate(TestRuleAssertionsRequired.java:53)
at org.apache.lucene.util.TestRuleMarkFailure$1.evaluate(TestRuleMarkFailure.java:47)
at org.apache.lucene.util.TestRuleIgnoreAfterMaxFailures$1.evaluate(TestRuleIgnoreAfterMaxFailures.java:64)
at org.apache.lucene.util.TestRuleIgnoreTestSuites$1.evaluate(TestRuleIgnoreTestSuites.java:54)
at com.carrotsearch.randomizedtesting.rules.StatementAdapter.evaluate(StatementAdapter.java:36)
at com.carrotsearch.randomizedtesting.ThreadLeakControl$StatementRunner.run(ThreadLeakControl.java:368)
at java.lang.Thread.run(Thread.java:748)


FAILED: org.apache.lucene.index.TestBackwardsCompatibility.testAllVersionsTested

Error Message:
Extra backcompat test files: 7.7.3-cfs

Stack Trace:
java.lang.AssertionError: Extra backcompat test files:
7.7.3-cfs

at __randomizedtesting.SeedInfo.seed([A3D94F2F510C4E05:B306A06FE59B5829]:0)
at org.junit.Assert.fail(Assert.java:88)
at org.apache.lucene.index.TestBackwardsCompatibility.testAllVersionsTested(TestBackwardsCompatibility.java:706)
at sun.reflect.NativeMethodAccessorImpl.invoke0(Native Method)
at sun.reflect.NativeMethodAccessorImpl.invoke(NativeMethodAccessorImpl.java:62)
at sun.reflect.DelegatingMethodAccessorImpl.invoke(DelegatingMethodAccessorImpl.java:43)
at java.lang.reflect.Method.invoke(Method.java:498)
at com.carrotsearch.randomizedtesting.RandomizedRunner.invoke(RandomizedRunner.java:1750)
at com.carrotsearch.randomizedtesting.RandomizedRunner$8.evaluate(RandomizedRunner.java:938)
at com.carrotsearch.randomizedtesting.RandomizedRunner$9.evaluate(RandomizedRunner.java:974)
at com.carrotsearch.randomizedtesting.RandomizedRunner$10.evaluate(RandomizedRunner.java:988)
at org.apache.lucene.util.TestRuleSetupTeardownChained$1.evaluate(TestRuleSetupTeardownChained.java:49)
at org.apache.lucene.util.AbstractBeforeAfterRule$1.evaluate(AbstractBeforeAfterRule.java:45)
at org.apache.lucene.util.TestRuleThreadAndTestName$1.evaluate(TestRuleThreadAndTestName.java:48)
at org.apache.lucene.util.TestRuleIgnoreAfterMaxFailures$1.evaluate(TestRuleIgnoreAfterMaxFailures.java:64)
at org.apache.lucene.util.TestRuleMarkFailure$1.evaluate(TestRuleMarkFailure.java:47)
at com.carrotsearch.randomizedtesting.rules.StatementAdapter.evaluate(StatementAdapter.java:36)
at com.carrotsearch.randomizedtesting.ThreadLeakControl$StatementRunner.run(ThreadLeakControl.java:368)
at com.carrotsearch.randomizedtesting.ThreadLeakControl.forkTimeoutingTask(ThreadLeakControl.java:817)
at com.carrotsearch.randomizedtesting.ThreadLeakControl$3.evaluate(ThreadLeakControl.java:468)
at com.carrotsearch.randomizedtesting.RandomizedRunner.runSingleTest(RandomizedRunner.java:947)
at com.carrotsearch.randomizedtesting.RandomizedRunner$5.evaluate(RandomizedRunner.java:832)
at com.carrotsearch.randomizedtesting.RandomizedRunner$6.evaluate(RandomizedRunner.java:883)
at com.carrotsearch.randomizedtesting.RandomizedRunner$7.evaluate(RandomizedRunner.java:894)
at org.apache.lucene.util.AbstractBeforeAfterRule$1.evaluate(AbstractBeforeAfterRule.java:45)
at com.carrotsearch.randomizedtesting.rules.StatementAdapter.evaluate(StatementAdapter.java:36)
at org.apache.lucene.util.TestRuleStoreClassName$1.evaluate(TestRuleStoreClassName.java:41)
at com.carrotsearch.randomizedtesting.rules.NoShadowingOrOverridesOnMethodsRule$1.evaluate(NoShadowingOrOverridesOnMethodsRule.java:40)
at com.carrotsearch.randomizedtesting.rules.NoShadowingOrOverridesOnMethodsRule$1.evaluate(NoShadowingOrOverridesOnMethodsRule.java:40)
at com.carrotsearch.randomizedtesting.rules.StatementAdapter.evaluate(StatementAdapter.java:36)
at com.carrotsearch.randomizedtesting.rules.StatementAdapter.evaluate(StatementAdapter.java:36)
at com.carrotsearch.randomizedtesting.rules.StatementAdapter.evaluate(StatementAdapter.java:36)
at org.apache.lucene.util.TestRuleAssertionsRequired$1.evaluate(TestRuleAssertionsRequired.java:53)
at org.apache.lucene.util.TestRuleMarkFailure$1.evaluate(TestRuleMarkFailure.java:47)
at org.apache.lucene.util.TestRuleIgnoreAfterMaxFailures$1.evaluate(TestRuleIgnoreAfterMaxFailures.java:64)
at org.apache.lucene.util.TestRuleIgnoreTestSuites$1.evaluate(TestRuleIgnoreTestSuites.java:54)
at com.carrotsearch.randomizedtesting.rules.StatementAdapter.evaluate(StatementAdapter.java:36)
at com.carrotsearch.randomizedtesting.ThreadLeakControl$StatementRunner.run(ThreadLeakControl.java:368)
at java.lang.Thread.run(Thread.java:748)


FAILED: org.apache.lucene.index.TestBackwardsCompatibility.testAllVersionsTested

Error Message:
Extra backcompat test files: 7.7.3-cfs

Stack Trace:
java.lang.AssertionError: Extra backcompat test files:
7.7.3-cfs

at __randomizedtesting.SeedInfo.seed([A3D94F2F510C4E05:B306A06FE59B5829]:0)
at org.junit.Assert.fail(Assert.java:88)
at org.apache.lucene.index.TestBackwardsCompatibility.testAllVersionsTested(TestBackwardsCompatibility.java:706)
at sun.reflect.NativeMethodAccessorImpl.invoke0(Native Method)
at sun.reflect.NativeMethodAccessorImpl.invoke(NativeMethodAccessorImpl.java:62)
at sun.reflect.DelegatingMethodAccessorImpl.invoke(DelegatingMethodAccessorImpl.java:43)
at java.lang.reflect.Method.invoke(Method.java:498)
at com.carrotsearch.randomizedtesting.RandomizedRunner.invoke(RandomizedRunner.java:1750)
at com.carrotsearch.randomizedtesting.RandomizedRunner$8.evaluate(RandomizedRunner.java:938)
at com.carrotsearch.randomizedtesting.RandomizedRunner$9.evaluate(RandomizedRunner.java:974)
at com.carrotsearch.randomizedtesting.RandomizedRunner$10.evaluate(RandomizedRunner.java:988)
at org.apache.lucene.util.TestRuleSetupTeardownChained$1.evaluate(TestRuleSetupTeardownChained.java:49)
at org.apache.lucene.util.AbstractBeforeAfterRule$1.evaluate(AbstractBeforeAfterRule.java:45)
at org.apache.lucene.util.TestRuleThreadAndTestName$1.evaluate(TestRuleThreadAndTestName.java:48)
at org.apache.lucene.util.TestRuleIgnoreAfterMaxFailures$1.evaluate(TestRuleIgnoreAfterMaxFailures.java:64)
at org.apache.lucene.util.TestRuleMarkFailure$1.evaluate(TestRuleMarkFailure.java:47)
at com.carrotsearch.randomizedtesting.rules.StatementAdapter.evaluate(StatementAdapter.java:36)
at com.carrotsearch.randomizedtesting.ThreadLeakControl$StatementRunner.run(ThreadLeakControl.java:368)
at com.carrotsearch.randomizedtesting.ThreadLeakControl.forkTimeoutingTask(ThreadLeakControl.java:817)
at com.carrotsearch.randomizedtesting.ThreadLeakControl$3.evaluate(ThreadLeakControl.java:468)
at com.carrotsearch.randomizedtesting.RandomizedRunner.runSingleTest(RandomizedRunner.java:947)
at com.carrotsearch.randomizedtesting.RandomizedRunner$5.evaluate(RandomizedRunner.java:832)
at com.carrotsearch.randomizedtesting.RandomizedRunner$6.evaluate(RandomizedRunner.java:883)
at com.carrotsearch.randomizedtesting.RandomizedRunner$7.evaluate(RandomizedRunner.java:894)
at org.apache.lucene.util.AbstractBeforeAfterRule$1.evaluate(AbstractBeforeAfterRule.java:45)
at com.carrotsearch.randomizedtesting.rules.StatementAdapter.evaluate(StatementAdapter.java:36)
at org.apache.lucene.util.TestRuleStoreClassName$1.evaluate(TestRuleStoreClassName.java:41)
at com.carrotsearch.randomizedtesting.rules.NoShadowingOrOverridesOnMethodsRule$1.evaluate(NoShadowingOrOverridesOnMethodsRule.java:40)
at com.carrotsearch.randomizedtesting.rules.NoShadowingOrOverridesOnMethodsRule$1.evaluate(NoShadowingOrOverridesOnMethodsRule.java:40)
at com.carrotsearch.randomizedtesting.rules.StatementAdapter.evaluate(StatementAdapter.java:36)
at com.carrotsearch.randomizedtesting.rules.StatementAdapter.evaluate(StatementAdapter.java:36)
at com.carrotsearch.randomizedtesting.rules.StatementAdapter.evaluate(StatementAdapter.java:36)
at org.apache.lucene.util.TestRuleAssertionsRequired$1.evaluate(TestRuleAssertionsRequired.java:53)
at org.apache.lucene.util.TestRuleMarkFailure$1.evaluate(TestRuleMarkFailure.java:47)
at org.apache.lucene.util.TestRuleIgnoreAfterMaxFailures$1.evaluate(TestRuleIgnoreAfterMaxFailures.java:64)
at org.apache.lucene.util.TestRuleIgnoreTestSuites$1.evaluate(TestRuleIgnoreTestSuites.java:54)
at com.carrotsearch.randomizedtesting.rules.StatementAdapter.evaluate(StatementAdapter.java:36)
at com.carrotsearch.randomizedtesting.ThreadLeakControl$StatementRunner.run(ThreadLeakControl.java:368)
at java.lang.Thread.run(Thread.java:748)


FAILED: org.apache.lucene.index.TestBackwardsCompatibility.testAllVersionsTested

Error Message:
Extra backcompat test files: 7.7.3-cfs

Stack Trace:
java.lang.AssertionError: Extra backcompat test files:
7.7.3-cfs

at __randomizedtesting.SeedInfo.seed([A3D94F2F510C4E05:B306A06FE59B5829]:0)
at org.junit.Assert.fail(Assert.java:88)
at org.apache.lucene.index.TestBackwardsCompatibility.testAllVersionsTested(TestBackwardsCompatibility.java:706)
at sun.reflect.NativeMethodAccessorImpl.invoke0(Native Method)
at sun.reflect.NativeMethodAccessorImpl.invoke(NativeMethodAccessorImpl.java:62)
at sun.reflect.DelegatingMethodAccessorImpl.invoke(DelegatingMethodAccessorImpl.java:43)
at java.lang.reflect.Method.invoke(Method.java:498)
at com.carrotsearch.randomizedtesting.RandomizedRunner.invoke(RandomizedRunner.java:1750)
at com.carrotsearch.randomizedtesting.RandomizedRunner$8.evaluate(RandomizedRunner.java:938)
at com.carrotsearch.randomizedtesting.RandomizedRunner$9.evaluate(RandomizedRunner.java:974)
at com.carrotsearch.randomizedtesting.RandomizedRunner$10.evaluate(RandomizedRunner.java:988)
at org.apache.lucene.util.TestRuleSetupTeardownChained$1.evaluate(TestRuleSetupTeardownChained.java:49)
at org.apache.lucene.util.AbstractBeforeAfterRule$1.evaluate(AbstractBeforeAfterRule.java:45)
at org.apache.lucene.util.TestRuleThreadAndTestName$1.evaluate(TestRuleThreadAndTestName.java:48)
at org.apache.lucene.util.TestRuleIgnoreAfterMaxFailures$1.evaluate(TestRuleIgnoreAfterMaxFailures.java:64)
at org.apache.lucene.util.TestRuleMarkFailure$1.evaluate(TestRuleMarkFailure.java:47)
at com.carrotsearch.randomizedtesting.rules.StatementAdapter.evaluate(StatementAdapter.java:36)
at com.carrotsearch.randomizedtesting.ThreadLeakControl$StatementRunner.run(ThreadLeakControl.java:368)
at com.carrotsearch.randomizedtesting.ThreadLeakControl.forkTimeoutingTask(ThreadLeakControl.java:817)
at com.carrotsearch.randomizedtesting.ThreadLeakControl$3.evaluate(ThreadLeakControl.java:468)
at com.carrotsearch.randomizedtesting.RandomizedRunner.runSingleTest(RandomizedRunner.java:947)
at com.carrotsearch.randomizedtesting.RandomizedRunner$5.evaluate(RandomizedRunner.java:832)
at com.carrotsearch.randomizedtesting.RandomizedRunner$6.evaluate(RandomizedRunner.java:883)
at com.carrotsearch.randomizedtesting.RandomizedRunner$7.evaluate(RandomizedRunner.java:894)
at org.apache.lucene.util.AbstractBeforeAfterRule$1.evaluate(AbstractBeforeAfterRule.java:45)
at com.carrotsearch.randomizedtesting.rules.StatementAdapter.evaluate(StatementAdapter.java:36)
at org.apache.lucene.util.TestRuleStoreClassName$1.evaluate(TestRuleStoreClassName.java:41)
at com.carrotsearch.randomizedtesting.rules.NoShadowingOrOverridesOnMethodsRule$1.evaluate(NoShadowingOrOverridesOnMethodsRule.java:40)
at com.carrotsearch.randomizedtesting.rules.NoShadowingOrOverridesOnMethodsRule$1.evaluate(NoShadowingOrOverridesOnMethodsRule.java:40)
at com.carrotsearch.randomizedtesting.rules.StatementAdapter.evaluate(StatementAdapter.java:36)
at com.carrotsearch.randomizedtesting.rules.StatementAdapter.evaluate(StatementAdapter.java:36)
at com.carrotsearch.randomizedtesting.rules.StatementAdapter.evaluate(StatementAdapter.java:36)
at org.apache.lucene.util.TestRuleAssertionsRequired$1.evaluate(TestRuleAssertionsRequired.java:53)
at org.apache.lucene.util.TestRuleMarkFailure$1.evaluate(TestRuleMarkFailure.java:47)
at org.apache.lucene.util.TestRuleIgnoreAfterMaxFailures$1.evaluate(TestRuleIgnoreAfterMaxFailures.java:64)
at org.apache.lucene.util.TestRuleIgnoreTestSuites$1.evaluate(TestRuleIgnoreTestSuites.java:54)
at com.carrotsearch.randomizedtesting.rules.StatementAdapter.evaluate(StatementAdapter.java:36)
at com.carrotsearch.randomizedtesting.ThreadLeakControl$StatementRunner.run(ThreadLeakControl.java:368)
at java.lang.Thread.run(Thread.java:748)


FAILED: org.apache.lucene.index.TestBackwardsCompatibility.testAllVersionsTested

Error Message:
Extra backcompat test files: 7.7.3-cfs

Stack Trace:
java.lang.AssertionError: Extra backcompat test files:
7.7.3-cfs

at __randomizedtesting.SeedInfo.seed([A3D94F2F510C4E05:B306A06FE59B5829]:0)
at org.junit.Assert.fail(Assert.java:88)
at org.apache.lucene.index.TestBackwardsCompatibility.testAllVersionsTested(TestBackwardsCompatibility.java:706)
at sun.reflect.NativeMethodAccessorImpl.invoke0(Native Method)
at sun.reflect.NativeMethodAccessorImpl.invoke(NativeMethodAccessorImpl.java:62)
at sun.reflect.DelegatingMethodAccessorImpl.invoke(DelegatingMethodAccessorImpl.java:43)
at java.lang.reflect.Method.invoke(Method.java:498)
at com.carrotsearch.randomizedtesting.RandomizedRunner.invoke(RandomizedRunner.java:1750)
at com.carrotsearch.randomizedtesting.RandomizedRunner$8.evaluate(RandomizedRunner.java:938)
at com.carrotsearch.randomizedtesting.RandomizedRunner$9.evaluate(RandomizedRunner.java:974)
at com.carrotsearch.randomizedtesting.RandomizedRunner$10.evaluate(RandomizedRunner.java:988)
at org.apache.lucene.util.TestRuleSetupTeardownChained$1.evaluate(TestRuleSetupTeardownChained.java:49)
at org.apache.lucene.util.AbstractBeforeAfterRule$1.evaluate(AbstractBeforeAfterRule.java:45)
at org.apache.lucene.util.TestRuleThreadAndTestName$1.evaluate(TestRuleThreadAndTestName.java:48)
at org.apache.lucene.util.TestRuleIgnoreAfterMaxFailures$1.evaluate(TestRuleIgnoreAfterMaxFailures.java:64)
at org.apache.lucene.util.TestRuleMarkFailure$1.evaluate(TestRuleMarkFailure.java:47)
at com.carrotsearch.randomizedtesting.rules.StatementAdapter.evaluate(StatementAdapter.java:36)
at com.carrotsearch.randomizedtesting.ThreadLeakControl$StatementRunner.run(ThreadLeakControl.java:368)
at com.carrotsearch.randomizedtesting.ThreadLeakControl.forkTimeoutingTask(ThreadLeakControl.java:817)
at com.carrotsearch.randomizedtesting.ThreadLeakControl$3.evaluate(ThreadLeakControl.java:468)
at com.carrotsearch.randomizedtesting.RandomizedRunner.runSingleTest(RandomizedRunner.java:947)
at com.carrotsearch.randomizedtesting.RandomizedRunner$5.evaluate(RandomizedRunner.java:832)
at com.carrotsearch.randomizedtesting.RandomizedRunner$6.evaluate(RandomizedRunner.java:883)
at com.carrotsearch.randomizedtesting.RandomizedRunner$7.evaluate(RandomizedRunner.java:894)
at org.apache.lucene.util.AbstractBeforeAfterRule$1.evaluate(AbstractBeforeAfterRule.java:45)
at com.carrotsearch.randomizedtesting.rules.StatementAdapter.evaluate(StatementAdapter.java:36)
at org.apache.lucene.util.TestRuleStoreClassName$1.evaluate(TestRuleStoreClassName.java:41)
at com.carrotsearch.randomizedtesting.rules.NoShadowingOrOverridesOnMethodsRule$1.evaluate(NoShadowingOrOverridesOnMethodsRule.java:40)
at com.carrotsearch.randomizedtesting.rules.NoShadowingOrOverridesOnMethodsRule$1.evaluate(NoShadowingOrOverridesOnMethodsRule.java:40)
at com.carrotsearch.randomizedtesting.rules.StatementAdapter.evaluate(StatementAdapter.java:36)
at com.carrotsearch.randomizedtesting.rules.StatementAdapter.evaluate(StatementAdapter.java:36)
at com.carrotsearch.randomizedtesting.rules.StatementAdapter.evaluate(StatementAdapter.java:36)
at org.apache.lucene.util.TestRuleAssertionsRequired$1.evaluate(TestRuleAssertionsRequired.java:53)
at org.apache.lucene.util.TestRuleMarkFailure$1.evaluate(TestRuleMarkFailure.java:47)
at org.apache.lucene.util.TestRuleIgnoreAfterMaxFailures$1.evaluate(TestRuleIgnoreAfterMaxFailures.java:64)
at org.apache.lucene.util.TestRuleIgnoreTestSuites$1.evaluate(TestRuleIgnoreTestSuites.java:54)
at com.carrotsearch.randomizedtesting.rules.StatementAdapter.evaluate(StatementAdapter.java:36)
at com.carrotsearch.randomizedtesting.ThreadLeakControl$StatementRunner.run(ThreadLeakControl.java:368)
at java.lang.Thread.run(Thread.java:748)




Build Log:
[...truncated 5566 lines...]
[junit4] Suite: org.apache.lucene.index.TestBackwardsCompatibility
[junit4] IGNOR/A 0.04s J2 | TestBackwardsCompatibility.testCreateIndexWithDocValuesUpdates
[junit4] > Assumption #1: backcompat creation tests must be run with -Dtests.bwcdir=/path/to/write/indexes
[junit4] IGNOR/A 0.00s J2 | TestBackwardsCompatibility.testCreateMoreTermsIndex
[junit4] > Assumption #1: backcompat creation tests must be run with -Dtests.bwcdir=/path/to/write/indexes
[junit4] IGNOR/A 0.01s J2 | TestBackwardsCompatibility.testCreateSingleSegmentCFS
[junit4] > Assumption #1: backcompat creation tests must be run with -Dtests.bwcdir=/path/to/write/indexes
[junit4] IGNOR/A 0.01s J2 | TestBackwardsCompatibility.testCreateNoCFS
[junit4] > Assumption #1: backcompat creation tests must be run with -Dtests.bwcdir=/path/to/write/indexes
[junit4] IGNOR/A 0.00s J2 | TestBackwardsCompatibility.testCreateSortedIndex
[junit4] > Assumption #1: backcompat creation tests must be run with -Dtests.bwcdir=/path/to/write/indexes
[junit4] 2> NOTE: reproduce with: ant test -Dtestcase=TestBackwardsCompatibility -Dtests.method=testAllVersionsTested -Dtests.seed=A3D94F2F510C4E05 -Dtests.slow=true -Dtests.locale=sl-SI -Dtests.timezone=Pacific/Galapagos -Dtests.asserts=true -Dtests.file.encoding=ISO-8859-1
[junit4] FAILURE 0.01s J2 | TestBackwardsCompatibility.testAllVersionsTested <<<
[junit4] > Throwable #1: java.lang.AssertionError: Extra backcompat test files:
[junit4] > 7.7.3-cfs
[junit4] > at __randomizedtesting.SeedInfo.seed([A3D94F2F510C4E05:B306A06FE59B5829]:0)
[junit4] > at org.apache.lucene.index.TestBackwardsCompatibility.testAllVersionsTested(TestBackwardsCompatibility.java:706)
[junit4] > at java.lang.Thread.run(Thread.java:748)
[junit4] IGNOR/A 0.00s J2 | TestBackwardsCompatibility.testCreateEmptyIndex
[junit4] > Assumption #1: backcompat creation tests must be run with -Dtests.bwcdir=/path/to/write/indexes
[junit4] IGNOR/A 0.00s J2 | TestBackwardsCompatibility.testCreateCFS
[junit4] > Assumption #1: backcompat creation tests must be run with -Dtests.bwcdir=/path/to/write/indexes
[junit4] IGNOR/A 0.00s J2 | TestBackwardsCompatibility.testCreateSingleSegmentNoCFS
[junit4] > Assumption #1: backcompat creation tests must be run with -Dtests.bwcdir=/path/to/write/indexes
[junit4] 2> NOTE: leaving temporary files on disk at: /Users/jenkins/workspace/Lucene-Solr-8.x-MacOSX/lucene/build/backward-codecs/test/J2/temp/lucene.index.TestBackwardsCompatibility_A3D94F2F510C4E05-001
[junit4] 2> NOTE: test params are: codec=Asserting(Lucene84): {content6=Lucene84, content5=PostingsFormat(name=LuceneVarGapFixedInterval), content4=PostingsFormat(name=LuceneVarGapDocFreqInterval), content3=TestBloomFilteredLucenePostings(BloomFilteringPostingsFormat(Lucene84)), content2=Lucene84, fie?ld=Lucene84, utf8=PostingsFormat(name=LuceneVarGapDocFreqInterval), id=Lucene84, content=PostingsFormat(name=LuceneVarGapDocFreqInterval), autf8=TestBloomFilteredLucenePostings(BloomFilteringPostingsFormat(Lucene84))}, docValues:{ndv2=DocValuesFormat(name=Direct), ndv1=DocValuesFormat(name=Lucene80), __soft_delete=DocValuesFormat(name=Asserting), dvShort=DocValuesFormat(name=Direct), dvInt=DocValuesFormat(name=Lucene80), dvBytesSortedVar=DocValuesFormat(name=Lucene80), dvSortedSet=DocValuesFormat(name=Lucene80), new_numeric=DocValuesFormat(name=Direct), bdv2=DocValuesFormat(name=Direct), bdv2_c=DocValuesFormat(name=Direct), bdv1=DocValuesFormat(name=Lucene80), bdv1_c=DocValuesFormat(name=Lucene80), dvBytesDerefVar=DocValuesFormat(name=Direct), dvSortedNumeric=DocValuesFormat(name=Direct), dvBytesDerefFixed=DocValuesFormat(name=Lucene80), new_binary=DocValuesFormat(name=Asserting), dvBytesSortedFixed=DocValuesFormat(name=Direct), dvBytesStraightVar=DocValuesFormat(name=Asserting), dvBytesStraightFixed=DocValuesFormat(name=Lucene80), dvLong=DocValuesFormat(name=Direct), dvDouble=DocValuesFormat(name=Lucene80), dvFloat=DocValuesFormat(name=Direct), dvPacked=DocValuesFormat(name=Direct), dvByte=DocValuesFormat(name=Direct), ndv1_c=DocValuesFormat(name=Lucene80), ndv2_c=DocValuesFormat(name=Direct)}, maxPointsInLeafNode=259, maxMBSortInHeap=5.265525395013552, sim=Asserting(org.apache.lucene.search.similarities.AssertingSimilarity@15db11fb), locale=sl-SI, timezone=Pacific/Galapagos
[junit4] 2> NOTE: Mac OS X 10.14.6 x86_64/Oracle Corporation 1.8.0_201 (64-bit)/cpus=6,threads=1,free=161719512,total=194641920
[junit4] 2> NOTE: All tests run in this JVM: [TestBlockPostingsFormat3, TestBackwardsCompatibility]
[junit4] Completed [9/10 (1!)] on J2 in 41.33s, 34 tests, 1 failure, 8 skipped <<< FAILURES!

[...truncated 63299 lines...]
[repro] Jenkins log URL: https://jenkins.thetaphi.de/job/Lucene-Solr-8.x-MacOSX/1005/consoleText

[repro] Revision: b7b6e4a072f3fe665dc37b0d9c6f993d1be10d11

[repro] Ant options: "-Dargs=-XX:+UseCompressedOops -XX:+UseConcMarkSweepGC"
[repro] Repro line: ant test -Dtestcase=TestBackwardsCompatibility -Dtests.method=testAllVersionsTested -Dtests.seed=A3D94F2F510C4E05 -Dtests.slow=true -Dtests.locale=sl-SI -Dtests.timezone=Pacific/Galapagos -Dtests.asserts=true -Dtests.file.encoding=ISO-8859-1

[repro] JUnit rest result XML files will be moved to: ./repro-reports
[repro] ant clean

[...truncated 6 lines...]
[repro] Test suites by module:
[repro] lucene/backward-codecs
[repro] TestBackwardsCompatibility
[repro] ant compile-test

[...truncated 209 lines...]
[repro] ant test-nocompile -Dtests.dups=5 -Dtests.maxfailures=5 -Dtests.class="*.TestBackwardsCompatibility" -Dtests.showOutput=onerror "-Dargs=-XX:+UseCompressedOops -XX:+UseConcMarkSweepGC" -Dtests.seed=A3D94F2F510C4E05 -Dtests.slow=true -Dtests.locale=sl-SI -Dtests.timezone=Pacific/Galapagos -Dtests.asserts=true -Dtests.file.encoding=ISO-8859-1

[...truncated 34 lines...]
[junit4] Suite: org.apache.lucene.index.TestBackwardsCompatibility
[junit4] OK 0.38s J4 | TestBackwardsCompatibility.testUpgradeEmptyOldIndex
[junit4] OK 3.43s J4 | TestBackwardsCompatibility.testAllIndexesUseDefaultCodec
[junit4] OK 1.52s J4 | TestBackwardsCompatibility.testOldVersions
[junit4] OK 9.34s J4 | TestBackwardsCompatibility.testUpgradeThenMultipleCommits
[junit4] IGNOR/A 0.06s J4 | TestBackwardsCompatibility.testCreateIndexWithDocValuesUpdates
[junit4] > Assumption #1: backcompat creation tests must be run with -Dtests.bwcdir=/path/to/write/indexes
[junit4] IGNOR/A 0.02s J4 | TestBackwardsCompatibility.testCreateMoreTermsIndex
[junit4] > Assumption #1: backcompat creation tests must be run with -Dtests.bwcdir=/path/to/write/indexes
[junit4] OK 0.81s J4 | TestBackwardsCompatibility.testSegmentCommitInfoId
[junit4] IGNOR/A 0.00s J4 | TestBackwardsCompatibility.testCreateSingleSegmentCFS
[junit4] > Assumption #1: backcompat creation tests must be run with -Dtests.bwcdir=/path/to/write/indexes
[junit4] IGNOR/A 0.00s J4 | TestBackwardsCompatibility.testCreateNoCFS
[junit4] > Assumption #1: backcompat creation tests must be run with -Dtests.bwcdir=/path/to/write/indexes
[junit4] OK 11.9s J4 | TestBackwardsCompatibility.testUpgradeWithNRTReader
[junit4] IGNOR/A 0.00s J4 | TestBackwardsCompatibility.testCreateSortedIndex
[junit4] > Assumption #1: backcompat creation tests must be run with -Dtests.bwcdir=/path/to/write/indexes
[junit4] OK 0.77s J4 | TestBackwardsCompatibility.testMoreTerms
[junit4] OK 0.01s J4 | TestBackwardsCompatibility.testUpgradeOldSingleSegmentIndexWithAdditions
[junit4] OK 18.0s J4 | TestBackwardsCompatibility.testIndexOldIndex
[junit4] OK 1.14s J4 | TestBackwardsCompatibility.testIndexCreatedVersion
[junit4] OK 10.7s J4 | TestBackwardsCompatibility.testIndexOldIndexNoAdds
[junit4] OK 1.12s J4 | TestBackwardsCompatibility.testDocValuesUpdatesWithNewField
[junit4] OK 6.83s J4 | TestBackwardsCompatibility.testAddOldIndexes
[junit4] OK 0.47s J4 | TestBackwardsCompatibility.testDocValuesUpdates
[junit4] OK 7.17s J4 | TestBackwardsCompatibility.testFullyMergeOldIndex
[junit4] 2> NOTE: reproduce with: ant test -Dtestcase=TestBackwardsCompatibility -Dtests.method=testAllVersionsTested -Dtests.seed=A3D94F2F510C4E05 -Dtests.slow=true -Dtests.badapples=true -Dtests.locale=sl-SI -Dtests.timezone=Pacific/Galapagos -Dtests.asserts=true -Dtests.file.encoding=ISO-8859-1
[junit4] FAILURE 0.03s J4 | TestBackwardsCompatibility.testAllVersionsTested <<<
[junit4] > Throwable #1: java.lang.AssertionError: Extra backcompat test files:
[junit4] > 7.7.3-cfs
[junit4] > at __randomizedtesting.SeedInfo.seed([A3D94F2F510C4E05:B306A06FE59B5829]:0)
[junit4] > at org.apache.lucene.index.TestBackwardsCompatibility.testAllVersionsTested(TestBackwardsCompatibility.java:706)
[junit4] > at java.lang.Thread.run(Thread.java:748)
[junit4] OK 6.10s J4 | TestBackwardsCompatibility.testSearchOldIndex
[junit4] OK 4.28s J4 | TestBackwardsCompatibility.testAddOldIndexesReader
[junit4] OK 16.2s J4 | TestBackwardsCompatibility.testCommandLineArgs
[junit4] OK 0.52s J4 | TestBackwardsCompatibility.testSoftDeletes
[junit4] OK 19.7s J4 | TestBackwardsCompatibility.testUnsupportedOldIndexes
[junit4] IGNOR/A 0.01s J4 | TestBackwardsCompatibility.testCreateEmptyIndex
[junit4] > Assumption #1: backcompat creation tests must be run with -Dtests.bwcdir=/path/to/write/indexes
[junit4] OK 17.3s J4 | TestBackwardsCompatibility.testSortedIndex
[junit4] OK 2.84s J4 | TestBackwardsCompatibility.testNextIntoWrongField
[junit4] OK 9.34s J4 | TestBackwardsCompatibility.testUpgradeOldIndex
[junit4] OK 0.45s J4 | TestBackwardsCompatibility.testSortedIndexWithInvalidSort
[junit4] IGNOR/A 0.02s J4 | TestBackwardsCompatibility.testCreateCFS
[junit4] > Assumption #1: backcompat creation tests must be run with -Dtests.bwcdir=/path/to/write/indexes
[junit4] OK 0.00s J4 | TestBackwardsCompatibility.testAllVersionHaveCfsAndNocfs
[junit4] IGNOR/A 0.01s J4 | TestBackwardsCompatibility.testCreateSingleSegmentNoCFS
[junit4] > Assumption #1: backcompat creation tests must be run with -Dtests.bwcdir=/path/to/write/indexes
[junit4] 2> NOTE: leaving temporary files on disk at: /Users/jenkins/workspace/Lucene-Solr-8.x-MacOSX/lucene/build/backward-codecs/test/J4/temp/lucene.index.TestBackwardsCompatibility_A3D94F2F510C4E05-001
[junit4] 2> NOTE: test params are: codec=Asserting(Lucene84): {content6=Lucene84, content5=PostingsFormat(name=LuceneVarGapFixedInterval), content4=PostingsFormat(name=LuceneVarGapDocFreqInterval), content3=TestBloomFilteredLucenePostings(BloomFilteringPostingsFormat(Lucene84)), content2=Lucene84, fie?ld=Lucene84, utf8=PostingsFormat(name=LuceneVarGapDocFreqInterval), id=Lucene84, content=PostingsFormat(name=LuceneVarGapDocFreqInterval), autf8=TestBloomFilteredLucenePostings(BloomFilteringPostingsFormat(Lucene84))}, docValues:{ndv2=DocValuesFormat(name=Direct), ndv1=DocValuesFormat(name=Lucene80), __soft_delete=DocValuesFormat(name=Asserting), dvShort=DocValuesFormat(name=Direct), dvInt=DocValuesFormat(name=Lucene80), dvBytesSortedVar=DocValuesFormat(name=Lucene80), dvSortedSet=DocValuesFormat(name=Lucene80), new_numeric=DocValuesFormat(name=Direct), bdv2=DocValuesFormat(name=Direct), bdv2_c=DocValuesFormat(name=Direct), bdv1=DocValuesFormat(name=Lucene80), bdv1_c=DocValuesFormat(name=Lucene80), dvBytesDerefVar=DocValuesFormat(name=Direct), dvSortedNumeric=DocValuesFormat(name=Direct), dvBytesDerefFixed=DocValuesFormat(name=Lucene80), new_binary=DocValuesFormat(name=Asserting), dvBytesSortedFixed=DocValuesFormat(name=Direct), dvBytesStraightVar=DocValuesFormat(name=Asserting), dvBytesStraightFixed=DocValuesFormat(name=Lucene80), dvLong=DocValuesFormat(name=Direct), dvDouble=DocValuesFormat(name=Lucene80), dvFloat=DocValuesFormat(name=Direct), dvPacked=DocValuesFormat(name=Direct), dvByte=DocValuesFormat(name=Direct), ndv1_c=DocValuesFormat(name=Lucene80), ndv2_c=DocValuesFormat(name=Direct)}, maxPointsInLeafNode=259, maxMBSortInHeap=5.265525395013552, sim=Asserting(org.apache.lucene.search.similarities.AssertingSimilarity@45860483), locale=sl-SI, timezone=Pacific/Galapagos
[junit4] 2> NOTE: Mac OS X 10.14.6 x86_64/Oracle Corporation 1.8.0_201 (64-bit)/cpus=6,threads=1,free=146669280,total=194641920
[junit4] 2> NOTE: All tests run in this JVM: [TestBackwardsCompatibility]
[junit4] Completed [1/5 (1!)] on J4 in 158.52s, 34 tests, 1 failure, 8 skipped <<< FAILURES!

[...truncated 1 lines...]
[junit4] Suite: org.apache.lucene.index.TestBackwardsCompatibility
[junit4] OK 0.40s J1 | TestBackwardsCompatibility.testUpgradeEmptyOldIndex
[junit4] OK 3.42s J1 | TestBackwardsCompatibility.testAllIndexesUseDefaultCodec
[junit4] OK 1.42s J1 | TestBackwardsCompatibility.testOldVersions
[junit4] OK 9.93s J1 | TestBackwardsCompatibility.testUpgradeThenMultipleCommits
[junit4] IGNOR/A 0.03s J1 | TestBackwardsCompatibility.testCreateIndexWithDocValuesUpdates
[junit4] > Assumption #1: backcompat creation tests must be run with -Dtests.bwcdir=/path/to/write/indexes
[junit4] IGNOR/A 0.02s J1 | TestBackwardsCompatibility.testCreateMoreTermsIndex
[junit4] > Assumption #1: backcompat creation tests must be run with -Dtests.bwcdir=/path/to/write/indexes
[junit4] OK 0.54s J1 | TestBackwardsCompatibility.testSegmentCommitInfoId
[junit4] IGNOR/A 0.01s J1 | TestBackwardsCompatibility.testCreateSingleSegmentCFS
[junit4] > Assumption #1: backcompat creation tests must be run with -Dtests.bwcdir=/path/to/write/indexes
[junit4] IGNOR/A 0.01s J1 | TestBackwardsCompatibility.testCreateNoCFS
[junit4] > Assumption #1: backcompat creation tests must be run with -Dtests.bwcdir=/path/to/write/indexes
[junit4] OK 12.1s J1 | TestBackwardsCompatibility.testUpgradeWithNRTReader
[junit4] IGNOR/A 0.01s J1 | TestBackwardsCompatibility.testCreateSortedIndex
[junit4] > Assumption #1: backcompat creation tests must be run with -Dtests.bwcdir=/path/to/write/indexes
[junit4] OK 0.85s J1 | TestBackwardsCompatibility.testMoreTerms
[junit4] OK 0.01s J1 | TestBackwardsCompatibility.testUpgradeOldSingleSegmentIndexWithAdditions
[junit4] OK 19.4s J1 | TestBackwardsCompatibility.testIndexOldIndex
[junit4] OK 0.67s J1 | TestBackwardsCompatibility.testIndexCreatedVersion
[junit4] OK 11.9s J1 | TestBackwardsCompatibility.testIndexOldIndexNoAdds
[junit4] OK 1.13s J1 | TestBackwardsCompatibility.testDocValuesUpdatesWithNewField
[junit4] OK 6.52s J1 | TestBackwardsCompatibility.testAddOldIndexes
[junit4] OK 0.81s J1 | TestBackwardsCompatibility.testDocValuesUpdates
[junit4] OK 6.51s J1 | TestBackwardsCompatibility.testFullyMergeOldIndex
[junit4] 2> NOTE: reproduce with: ant test -Dtestcase=TestBackwardsCompatibility -Dtests.method=testAllVersionsTested -Dtests.seed=A3D94F2F510C4E05 -Dtests.slow=true -Dtests.badapples=true -Dtests.locale=sl-SI -Dtests.timezone=Pacific/Galapagos -Dtests.asserts=true -Dtests.file.encoding=ISO-8859-1
[junit4] FAILURE 0.05s J1 | TestBackwardsCompatibility.testAllVersionsTested <<<
[junit4] > Throwable #1: java.lang.AssertionError: Extra backcompat test files:
[junit4] > 7.7.3-cfs
[junit4] > at __randomizedtesting.SeedInfo.seed([A3D94F2F510C4E05:B306A06FE59B5829]:0)
[junit4] > at org.apache.lucene.index.TestBackwardsCompatibility.testAllVersionsTested(TestBackwardsCompatibility.java:706)
[junit4] > at java.lang.Thread.run(Thread.java:748)
[junit4] OK 4.97s J1 | TestBackwardsCompatibility.testSearchOldIndex
[junit4] OK 5.90s J1 | TestBackwardsCompatibility.testAddOldIndexesReader
[junit4] OK 16.2s J1 | TestBackwardsCompatibility.testCommandLineArgs
[junit4] OK 0.41s J1 | TestBackwardsCompatibility.testSoftDeletes
[junit4] OK 22.0s J1 | TestBackwardsCompatibility.testUnsupportedOldIndexes
[junit4] IGNOR/A 0.01s J1 | TestBackwardsCompatibility.testCreateEmptyIndex
[junit4] > Assumption #1: backcompat creation tests must be run with -Dtests.bwcdir=/path/to/write/indexes
[junit4] OK 15.0s J1 | TestBackwardsCompatibility.testSortedIndex
[junit4] OK 2.15s J1 | TestBackwardsCompatibility.testNextIntoWrongField
[junit4] OK 8.36s J1 | TestBackwardsCompatibility.testUpgradeOldIndex
[junit4] OK 0.42s J1 | TestBackwardsCompatibility.testSortedIndexWithInvalidSort
[junit4] IGNOR/A 0.00s J1 | TestBackwardsCompatibility.testCreateCFS
[junit4] > Assumption #1: backcompat creation tests must be run with -Dtests.bwcdir=/path/to/write/indexes
[junit4] OK 0.02s J1 | TestBackwardsCompatibility.testAllVersionHaveCfsAndNocfs
[junit4] IGNOR/A 0.03s J1 | TestBackwardsCompatibility.testCreateSingleSegmentNoCFS
[junit4] > Assumption #1: backcompat creation tests must be run with -Dtests.bwcdir=/path/to/write/indexes
[junit4] 2> NOTE: leaving temporary files on disk at: /Users/jenkins/workspace/Lucene-Solr-8.x-MacOSX/lucene/build/backward-codecs/test/J1/temp/lucene.index.TestBackwardsCompatibility_A3D94F2F510C4E05-001
[junit4] 2> NOTE: test params are: codec=Asserting(Lucene84): {content6=Lucene84, content5=PostingsFormat(name=LuceneVarGapFixedInterval), content4=PostingsFormat(name=LuceneVarGapDocFreqInterval), content3=TestBloomFilteredLucenePostings(BloomFilteringPostingsFormat(Lucene84)), content2=Lucene84, fie?ld=Lucene84, utf8=PostingsFormat(name=LuceneVarGapDocFreqInterval), id=Lucene84, content=PostingsFormat(name=LuceneVarGapDocFreqInterval), autf8=TestBloomFilteredLucenePostings(BloomFilteringPostingsFormat(Lucene84))}, docValues:{ndv2=DocValuesFormat(name=Direct), ndv1=DocValuesFormat(name=Lucene80), __soft_delete=DocValuesFormat(name=Asserting), dvShort=DocValuesFormat(name=Direct), dvInt=DocValuesFormat(name=Lucene80), dvBytesSortedVar=DocValuesFormat(name=Lucene80), dvSortedSet=DocValuesFormat(name=Lucene80), new_numeric=DocValuesFormat(name=Direct), bdv2=DocValuesFormat(name=Direct), bdv2_c=DocValuesFormat(name=Direct), bdv1=DocValuesFormat(name=Lucene80), bdv1_c=DocValuesFormat(name=Lucene80), dvBytesDerefVar=DocValuesFormat(name=Direct), dvSortedNumeric=DocValuesFormat(name=Direct), dvBytesDerefFixed=DocValuesFormat(name=Lucene80), new_binary=DocValuesFormat(name=Asserting), dvBytesSortedFixed=DocValuesFormat(name=Direct), dvBytesStraightVar=DocValuesFormat(name=Asserting), dvBytesStraightFixed=DocValuesFormat(name=Lucene80), dvLong=DocValuesFormat(name=Direct), dvDouble=DocValuesFormat(name=Lucene80), dvFloat=DocValuesFormat(name=Direct), dvPacked=DocValuesFormat(name=Direct), dvByte=DocValuesFormat(name=Direct), ndv1_c=DocValuesFormat(name=Lucene80), ndv2_c=DocValuesFormat(name=Direct)}, maxPointsInLeafNode=259, maxMBSortInHeap=5.265525395013552, sim=Asserting(org.apache.lucene.search.similarities.AssertingSimilarity@2d40eb39), locale=sl-SI, timezone=Pacific/Galapagos
[junit4] 2> NOTE: Mac OS X 10.14.6 x86_64/Oracle Corporation 1.8.0_201 (64-bit)/cpus=6,threads=1,free=141465008,total=194641920
[junit4] 2> NOTE: All tests run in this JVM: [TestBackwardsCompatibility]
[junit4] Completed [2/5 (2!)] on J1 in 158.88s, 34 tests, 1 failure, 8 skipped <<< FAILURES!

[...truncated 1 lines...]
[junit4] Suite: org.apache.lucene.index.TestBackwardsCompatibility
[junit4] OK 0.36s J2 | TestBackwardsCompatibility.testUpgradeEmptyOldIndex
[junit4] OK 3.37s J2 | TestBackwardsCompatibility.testAllIndexesUseDefaultCodec
[junit4] OK 1.35s J2 | TestBackwardsCompatibility.testOldVersions
[junit4] OK 10.0s J2 | TestBackwardsCompatibility.testUpgradeThenMultipleCommits
[junit4] IGNOR/A 0.02s J2 | TestBackwardsCompatibility.testCreateIndexWithDocValuesUpdates
[junit4] > Assumption #1: backcompat creation tests must be run with -Dtests.bwcdir=/path/to/write/indexes
[junit4] IGNOR/A 0.02s J2 | TestBackwardsCompatibility.testCreateMoreTermsIndex
[junit4] > Assumption #1: backcompat creation tests must be run with -Dtests.bwcdir=/path/to/write/indexes
[junit4] OK 0.49s J2 | TestBackwardsCompatibility.testSegmentCommitInfoId
[junit4] IGNOR/A 0.00s J2 | TestBackwardsCompatibility.testCreateSingleSegmentCFS
[junit4] > Assumption #1: backcompat creation tests must be run with -Dtests.bwcdir=/path/to/write/indexes
[junit4] IGNOR/A 0.00s J2 | TestBackwardsCompatibility.testCreateNoCFS
[junit4] > Assumption #1: backcompat creation tests must be run with -Dtests.bwcdir=/path/to/write/indexes
[junit4] OK 12.1s J2 | TestBackwardsCompatibility.testUpgradeWithNRTReader
[junit4] IGNOR/A 0.01s J2 | TestBackwardsCompatibility.testCreateSortedIndex
[junit4] > Assumption #1: backcompat creation tests must be run with -Dtests.bwcdir=/path/to/write/indexes
[junit4] OK 0.59s J2 | TestBackwardsCompatibility.testMoreTerms
[junit4] OK 0.00s J2 | TestBackwardsCompatibility.testUpgradeOldSingleSegmentIndexWithAdditions
[junit4] OK 19.4s J2 | TestBackwardsCompatibility.testIndexOldIndex
[junit4] OK 0.74s J2 | TestBackwardsCompatibility.testIndexCreatedVersion
[junit4] OK 11.0s J2 | TestBackwardsCompatibility.testIndexOldIndexNoAdds
[junit4] OK 1.89s J2 | TestBackwardsCompatibility.testDocValuesUpdatesWithNewField
[junit4] OK 6.48s J2 | TestBackwardsCompatibility.testAddOldIndexes
[junit4] OK 1.08s J2 | TestBackwardsCompatibility.testDocValuesUpdates
[junit4] OK 6.91s J2 | TestBackwardsCompatibility.testFullyMergeOldIndex
[junit4] 2> NOTE: reproduce with: ant test -Dtestcase=TestBackwardsCompatibility -Dtests.method=testAllVersionsTested -Dtests.seed=A3D94F2F510C4E05 -Dtests.slow=true -Dtests.badapples=true -Dtests.locale=sl-SI -Dtests.timezone=Pacific/Galapagos -Dtests.asserts=true -Dtests.file.encoding=ISO-8859-1
[junit4] FAILURE 0.05s J2 | TestBackwardsCompatibility.testAllVersionsTested <<<
[junit4] > Throwable #1: java.lang.AssertionError: Extra backcompat test files:
[junit4] > 7.7.3-cfs
[junit4] > at __randomizedtesting.SeedInfo.seed([A3D94F2F510C4E05:B306A06FE59B5829]:0)
[junit4] > at org.apache.lucene.index.TestBackwardsCompatibility.testAllVersionsTested(TestBackwardsCompatibility.java:706)
[junit4] > at java.lang.Thread.run(Thread.java:748)
[junit4] OK 5.49s J2 | TestBackwardsCompatibility.testSearchOldIndex
[junit4] OK 7.26s J2 | TestBackwardsCompatibility.testAddOldIndexesReader
[junit4] OK 16.1s J2 | TestBackwardsCompatibility.testCommandLineArgs
[junit4] OK 0.91s J2 | TestBackwardsCompatibility.testSoftDeletes
[junit4] OK 20.8s J2 | TestBackwardsCompatibility.testUnsupportedOldIndexes
[junit4] IGNOR/A 0.02s J2 | TestBackwardsCompatibility.testCreateEmptyIndex
[junit4] > Assumption #1: backcompat creation tests must be run with -Dtests.bwcdir=/path/to/write/indexes
[junit4] OK 15.4s J2 | TestBackwardsCompatibility.testSortedIndex
[junit4] OK 1.76s J2 | TestBackwardsCompatibility.testNextIntoWrongField
[junit4] OK 8.44s J2 | TestBackwardsCompatibility.testUpgradeOldIndex
[junit4] OK 0.32s J2 | TestBackwardsCompatibility.testSortedIndexWithInvalidSort
[junit4] IGNOR/A 0.01s J2 | TestBackwardsCompatibility.testCreateCFS
[junit4] > Assumption #1: backcompat creation tests must be run with -Dtests.bwcdir=/path/to/write/indexes
[junit4] OK 0.01s J2 | TestBackwardsCompatibility.testAllVersionHaveCfsAndNocfs
[junit4] IGNOR/A 0.01s J2 | TestBackwardsCompatibility.testCreateSingleSegmentNoCFS
[junit4] > Assumption #1: backcompat creation tests must be run with -Dtests.bwcdir=/path/to/write/indexes
[junit4] 2> NOTE: leaving temporary files on disk at: /Users/jenkins/workspace/Lucene-Solr-8.x-MacOSX/lucene/build/backward-codecs/test/J2/temp/lucene.index.TestBackwardsCompatibility_A3D94F2F510C4E05-001
[junit4] 2> NOTE: test params are: codec=Asserting(Lucene84): {content6=Lucene84, content5=PostingsFormat(name=LuceneVarGapFixedInterval), content4=PostingsFormat(name=LuceneVarGapDocFreqInterval), content3=TestBloomFilteredLucenePostings(BloomFilteringPostingsFormat(Lucene84)), content2=Lucene84, fie?ld=Lucene84, utf8=PostingsFormat(name=LuceneVarGapDocFreqInterval), id=Lucene84, content=PostingsFormat(name=LuceneVarGapDocFreqInterval), autf8=TestBloomFilteredLucenePostings(BloomFilteringPostingsFormat(Lucene84))}, docValues:{ndv2=DocValuesFormat(name=Direct), ndv1=DocValuesFormat(name=Lucene80), __soft_delete=DocValuesFormat(name=Asserting), dvShort=DocValuesFormat(name=Direct), dvInt=DocValuesFormat(name=Lucene80), dvBytesSortedVar=DocValuesFormat(name=Lucene80), dvSortedSet=DocValuesFormat(name=Lucene80), new_numeric=DocValuesFormat(name=Direct), bdv2=DocValuesFormat(name=Direct), bdv2_c=DocValuesFormat(name=Direct), bdv1=DocValuesFormat(name=Lucene80), bdv1_c=DocValuesFormat(name=Lucene80), dvBytesDerefVar=DocValuesFormat(name=Direct), dvSortedNumeric=DocValuesFormat(name=Direct), dvBytesDerefFixed=DocValuesFormat(name=Lucene80), new_binary=DocValuesFormat(name=Asserting), dvBytesSortedFixed=DocValuesFormat(name=Direct), dvBytesStraightVar=DocValuesFormat(name=Asserting), dvBytesStraightFixed=DocValuesFormat(name=Lucene80), dvLong=DocValuesFormat(name=Direct), dvDouble=DocValuesFormat(name=Lucene80), dvFloat=DocValuesFormat(name=Direct), dvPacked=DocValuesFormat(name=Direct), dvByte=DocValuesFormat(name=Direct), ndv1_c=DocValuesFormat(name=Lucene80), ndv2_c=DocValuesFormat(name=Direct)}, maxPointsInLeafNode=259, maxMBSortInHeap=5.265525395013552, sim=Asserting(org.apache.lucene.search.similarities.AssertingSimilarity@45860483), locale=sl-SI, timezone=Pacific/Galapagos
[junit4] 2> NOTE: Mac OS X 10.14.6 x86_64/Oracle Corporation 1.8.0_201 (64-bit)/cpus=6,threads=1,free=135677104,total=194641920
[junit4] 2> NOTE: All tests run in this JVM: [TestBackwardsCompatibility]
[junit4] Completed [3/5 (3!)] on J2 in 159.56s, 34 tests, 1 failure, 8 skipped <<< FAILURES!

[...truncated 1 lines...]
[junit4] Suite: org.apache.lucene.index.TestBackwardsCompatibility
[junit4] OK 0.43s J3 | TestBackwardsCompatibility.testUpgradeEmptyOldIndex
[junit4] OK 3.48s J3 | TestBackwardsCompatibility.testAllIndexesUseDefaultCodec
[junit4] OK 1.44s J3 | TestBackwardsCompatibility.testOldVersions
[junit4] OK 9.40s J3 | TestBackwardsCompatibility.testUpgradeThenMultipleCommits
[junit4] IGNOR/A 0.04s J3 | TestBackwardsCompatibility.testCreateIndexWithDocValuesUpdates
[junit4] > Assumption #1: backcompat creation tests must be run with -Dtests.bwcdir=/path/to/write/indexes
[junit4] IGNOR/A 0.01s J3 | TestBackwardsCompatibility.testCreateMoreTermsIndex
[junit4] > Assumption #1: backcompat creation tests must be run with -Dtests.bwcdir=/path/to/write/indexes
[junit4] OK 0.84s J3 | TestBackwardsCompatibility.testSegmentCommitInfoId
[junit4] IGNOR/A 0.01s J3 | TestBackwardsCompatibility.testCreateSingleSegmentCFS
[junit4] > Assumption #1: backcompat creation tests must be run with -Dtests.bwcdir=/path/to/write/indexes
[junit4] IGNOR/A 0.01s J3 | TestBackwardsCompatibility.testCreateNoCFS
[junit4] > Assumption #1: backcompat creation tests must be run with -Dtests.bwcdir=/path/to/write/indexes
[junit4] OK 11.3s J3 | TestBackwardsCompatibility.testUpgradeWithNRTReader
[junit4] IGNOR/A 0.02s J3 | TestBackwardsCompatibility.testCreateSortedIndex
[junit4] > Assumption #1: backcompat creation tests must be run with -Dtests.bwcdir=/path/to/write/indexes
[junit4] OK 0.81s J3 | TestBackwardsCompatibility.testMoreTerms
[junit4] OK 0.01s J3 | TestBackwardsCompatibility.testUpgradeOldSingleSegmentIndexWithAdditions
[junit4] OK 19.6s J3 | TestBackwardsCompatibility.testIndexOldIndex
[junit4] OK 0.88s J3 | TestBackwardsCompatibility.testIndexCreatedVersion
[junit4] OK 10.5s J3 | TestBackwardsCompatibility.testIndexOldIndexNoAdds
[junit4] OK 1.66s J3 | TestBackwardsCompatibility.testDocValuesUpdatesWithNewField
[junit4] OK 7.67s J3 | TestBackwardsCompatibility.testAddOldIndexes
[junit4] OK 0.82s J3 | TestBackwardsCompatibility.testDocValuesUpdates
[junit4] OK 6.98s J3 | TestBackwardsCompatibility.testFullyMergeOldIndex
[junit4] 2> NOTE: reproduce with: ant test -Dtestcase=TestBackwardsCompatibility -Dtests.method=testAllVersionsTested -Dtests.seed=A3D94F2F510C4E05 -Dtests.slow=true -Dtests.badapples=true -Dtests.locale=sl-SI -Dtests.timezone=Pacific/Galapagos -Dtests.asserts=true -Dtests.file.encoding=ISO-8859-1
[junit4] FAILURE 0.03s J3 | TestBackwardsCompatibility.testAllVersionsTested <<<
[junit4] > Throwable #1: java.lang.AssertionError: Extra backcompat test files:
[junit4] > 7.7.3-cfs
[junit4] > at __randomizedtesting.SeedInfo.seed([A3D94F2F510C4E05:B306A06FE59B5829]:0)
[junit4] > at org.apache.lucene.index.TestBackwardsCompatibility.testAllVersionsTested(TestBackwardsCompatibility.java:706)
[junit4] > at java.lang.Thread.run(Thread.java:748)
[junit4] OK 5.29s J3 | TestBackwardsCompatibility.testSearchOldIndex
[junit4] OK 7.13s J3 | TestBackwardsCompatibility.testAddOldIndexesReader
[junit4] OK 15.8s J3 | TestBackwardsCompatibility.testCommandLineArgs
[junit4] OK 0.67s J3 | TestBackwardsCompatibility.testSoftDeletes
[junit4] OK 22.0s J3 | TestBackwardsCompatibility.testUnsupportedOldIndexes
[junit4] IGNOR/A 0.02s J3 | TestBackwardsCompatibility.testCreateEmptyIndex
[junit4] > Assumption #1: backcompat creation tests must be run with -Dtests.bwcdir=/path/to/write/indexes
[junit4] OK 15.4s J3 | TestBackwardsCompatibility.testSortedIndex
[junit4] OK 2.21s J3 | TestBackwardsCompatibility.testNextIntoWrongField
[junit4] OK 8.54s J3 | TestBackwardsCompatibility.testUpgradeOldIndex
[junit4] OK 0.48s J3 | TestBackwardsCompatibility.testSortedIndexWithInvalidSort
[junit4] IGNOR/A 0.00s J3 | TestBackwardsCompatibility.testCreateCFS
[junit4] > Assumption #1: backcompat creation tests must be run with -Dtests.bwcdir=/path/to/write/indexes
[junit4] OK 0.00s J3 | TestBackwardsCompatibility.testAllVersionHaveCfsAndNocfs
[junit4] IGNOR/A 0.00s J3 | TestBackwardsCompatibility.testCreateSingleSegmentNoCFS
[junit4] > Assumption #1: backcompat creation tests must be run with -Dtests.bwcdir=/path/to/write/indexes
[junit4] 2> NOTE: leaving temporary files on disk at: /Users/jenkins/workspace/Lucene-Solr-8.x-MacOSX/lucene/build/backward-codecs/test/J3/temp/lucene.index.TestBackwardsCompatibility_A3D94F2F510C4E05-001
[junit4] 2> NOTE: test params are: codec=Asserting(Lucene84): {content6=Lucene84, content5=PostingsFormat(name=LuceneVarGapFixedInterval), content4=PostingsFormat(name=LuceneVarGapDocFreqInterval), content3=TestBloomFilteredLucenePostings(BloomFilteringPostingsFormat(Lucene84)), content2=Lucene84, fie?ld=Lucene84, utf8=PostingsFormat(name=LuceneVarGapDocFreqInterval), id=Lucene84, content=PostingsFormat(name=LuceneVarGapDocFreqInterval), autf8=TestBloomFilteredLucenePostings(BloomFilteringPostingsFormat(Lucene84))}, docValues:{ndv2=DocValuesFormat(name=Direct), ndv1=DocValuesFormat(name=Lucene80), __soft_delete=DocValuesFormat(name=Asserting), dvShort=DocValuesFormat(name=Direct), dvInt=DocValuesFormat(name=Lucene80), dvBytesSortedVar=DocValuesFormat(name=Lucene80), dvSortedSet=DocValuesFormat(name=Lucene80), new_numeric=DocValuesFormat(name=Direct), bdv2=DocValuesFormat(name=Direct), bdv2_c=DocValuesFormat(name=Direct), bdv1=DocValuesFormat(name=Lucene80), bdv1_c=DocValuesFormat(name=Lucene80), dvBytesDerefVar=DocValuesFormat(name=Direct), dvSortedNumeric=DocValuesFormat(name=Direct), dvBytesDerefFixed=DocValuesFormat(name=Lucene80), new_binary=DocValuesFormat(name=Asserting), dvBytesSortedFixed=DocValuesFormat(name=Direct), dvBytesStraightVar=DocValuesFormat(name=Asserting), dvBytesStraightFixed=DocValuesFormat(name=Lucene80), dvLong=DocValuesFormat(name=Direct), dvDouble=DocValuesFormat(name=Lucene80), dvFloat=DocValuesFormat(name=Direct), dvPacked=DocValuesFormat(name=Direct), dvByte=DocValuesFormat(name=Direct), ndv1_c=DocValuesFormat(name=Lucene80), ndv2_c=DocValuesFormat(name=Direct)}, maxPointsInLeafNode=259, maxMBSortInHeap=5.265525395013552, sim=Asserting(org.apache.lucene.search.similarities.AssertingSimilarity@45860483), locale=sl-SI, timezone=Pacific/Galapagos
[junit4] 2> NOTE: Mac OS X 10.14.6 x86_64/Oracle Corporation 1.8.0_201 (64-bit)/cpus=6,threads=1,free=149913096,total=194641920
[junit4] 2> NOTE: All tests run in this JVM: [TestBackwardsCompatibility]
[junit4] Completed [4/5 (4!)] on J3 in 160.08s, 34 tests, 1 failure, 8 skipped <<< FAILURES!

[...truncated 1 lines...]
[junit4] Suite: org.apache.lucene.index.TestBackwardsCompatibility
[junit4] OK 0.50s J0 | TestBackwardsCompatibility.testUpgradeEmptyOldIndex
[junit4] OK 3.22s J0 | TestBackwardsCompatibility.testAllIndexesUseDefaultCodec
[junit4] OK 1.53s J0 | TestBackwardsCompatibility.testOldVersions
[junit4] OK 9.55s J0 | TestBackwardsCompatibility.testUpgradeThenMultipleCommits
[junit4] IGNOR/A 0.02s J0 | TestBackwardsCompatibility.testCreateIndexWithDocValuesUpdates
[junit4] > Assumption #1: backcompat creation tests must be run with -Dtests.bwcdir=/path/to/write/indexes
[junit4] IGNOR/A 0.00s J0 | TestBackwardsCompatibility.testCreateMoreTermsIndex
[junit4] > Assumption #1: backcompat creation tests must be run with -Dtests.bwcdir=/path/to/write/indexes
[junit4] OK 0.69s J0 | TestBackwardsCompatibility.testSegmentCommitInfoId
[junit4] IGNOR/A 0.00s J0 | TestBackwardsCompatibility.testCreateSingleSegmentCFS
[junit4] > Assumption #1: backcompat creation tests must be run with -Dtests.bwcdir=/path/to/write/indexes
[junit4] IGNOR/A 0.02s J0 | TestBackwardsCompatibility.testCreateNoCFS
[junit4] > Assumption #1: backcompat creation tests must be run with -Dtests.bwcdir=/path/to/write/indexes
[junit4] OK 12.5s J0 | TestBackwardsCompatibility.testUpgradeWithNRTReader
[junit4] IGNOR/A 0.00s J0 | TestBackwardsCompatibility.testCreateSortedIndex
[junit4] > Assumption #1: backcompat creation tests must be run with -Dtests.bwcdir=/path/to/write/indexes
[junit4] OK 0.85s J0 | TestBackwardsCompatibility.testMoreTerms
[junit4] OK 0.04s J0 | TestBackwardsCompatibility.testUpgradeOldSingleSegmentIndexWithAdditions
[junit4] OK 19.5s J0 | TestBackwardsCompatibility.testIndexOldIndex
[junit4] OK 0.54s J0 | TestBackwardsCompatibility.testIndexCreatedVersion
[junit4] OK 10.9s J0 | TestBackwardsCompatibility.testIndexOldIndexNoAdds
[junit4] OK 1.51s J0 | TestBackwardsCompatibility.testDocValuesUpdatesWithNewField
[junit4] OK 5.92s J0 | TestBackwardsCompatibility.testAddOldIndexes
[junit4] OK 1.34s J0 | TestBackwardsCompatibility.testDocValuesUpdates
[junit4] OK 7.58s J0 | TestBackwardsCompatibility.testFullyMergeOldIndex
[junit4] 2> NOTE: reproduce with: ant test -Dtestcase=TestBackwardsCompatibility -Dtests.method=testAllVersionsTested -Dtests.seed=A3D94F2F510C4E05 -Dtests.slow=true -Dtests.badapples=true -Dtests.locale=sl-SI -Dtests.timezone=Pacific/Galapagos -Dtests.asserts=true -Dtests.file.encoding=ISO-8859-1
[junit4] FAILURE 0.03s J0 | TestBackwardsCompatibility.testAllVersionsTested <<<
[junit4] > Throwable #1: java.lang.AssertionError: Extra backcompat test files:
[junit4] > 7.7.3-cfs
[junit4] > at __randomizedtesting.SeedInfo.seed([A3D94F2F510C4E05:B306A06FE59B5829]:0)
[junit4] > at org.apache.lucene.index.TestBackwardsCompatibility.testAllVersionsTested(TestBackwardsCompatibility.java:706)
[junit4] > at java.lang.Thread.run(Thread.java:748)
[junit4] OK 4.87s J0 | TestBackwardsCompatibility.testSearchOldIndex
[junit4] OK 6.73s J0 | TestBackwardsCompatibility.testAddOldIndexesReader
[junit4] OK 16.0s J0 | TestBackwardsCompatibility.testCommandLineArgs
[junit4] OK 0.43s J0 | TestBackwardsCompatibility.testSoftDeletes
[junit4] OK 22.0s J0 | TestBackwardsCompatibility.testUnsupportedOldIndexes
[junit4] IGNOR/A 0.01s J0 | TestBackwardsCompatibility.testCreateEmptyIndex
[junit4] > Assumption #1: backcompat creation tests must be run with -Dtests.bwcdir=/path/to/write/indexes
[junit4] OK 17.1s J0 | TestBackwardsCompatibility.testSortedIndex
[junit4] OK 2.24s J0 | TestBackwardsCompatibility.testNextIntoWrongField
[junit4] OK 8.59s J0 | TestBackwardsCompatibility.testUpgradeOldIndex
[junit4] OK 0.24s J0 | TestBackwardsCompatibility.testSortedIndexWithInvalidSort
[junit4] IGNOR/A 0.01s J0 | TestBackwardsCompatibility.testCreateCFS
[junit4] > Assumption #1: backcompat creation tests must be run with -Dtests.bwcdir=/path/to/write/indexes
[junit4] OK 0.02s J0 | TestBackwardsCompatibility.testAllVersionHaveCfsAndNocfs
[junit4] IGNOR/A 0.02s J0 | TestBackwardsCompatibility.testCreateSingleSegmentNoCFS
[junit4] > Assumption #1: backcompat creation tests must be run with -Dtests.bwcdir=/path/to/write/indexes
[junit4] 2> NOTE: leaving temporary files on disk at: /Users/jenkins/workspace/Lucene-Solr-8.x-MacOSX/lucene/build/backward-codecs/test/J0/temp/lucene.index.TestBackwardsCompatibility_A3D94F2F510C4E05-001
[junit4] 2> NOTE: test params are: codec=Asserting(Lucene84): {content6=Lucene84, content5=PostingsFormat(name=LuceneVarGapFixedInterval), content4=PostingsFormat(name=LuceneVarGapDocFreqInterval), content3=TestBloomFilteredLucenePostings(BloomFilteringPostingsFormat(Lucene84)), content2=Lucene84, fie?ld=Lucene84, utf8=PostingsFormat(name=LuceneVarGapDocFreqInterval), id=Lucene84, content=PostingsFormat(name=LuceneVarGapDocFreqInterval), autf8=TestBloomFilteredLucenePostings(BloomFilteringPostingsFormat(Lucene84))}, docValues:{ndv2=DocValuesFormat(name=Direct), ndv1=DocValuesFormat(name=Lucene80), __soft_delete=DocValuesFormat(name=Asserting), dvShort=DocValuesFormat(name=Direct), dvInt=DocValuesFormat(name=Lucene80), dvBytesSortedVar=DocValuesFormat(name=Lucene80), dvSortedSet=DocValuesFormat(name=Lucene80), new_numeric=DocValuesFormat(name=Direct), bdv2=DocValuesFormat(name=Direct), bdv2_c=DocValuesFormat(name=Direct), bdv1=DocValuesFormat(name=Lucene80), bdv1_c=DocValuesFormat(name=Lucene80), dvBytesDerefVar=DocValuesFormat(name=Direct), dvSortedNumeric=DocValuesFormat(name=Direct), dvBytesDerefFixed=DocValuesFormat(name=Lucene80), new_binary=DocValuesFormat(name=Asserting), dvBytesSortedFixed=DocValuesFormat(name=Direct), dvBytesStraightVar=DocValuesFormat(name=Asserting), dvBytesStraightFixed=DocValuesFormat(name=Lucene80), dvLong=DocValuesFormat(name=Direct), dvDouble=DocValuesFormat(name=Lucene80), dvFloat=DocValuesFormat(name=Direct), dvPacked=DocValuesFormat(name=Direct), dvByte=DocValuesFormat(name=Direct), ndv1_c=DocValuesFormat(name=Lucene80), ndv2_c=DocValuesFormat(name=Direct)}, maxPointsInLeafNode=259, maxMBSortInHeap=5.265525395013552, sim=Asserting(org.apache.lucene.search.similarities.AssertingSimilarity@7902c0c5), locale=sl-SI, timezone=Pacific/Galapagos
[junit4] 2> NOTE: Mac OS X 10.14.6 x86_64/Oracle Corporation 1.8.0_201 (64-bit)/cpus=6,threads=1,free=151843032,total=194641920
[junit4] 2> NOTE: All tests run in this JVM: [TestBackwardsCompatibility]
[junit4] Completed [5/5 (5!)] on J0 in 160.68s, 34 tests, 1 failure, 8 skipped <<< FAILURES!

[...truncated 17 lines...]
BUILD FAILED
/Users/jenkins/workspace/Lucene-Solr-8.x-MacOSX/lucene/common-build.xml:1599: The following error occurred while executing this line:
/Users/jenkins/workspace/Lucene-Solr-8.x-MacOSX/lucene/common-build.xml:1126: There were test failures: 5 suites, 170 tests, 5 failures, 40 ignored (40 assumptions) [seed: A3D94F2F510C4E05]

Total time: 2 minutes 43 seconds

[repro] Setting last failure code to 256

[repro] Failures w/original seeds:
[repro] 5/5 failed: org.apache.lucene.index.TestBackwardsCompatibility
[repro] Exiting with code 256
+ mv lucene/build lucene/build.repro
+ mv solr/build solr/build.repro
mv: rename solr/build to solr/build.repro: No such file or directory
+ true
+ mv lucene/build.orig lucene/build
+ mv solr/build.orig solr/build
Archiving artifacts
Setting ANT_1_8_2_HOME=/Users/jenkins/tools/hudson.tasks.Ant_AntInstallation/ANT_1.8.2
[WARNINGS] Parsing warnings in console log with parser Java Compiler (javac)
Setting ANT_1_8_2_HOME=/Users/jenkins/tools/hudson.tasks.Ant_AntInstallation/ANT_1.8.2
No credentials specified
Setting ANT_1_8_2_HOME=/Users/jenkins/tools/hudson.tasks.Ant_AntInstallation/ANT_1.8.2
<Git Blamer> Using GitBlamer to create author and commit information for all warnings.
<Git Blamer> GIT_COMMIT=b7b6e4a072f3fe665dc37b0d9c6f993d1be10d11, workspace=/Users/jenkins/workspace/Lucene-Solr-8.x-MacOSX
[WARNINGS] Computing warning deltas based on reference build #1004
Recording test results
Setting ANT_1_8_2_HOME=/Users/jenkins/tools/hudson.tasks.Ant_AntInstallation/ANT_1.8.2
Build step 'Publish JUnit test result report' changed build result to UNSTABLE
Email was triggered for: Unstable (Test Failures)
Sending email for trigger: Unstable (Test Failures)
Setting ANT_1_8_2_HOME=/Users/jenkins/tools/hudson.tasks.Ant_AntInstallation/ANT_1.8.2
Setting ANT_1_8_2_HOME=/Users/jenkins/tools/hudson.tasks.Ant_AntInstallation/ANT_1.8.2
Setting ANT_1_8_2_HOME=/Users/jenkins/tools/hudson.tasks.Ant_AntInstallation/ANT_1.8.2
Setting ANT_1_8_2_HOME=/Users/jenkins/tools/hudson.tasks.Ant_AntInstallation/ANT_1.8.2
Setting ANT_1_8_2_HOME=/Users/jenkins/tools/hudson.tasks.Ant_AntInstallation/ANT_1.8.2
Setting ANT_1_8_2_HOME=/Users/jenkins/tools/hudson.tasks.Ant_AntInstallation/ANT_1.8.2

--
Uwe Schindler
Achterdiek 19, 28357 Bremen
https://www.thetaphi.de