Re: [JENKINS] Lucene-Solr-BadApples-Tests-8.x - Build # 261 - Still Unstable

classic Classic list List threaded Threaded
1 message Options
Reply | Threaded
Open this post in threaded view
|

Re: [JENKINS] Lucene-Solr-BadApples-Tests-8.x - Build # 261 - Still Unstable

Tomás Fernández Löbbe
I pushed a fix for this

On Fri, Nov 1, 2019 at 5:17 PM Apache Jenkins Server <[hidden email]> wrote:
Build: https://builds.apache.org/job/Lucene-Solr-BadApples-Tests-8.x/261/

1 tests failed.
FAILED:  org.apache.solr.util.SolrPluginUtilsTest.testMinShouldMatchBadQueries

Error Message:
Expected exception SolrException but no exception was thrown

Stack Trace:
junit.framework.AssertionFailedError: Expected exception SolrException but no exception was thrown
        at __randomizedtesting.SeedInfo.seed([8204B44D4CD7DDA3:4CD874E732EF52AD]:0)
        at org.apache.lucene.util.LuceneTestCase.expectThrows(LuceneTestCase.java:2722)
        at org.apache.lucene.util.LuceneTestCase.expectThrows(LuceneTestCase.java:2712)
        at org.apache.solr.util.SolrPluginUtilsTest.testMinShouldMatchBadQueries(SolrPluginUtilsTest.java:344)
        at sun.reflect.NativeMethodAccessorImpl.invoke0(Native Method)
        at sun.reflect.NativeMethodAccessorImpl.invoke(NativeMethodAccessorImpl.java:62)
        at sun.reflect.DelegatingMethodAccessorImpl.invoke(DelegatingMethodAccessorImpl.java:43)
        at java.lang.reflect.Method.invoke(Method.java:498)
        at com.carrotsearch.randomizedtesting.RandomizedRunner.invoke(RandomizedRunner.java:1750)
        at com.carrotsearch.randomizedtesting.RandomizedRunner$8.evaluate(RandomizedRunner.java:938)
        at com.carrotsearch.randomizedtesting.RandomizedRunner$9.evaluate(RandomizedRunner.java:974)
        at com.carrotsearch.randomizedtesting.RandomizedRunner$10.evaluate(RandomizedRunner.java:988)
        at com.carrotsearch.randomizedtesting.rules.SystemPropertiesRestoreRule$1.evaluate(SystemPropertiesRestoreRule.java:57)
        at org.apache.lucene.util.TestRuleSetupTeardownChained$1.evaluate(TestRuleSetupTeardownChained.java:49)
        at org.apache.lucene.util.AbstractBeforeAfterRule$1.evaluate(AbstractBeforeAfterRule.java:45)
        at org.apache.lucene.util.TestRuleThreadAndTestName$1.evaluate(TestRuleThreadAndTestName.java:48)
        at org.apache.lucene.util.TestRuleIgnoreAfterMaxFailures$1.evaluate(TestRuleIgnoreAfterMaxFailures.java:64)
        at org.apache.lucene.util.TestRuleMarkFailure$1.evaluate(TestRuleMarkFailure.java:47)
        at com.carrotsearch.randomizedtesting.rules.StatementAdapter.evaluate(StatementAdapter.java:36)
        at com.carrotsearch.randomizedtesting.ThreadLeakControl$StatementRunner.run(ThreadLeakControl.java:368)
        at com.carrotsearch.randomizedtesting.ThreadLeakControl.forkTimeoutingTask(ThreadLeakControl.java:817)
        at com.carrotsearch.randomizedtesting.ThreadLeakControl$3.evaluate(ThreadLeakControl.java:468)
        at com.carrotsearch.randomizedtesting.RandomizedRunner.runSingleTest(RandomizedRunner.java:947)
        at com.carrotsearch.randomizedtesting.RandomizedRunner$5.evaluate(RandomizedRunner.java:832)
        at com.carrotsearch.randomizedtesting.RandomizedRunner$6.evaluate(RandomizedRunner.java:883)
        at com.carrotsearch.randomizedtesting.RandomizedRunner$7.evaluate(RandomizedRunner.java:894)
        at com.carrotsearch.randomizedtesting.rules.StatementAdapter.evaluate(StatementAdapter.java:36)
        at com.carrotsearch.randomizedtesting.rules.SystemPropertiesRestoreRule$1.evaluate(SystemPropertiesRestoreRule.java:57)
        at org.apache.lucene.util.AbstractBeforeAfterRule$1.evaluate(AbstractBeforeAfterRule.java:45)
        at com.carrotsearch.randomizedtesting.rules.StatementAdapter.evaluate(StatementAdapter.java:36)
        at org.apache.lucene.util.TestRuleStoreClassName$1.evaluate(TestRuleStoreClassName.java:41)
        at com.carrotsearch.randomizedtesting.rules.NoShadowingOrOverridesOnMethodsRule$1.evaluate(NoShadowingOrOverridesOnMethodsRule.java:40)
        at com.carrotsearch.randomizedtesting.rules.NoShadowingOrOverridesOnMethodsRule$1.evaluate(NoShadowingOrOverridesOnMethodsRule.java:40)
        at com.carrotsearch.randomizedtesting.rules.StatementAdapter.evaluate(StatementAdapter.java:36)
        at com.carrotsearch.randomizedtesting.rules.StatementAdapter.evaluate(StatementAdapter.java:36)
        at com.carrotsearch.randomizedtesting.rules.StatementAdapter.evaluate(StatementAdapter.java:36)
        at org.apache.lucene.util.TestRuleAssertionsRequired$1.evaluate(TestRuleAssertionsRequired.java:53)
        at org.apache.lucene.util.TestRuleMarkFailure$1.evaluate(TestRuleMarkFailure.java:47)
        at org.apache.lucene.util.TestRuleIgnoreAfterMaxFailures$1.evaluate(TestRuleIgnoreAfterMaxFailures.java:64)
        at org.apache.lucene.util.TestRuleIgnoreTestSuites$1.evaluate(TestRuleIgnoreTestSuites.java:54)
        at com.carrotsearch.randomizedtesting.rules.StatementAdapter.evaluate(StatementAdapter.java:36)
        at com.carrotsearch.randomizedtesting.ThreadLeakControl$StatementRunner.run(ThreadLeakControl.java:368)
        at java.lang.Thread.run(Thread.java:748)




Build Log:
[...truncated 16257 lines...]
   [junit4] Suite: org.apache.solr.util.SolrPluginUtilsTest
   [junit4]   2> 4794426 INFO  (SUITE-SolrPluginUtilsTest-seed#[8204B44D4CD7DDA3]-worker) [     ] o.a.s.c.SolrResourceLoader [null] Added 2 libs to classloader, from paths: [/home/jenkins/jenkins-slave/workspace/Lucene-Solr-BadApples-Tests-8.x/solr/core/src/test-files/solr/collection1/lib, /home/jenkins/jenkins-slave/workspace/Lucene-Solr-BadApples-Tests-8.x/solr/core/src/test-files/solr/collection1/lib/classes]
   [junit4]   2> 4794569 INFO  (SUITE-SolrPluginUtilsTest-seed#[8204B44D4CD7DDA3]-worker) [     ] o.a.s.c.SolrConfig Using Lucene MatchVersion: 8.4.0
   [junit4]   2> 4794717 INFO  (SUITE-SolrPluginUtilsTest-seed#[8204B44D4CD7DDA3]-worker) [     ] o.a.s.s.IndexSchema [null] Schema name=test
   [junit4]   2> 4795397 INFO  (SUITE-SolrPluginUtilsTest-seed#[8204B44D4CD7DDA3]-worker) [     ] o.a.s.s.IndexSchema Loaded schema test/1.0 with uniqueid field id
   [junit4]   2> 4795808 WARN  (SUITE-SolrPluginUtilsTest-seed#[8204B44D4CD7DDA3]-worker) [     ] o.a.s.f.DistribPackageStore Unable to create [/home/jenkins/jenkins-slave/workspace/Lucene-Solr-BadApples-Tests-8.x/solr/core/src/test-files/solr/filestore] directory in SOLR_HOME [/home/jenkins/jenkins-slave/workspace/Lucene-Solr-BadApples-Tests-8.x/solr/core/src/test-files/solr].  Features requiring this directory may fail.
   [junit4]   2>           => java.security.AccessControlException: access denied ("java.io.FilePermission" "/home/jenkins/jenkins-slave/workspace/Lucene-Solr-BadApples-Tests-8.x/solr/core/src/test-files/solr/filestore" "write")
   [junit4]   2>        at java.security.AccessControlContext.checkPermission(AccessControlContext.java:472)
   [junit4]   2> java.security.AccessControlException: access denied ("java.io.FilePermission" "/home/jenkins/jenkins-slave/workspace/Lucene-Solr-BadApples-Tests-8.x/solr/core/src/test-files/solr/filestore" "write")
   [junit4]   2>        at java.security.AccessControlContext.checkPermission(AccessControlContext.java:472) ~[?:1.8.0_191]
   [junit4]   2>        at java.security.AccessController.checkPermission(AccessController.java:884) ~[?:1.8.0_191]
   [junit4]   2>        at java.lang.SecurityManager.checkPermission(SecurityManager.java:549) ~[?:1.8.0_191]
   [junit4]   2>        at java.lang.SecurityManager.checkWrite(SecurityManager.java:979) ~[?:1.8.0_191]
   [junit4]   2>        at java.io.File.mkdir(File.java:1311) ~[?:1.8.0_191]
   [junit4]   2>        at java.io.File.mkdirs(File.java:1343) ~[?:1.8.0_191]
   [junit4]   2>        at org.apache.solr.filestore.DistribPackageStore.ensurePackageStoreDir(DistribPackageStore.java:482) ~[java/:?]
   [junit4]   2>        at org.apache.solr.filestore.DistribPackageStore.<init>(DistribPackageStore.java:67) ~[java/:?]
   [junit4]   2>        at org.apache.solr.filestore.PackageStoreAPI.<init>(PackageStoreAPI.java:71) ~[java/:?]
   [junit4]   2>        at org.apache.solr.core.CoreContainer.load(CoreContainer.java:610) ~[java/:?]
   [junit4]   2>        at org.apache.solr.util.TestHarness.<init>(TestHarness.java:180) ~[java/:?]
   [junit4]   2>        at org.apache.solr.util.TestHarness.<init>(TestHarness.java:143) ~[java/:?]
   [junit4]   2>        at org.apache.solr.util.TestHarness.<init>(TestHarness.java:149) ~[java/:?]
   [junit4]   2>        at org.apache.solr.util.TestHarness.<init>(TestHarness.java:112) ~[java/:?]
   [junit4]   2>        at org.apache.solr.SolrTestCaseJ4.createCore(SolrTestCaseJ4.java:797) ~[java/:?]
   [junit4]   2>        at org.apache.solr.SolrTestCaseJ4.initCore(SolrTestCaseJ4.java:787) ~[java/:?]
   [junit4]   2>        at org.apache.solr.SolrTestCaseJ4.initCore(SolrTestCaseJ4.java:648) ~[java/:?]
   [junit4]   2>        at org.apache.solr.SolrTestCaseJ4.initCore(SolrTestCaseJ4.java:637) ~[java/:?]
   [junit4]   2>        at org.apache.solr.util.SolrPluginUtilsTest.beforeClass(SolrPluginUtilsTest.java:50) ~[test/:?]
   [junit4]   2>        at sun.reflect.NativeMethodAccessorImpl.invoke0(Native Method) ~[?:1.8.0_191]
   [junit4]   2>        at sun.reflect.NativeMethodAccessorImpl.invoke(NativeMethodAccessorImpl.java:62) ~[?:1.8.0_191]
   [junit4]   2>        at sun.reflect.DelegatingMethodAccessorImpl.invoke(DelegatingMethodAccessorImpl.java:43) ~[?:1.8.0_191]
   [junit4]   2>        at java.lang.reflect.Method.invoke(Method.java:498) ~[?:1.8.0_191]
   [junit4]   2>        at com.carrotsearch.randomizedtesting.RandomizedRunner.invoke(RandomizedRunner.java:1750) ~[randomizedtesting-runner-2.7.2.jar:?]
   [junit4]   2>        at com.carrotsearch.randomizedtesting.RandomizedRunner$6.evaluate(RandomizedRunner.java:878) ~[randomizedtesting-runner-2.7.2.jar:?]
   [junit4]   2>        at com.carrotsearch.randomizedtesting.RandomizedRunner$7.evaluate(RandomizedRunner.java:894) ~[randomizedtesting-runner-2.7.2.jar:?]
   [junit4]   2>        at com.carrotsearch.randomizedtesting.rules.StatementAdapter.evaluate(StatementAdapter.java:36) ~[randomizedtesting-runner-2.7.2.jar:?]
   [junit4]   2>        at com.carrotsearch.randomizedtesting.rules.SystemPropertiesRestoreRule$1.evaluate(SystemPropertiesRestoreRule.java:57) ~[randomizedtesting-runner-2.7.2.jar:?]
   [junit4]   2>        at org.apache.lucene.util.AbstractBeforeAfterRule$1.evaluate(AbstractBeforeAfterRule.java:45) ~[java/:?]
   [junit4]   2>        at com.carrotsearch.randomizedtesting.rules.StatementAdapter.evaluate(StatementAdapter.java:36) ~[randomizedtesting-runner-2.7.2.jar:?]
   [junit4]   2>        at org.apache.lucene.util.TestRuleStoreClassName$1.evaluate(TestRuleStoreClassName.java:41) ~[java/:?]
   [junit4]   2>        at com.carrotsearch.randomizedtesting.rules.NoShadowingOrOverridesOnMethodsRule$1.evaluate(NoShadowingOrOverridesOnMethodsRule.java:40) ~[randomizedtesting-runner-2.7.2.jar:?]
   [junit4]   2>        at com.carrotsearch.randomizedtesting.rules.NoShadowingOrOverridesOnMethodsRule$1.evaluate(NoShadowingOrOverridesOnMethodsRule.java:40) ~[randomizedtesting-runner-2.7.2.jar:?]
   [junit4]   2>        at com.carrotsearch.randomizedtesting.rules.StatementAdapter.evaluate(StatementAdapter.java:36) ~[randomizedtesting-runner-2.7.2.jar:?]
   [junit4]   2>        at com.carrotsearch.randomizedtesting.rules.StatementAdapter.evaluate(StatementAdapter.java:36) ~[randomizedtesting-runner-2.7.2.jar:?]
   [junit4]   2>        at com.carrotsearch.randomizedtesting.rules.StatementAdapter.evaluate(StatementAdapter.java:36) ~[randomizedtesting-runner-2.7.2.jar:?]
   [junit4]   2>        at org.apache.lucene.util.TestRuleAssertionsRequired$1.evaluate(TestRuleAssertionsRequired.java:53) ~[java/:?]
   [junit4]   2>        at org.apache.lucene.util.TestRuleMarkFailure$1.evaluate(TestRuleMarkFailure.java:47) ~[java/:?]
   [junit4]   2>        at org.apache.lucene.util.TestRuleIgnoreAfterMaxFailures$1.evaluate(TestRuleIgnoreAfterMaxFailures.java:64) ~[java/:?]
   [junit4]   2>        at org.apache.lucene.util.TestRuleIgnoreTestSuites$1.evaluate(TestRuleIgnoreTestSuites.java:54) ~[java/:?]
   [junit4]   2>        at com.carrotsearch.randomizedtesting.rules.StatementAdapter.evaluate(StatementAdapter.java:36) ~[randomizedtesting-runner-2.7.2.jar:?]
   [junit4]   2>        at com.carrotsearch.randomizedtesting.ThreadLeakControl$StatementRunner.run(ThreadLeakControl.java:368) ~[randomizedtesting-runner-2.7.2.jar:?]
   [junit4]   2>        at java.lang.Thread.run(Thread.java:748) [?:1.8.0_191]
   [junit4]   2> 4795808 INFO  (SUITE-SolrPluginUtilsTest-seed#[8204B44D4CD7DDA3]-worker) [     ] o.a.s.h.c.HttpShardHandlerFactory Host whitelist initialized: WhitelistHostChecker [whitelistHosts=null, whitelistHostCheckingEnabled=true]
   [junit4]   2> 4795808 WARN  (SUITE-SolrPluginUtilsTest-seed#[8204B44D4CD7DDA3]-worker) [     ] o.a.s.c.s.i.Http2SolrClient Create Http2SolrClient with HTTP/1.1 transport since Java 8 or lower versions does not support SSL + HTTP/2
   [junit4]   2> 4795856 WARN  (SUITE-SolrPluginUtilsTest-seed#[8204B44D4CD7DDA3]-worker) [     ] o.e.j.u.s.S.config Trusting all certificates configured for Client@36a4d94d[provider=null,keyStore=null,trustStore=null]
   [junit4]   2> 4795856 WARN  (SUITE-SolrPluginUtilsTest-seed#[8204B44D4CD7DDA3]-worker) [     ] o.e.j.u.s.S.config No Client EndPointIdentificationAlgorithm configured for Client@36a4d94d[provider=null,keyStore=null,trustStore=null]
   [junit4]   2> 4795876 WARN  (SUITE-SolrPluginUtilsTest-seed#[8204B44D4CD7DDA3]-worker) [     ] o.a.s.c.s.i.Http2SolrClient Create Http2SolrClient with HTTP/1.1 transport since Java 8 or lower versions does not support SSL + HTTP/2
   [junit4]   2> 4795892 WARN  (SUITE-SolrPluginUtilsTest-seed#[8204B44D4CD7DDA3]-worker) [     ] o.e.j.u.s.S.config Trusting all certificates configured for Client@61dd2fc5[provider=null,keyStore=null,trustStore=null]
   [junit4]   2> 4795892 WARN  (SUITE-SolrPluginUtilsTest-seed#[8204B44D4CD7DDA3]-worker) [     ] o.e.j.u.s.S.config No Client EndPointIdentificationAlgorithm configured for Client@61dd2fc5[provider=null,keyStore=null,trustStore=null]
   [junit4]   2> 4795984 INFO  (SUITE-SolrPluginUtilsTest-seed#[8204B44D4CD7DDA3]-worker) [     ] o.a.s.c.TransientSolrCoreCacheDefault Allocating transient cache for 2147483647 transient cores
   [junit4]   2> 4795984 INFO  (SUITE-SolrPluginUtilsTest-seed#[8204B44D4CD7DDA3]-worker) [     ] o.a.s.h.a.MetricsHistoryHandler No .system collection, keeping metrics history in memory.
   [junit4]   2> 4796043 INFO  (SUITE-SolrPluginUtilsTest-seed#[8204B44D4CD7DDA3]-worker) [     ] o.a.s.m.r.SolrJmxReporter JMX monitoring for 'solr.node' (registry 'solr.node') enabled at server: com.sun.jmx.mbeanserver.JmxMBeanServer@51ce1c80
   [junit4]   2> 4796080 INFO  (SUITE-SolrPluginUtilsTest-seed#[8204B44D4CD7DDA3]-worker) [     ] o.a.s.m.r.SolrJmxReporter JMX monitoring for 'solr.jvm' (registry 'solr.jvm') enabled at server: com.sun.jmx.mbeanserver.JmxMBeanServer@51ce1c80
   [junit4]   2> 4796080 INFO  (SUITE-SolrPluginUtilsTest-seed#[8204B44D4CD7DDA3]-worker) [     ] o.a.s.m.r.SolrJmxReporter JMX monitoring for 'solr.jetty' (registry 'solr.jetty') enabled at server: com.sun.jmx.mbeanserver.JmxMBeanServer@51ce1c80
   [junit4]   2> 4796084 INFO  (coreLoadExecutor-15192-thread-1) [    x:collection1 ] o.a.s.c.SolrResourceLoader [null] Added 2 libs to classloader, from paths: [/home/jenkins/jenkins-slave/workspace/Lucene-Solr-BadApples-Tests-8.x/solr/core/src/test-files/solr/collection1/lib, /home/jenkins/jenkins-slave/workspace/Lucene-Solr-BadApples-Tests-8.x/solr/core/src/test-files/solr/collection1/lib/classes]
   [junit4]   2> 4796293 INFO  (coreLoadExecutor-15192-thread-1) [    x:collection1 ] o.a.s.c.SolrConfig Using Lucene MatchVersion: 8.4.0
   [junit4]   2> 4796610 INFO  (coreLoadExecutor-15192-thread-1) [    x:collection1 ] o.a.s.s.IndexSchema [collection1] Schema name=test
   [junit4]   2> 4797292 INFO  (coreLoadExecutor-15192-thread-1) [    x:collection1 ] o.a.s.s.IndexSchema Loaded schema test/1.0 with uniqueid field id
   [junit4]   2> 4797316 INFO  (coreLoadExecutor-15192-thread-1) [    x:collection1 ] o.a.s.c.CoreContainer Creating SolrCore 'collection1' using configuration from instancedir /home/jenkins/jenkins-slave/workspace/Lucene-Solr-BadApples-Tests-8.x/solr/core/src/test-files/solr/collection1, trusted=true
   [junit4]   2> 4797329 INFO  (coreLoadExecutor-15192-thread-1) [    x:collection1 ] o.a.s.m.r.SolrJmxReporter JMX monitoring for 'solr.core.collection1' (registry 'solr.core.collection1') enabled at server: com.sun.jmx.mbeanserver.JmxMBeanServer@51ce1c80
   [junit4]   2> 4797329 INFO  (coreLoadExecutor-15192-thread-1) [    x:collection1 ] o.a.s.c.SolrCore [[collection1] ] Opening new SolrCore at [/home/jenkins/jenkins-slave/workspace/Lucene-Solr-BadApples-Tests-8.x/solr/core/src/test-files/solr/collection1], dataDir=[/home/jenkins/jenkins-slave/workspace/Lucene-Solr-BadApples-Tests-8.x/solr/build/solr-core/test/J0/temp/solr.util.SolrPluginUtilsTest_8204B44D4CD7DDA3-001/data-dir-235-001/]
   [junit4]   2> 4797330 INFO  (coreLoadExecutor-15192-thread-1) [    x:collection1 ] o.a.s.u.RandomMergePolicy RandomMergePolicy wrapping class org.apache.lucene.index.LogDocMergePolicy: [LogDocMergePolicy: minMergeSize=1000, mergeFactor=32, maxMergeSize=9223372036854775807, maxMergeSizeForForcedMerge=9223372036854775807, calibrateSizeByDeletes=false, maxMergeDocs=2147483647, maxCFSSegmentSizeMB=8.796093022207999E12, noCFSRatio=0.0]
   [junit4]   2> 4797551 INFO  (coreLoadExecutor-15192-thread-1) [    x:collection1 ] o.a.s.u.UpdateHandler Using UpdateLog implementation: org.apache.solr.update.UpdateLog
   [junit4]   2> 4797551 INFO  (coreLoadExecutor-15192-thread-1) [    x:collection1 ] o.a.s.u.UpdateLog Initializing UpdateLog: dataDir= defaultSyncLevel=FLUSH numRecordsToKeep=100 maxNumLogsToKeep=10 numVersionBuckets=65536
   [junit4]   2> 4797569 INFO  (coreLoadExecutor-15192-thread-1) [    x:collection1 ] o.a.s.u.CommitTracker Hard AutoCommit: disabled
   [junit4]   2> 4797569 INFO  (coreLoadExecutor-15192-thread-1) [    x:collection1 ] o.a.s.u.CommitTracker Soft AutoCommit: disabled
   [junit4]   2> 4797570 INFO  (coreLoadExecutor-15192-thread-1) [    x:collection1 ] o.a.s.u.RandomMergePolicy RandomMergePolicy wrapping class org.apache.lucene.index.LogByteSizeMergePolicy: [LogByteSizeMergePolicy: minMergeSize=1677721, mergeFactor=12, maxMergeSize=2147483648, maxMergeSizeForForcedMerge=9223372036854775807, calibrateSizeByDeletes=false, maxMergeDocs=2147483647, maxCFSSegmentSizeMB=8.796093022207999E12, noCFSRatio=0.4113624391329326]
   [junit4]   2> 4797570 INFO  (coreLoadExecutor-15192-thread-1) [    x:collection1 ] o.a.s.s.SolrIndexSearcher Opening [Searcher@87a11e4[collection1] main]
   [junit4]   2> 4797571 INFO  (coreLoadExecutor-15192-thread-1) [    x:collection1 ] o.a.s.h.c.SpellCheckComponent Initializing spell checkers
   [junit4]   2> 4797609 INFO  (coreLoadExecutor-15192-thread-1) [    x:collection1 ] o.a.s.s.DirectSolrSpellChecker init: {name=direct,classname=DirectSolrSpellChecker,field=lowerfilt,minQueryLength=3}
   [junit4]   2> 4797866 INFO  (coreLoadExecutor-15192-thread-1) [    x:collection1 ] o.a.s.h.ReplicationHandler Commits will be reserved for 10000ms.
   [junit4]   2> 4797867 INFO  (coreLoadExecutor-15192-thread-1) [    x:collection1 ] o.a.s.u.UpdateLog Could not find max version in index or recent updates, using new clock 1649043612364701696
   [junit4]   2> 4797868 INFO  (searcherExecutor-15193-thread-1-processing-x:collection1) [    x:collection1 ] o.a.s.h.c.SpellCheckComponent Loading spell index for spellchecker: default
   [junit4]   2> 4797869 INFO  (searcherExecutor-15193-thread-1-processing-x:collection1) [    x:collection1 ] o.a.s.h.c.SpellCheckComponent Loading spell index for spellchecker: direct
   [junit4]   2> 4797869 INFO  (searcherExecutor-15193-thread-1-processing-x:collection1) [    x:collection1 ] o.a.s.h.c.SpellCheckComponent Loading spell index for spellchecker: wordbreak
   [junit4]   2> 4797869 INFO  (searcherExecutor-15193-thread-1-processing-x:collection1) [    x:collection1 ] o.a.s.h.c.SpellCheckComponent Loading spell index for spellchecker: multipleFields
   [junit4]   2> 4797869 INFO  (searcherExecutor-15193-thread-1-processing-x:collection1) [    x:collection1 ] o.a.s.h.c.SpellCheckComponent Loading spell index for spellchecker: jarowinkler
   [junit4]   2> 4797869 INFO  (searcherExecutor-15193-thread-1-processing-x:collection1) [    x:collection1 ] o.a.s.h.c.SpellCheckComponent Loading spell index for spellchecker: external
   [junit4]   2> 4797869 INFO  (searcherExecutor-15193-thread-1-processing-x:collection1) [    x:collection1 ] o.a.s.h.c.SpellCheckComponent Loading spell index for spellchecker: freq
   [junit4]   2> 4797896 INFO  (searcherExecutor-15193-thread-1-processing-x:collection1) [    x:collection1 ] o.a.s.h.c.SpellCheckComponent Loading spell index for spellchecker: fqcn
   [junit4]   2> 4797897 INFO  (searcherExecutor-15193-thread-1-processing-x:collection1) [    x:collection1 ] o.a.s.h.c.SpellCheckComponent Loading spell index for spellchecker: perDict
   [junit4]   2> 4797899 INFO  (searcherExecutor-15193-thread-1-processing-x:collection1) [    x:collection1 ] o.a.s.c.SolrCore [collection1] Registered new searcher Searcher@87a11e4[collection1] main{ExitableDirectoryReader(UninvertingDirectoryReader())}
   [junit4]   2> NOTE: reproduce with: ant test  -Dtestcase=SolrPluginUtilsTest -Dtests.method=testMinShouldMatchBadQueries -Dtests.seed=8204B44D4CD7DDA3 -Dtests.multiplier=2 -Dtests.slow=true -Dtests.badapples=true -Dtests.locale=fi-FI -Dtests.timezone=Antarctica/Davis -Dtests.asserts=true -Dtests.file.encoding=UTF-8
   [junit4] FAILURE 0.02s J0 | SolrPluginUtilsTest.testMinShouldMatchBadQueries <<<
   [junit4]    > Throwable #1: junit.framework.AssertionFailedError: Expected exception SolrException but no exception was thrown
   [junit4]    >        at __randomizedtesting.SeedInfo.seed([8204B44D4CD7DDA3:4CD874E732EF52AD]:0)
   [junit4]    >        at org.apache.lucene.util.LuceneTestCase.expectThrows(LuceneTestCase.java:2722)
   [junit4]    >        at org.apache.lucene.util.LuceneTestCase.expectThrows(LuceneTestCase.java:2712)
   [junit4]    >        at org.apache.solr.util.SolrPluginUtilsTest.testMinShouldMatchBadQueries(SolrPluginUtilsTest.java:344)
   [junit4]    >        at java.lang.Thread.run(Thread.java:748)
   [junit4]   2> 4798073 INFO  (SUITE-SolrPluginUtilsTest-seed#[8204B44D4CD7DDA3]-worker) [     ] o.a.s.c.CoreContainer Shutting down CoreContainer instance=1077627296
   [junit4]   2> 4798074 INFO  (coreCloseExecutor-15198-thread-1) [    x:collection1 ] o.a.s.c.SolrCore [collection1]  CLOSING SolrCore org.apache.solr.core.SolrCore@54cf6768
   [junit4]   2> 4798074 INFO  (coreCloseExecutor-15198-thread-1) [    x:collection1 ] o.a.s.m.SolrMetricManager Closing metric reporters for registry=solr.core.collection1, tag=SolrCore@54cf6768
   [junit4]   2> 4798074 INFO  (coreCloseExecutor-15198-thread-1) [    x:collection1 ] o.a.s.m.r.SolrJmxReporter Closing reporter [org.apache.solr.metrics.reporters.SolrJmxReporter@7a774fda: rootName = null, domain = solr.core.collection1, service url = null, agent id = null] for registry solr.core.collection1 / com.codahale.metrics.MetricRegistry@4670d052
   [junit4]   2> 4798114 INFO  (SUITE-SolrPluginUtilsTest-seed#[8204B44D4CD7DDA3]-worker) [     ] o.a.s.m.SolrMetricManager Closing metric reporters for registry=solr.node, tag=null
   [junit4]   2> 4798114 INFO  (SUITE-SolrPluginUtilsTest-seed#[8204B44D4CD7DDA3]-worker) [     ] o.a.s.m.r.SolrJmxReporter Closing reporter [org.apache.solr.metrics.reporters.SolrJmxReporter@67e92742: rootName = null, domain = solr.node, service url = null, agent id = null] for registry solr.node / com.codahale.metrics.MetricRegistry@1113702d
   [junit4]   2> 4798117 INFO  (SUITE-SolrPluginUtilsTest-seed#[8204B44D4CD7DDA3]-worker) [     ] o.a.s.m.SolrMetricManager Closing metric reporters for registry=solr.jvm, tag=null
   [junit4]   2> 4798117 INFO  (SUITE-SolrPluginUtilsTest-seed#[8204B44D4CD7DDA3]-worker) [     ] o.a.s.m.r.SolrJmxReporter Closing reporter [org.apache.solr.metrics.reporters.SolrJmxReporter@9708909: rootName = null, domain = solr.jvm, service url = null, agent id = null] for registry solr.jvm / com.codahale.metrics.MetricRegistry@4c3e9f34
   [junit4]   2> 4798119 INFO  (SUITE-SolrPluginUtilsTest-seed#[8204B44D4CD7DDA3]-worker) [     ] o.a.s.m.SolrMetricManager Closing metric reporters for registry=solr.jetty, tag=null
   [junit4]   2> 4798119 INFO  (SUITE-SolrPluginUtilsTest-seed#[8204B44D4CD7DDA3]-worker) [     ] o.a.s.m.r.SolrJmxReporter Closing reporter [org.apache.solr.metrics.reporters.SolrJmxReporter@22d27647: rootName = null, domain = solr.jetty, service url = null, agent id = null] for registry solr.jetty / com.codahale.metrics.MetricRegistry@4d099ca7
   [junit4]   2> NOTE: leaving temporary files on disk at: /home/jenkins/jenkins-slave/workspace/Lucene-Solr-BadApples-Tests-8.x/solr/build/solr-core/test/J0/temp/solr.util.SolrPluginUtilsTest_8204B44D4CD7DDA3-001
   [junit4]   2> NOTE: test params are: codec=Asserting(Lucene80): {}, docValues:{}, maxPointsInLeafNode=1959, maxMBSortInHeap=5.452985638642262, sim=Asserting(org.apache.lucene.search.similarities.AssertingSimilarity@1ca9f442), locale=fi-FI, timezone=Antarctica/Davis
   [junit4]   2> NOTE: Linux 4.4.0-112-generic amd64/Oracle Corporation 1.8.0_191 (64-bit)/cpus=4,threads=1,free=125681496,total=530055168
   [junit4]   2> NOTE: All tests run in this JVM: [TestChildDocTransformer, SpellCheckComponentTest, SubstringBytesRefFilterTest, TestPointFields, TolerantUpdateProcessorTest, TestCrossCoreJoin, TestFiltering, DistributedFacetPivotLargeTest, TestTrie, UniqFieldsUpdateProcessorFactoryTest, DistributedSpellCheckComponentTest, ZkStateWriterTest, TestRawTransformer, TestSimExecutePlanAction, RestartWhileUpdatingTest, SolrGraphiteReporterTest, HdfsSyncSliceTest, QueryResultKeyTest, UnloadDistributedZkTest, TestManagedSchemaAPI, SimplePostToolTest, MissingSegmentRecoveryTest, TestEmbeddedSolrServerSchemaAPI, TestReplicaProperties, DeleteReplicaTest, AssignBackwardCompatibilityTest, TestAnalyzedSuggestions, ResponseLogComponentTest, TestDynamicFieldResource, TimeZoneUtilsTest, TestCloudJSONFacetJoinDomain, PreAnalyzedUpdateProcessorTest, RandomizedTaggerTest, BasicAuthIntegrationTest, TestSnapshotCloudManager, TestSolrConfigHandlerCloud, TestClusterStateMutator, HighlighterConfigTest, TestSolrDeletionPolicy1, AddBlockUpdateTest, TestSolrFieldCacheBean, NumberUtilsTest, TestStressVersions, DocValuesTest, TestSimComputePlanAction, TestLFUCache, TestFieldCacheVsDocValues, HLLSerializationTest, TriggerIntegrationTest, DistributedQueueTest, IndexSizeTriggerTest, TestDocSet, TestRuleBasedAuthorizationPlugin, TestOrdValues, TestLegacyTerms, ForceLeaderTest, TestShortCircuitedRequests, TestValueSourceCache, DateMathParserTest, TestPullReplica, DimensionalRoutedAliasUpdateProcessorTest, FacetPivotSmallTest, TestJsonFacets, JWTAuthPluginIntegrationTest, TestPayloadCheckQParserPlugin, TestNumericTerms32, TestPolicyCloud, TestSortableTextField, SpellPossibilityIteratorTest, TestSweetSpotSimilarityFactory, MetricsHistoryHandlerTest, TestSolr4Spatial, StatelessScriptUpdateProcessorFactoryTest, TestCloudInspectUtil, TestNumericRangeQuery64, TestDynamicLoadingUrl, AuthToolTest, TestRequestForwarding, CoreAdminCreateDiscoverTest, SimpleCollectionCreateDeleteTest, PolyFieldTest, TestMacros, ReplaceNodeNoTargetTest, ConnectionManagerTest, BasicZkTest, OverriddenZkACLAndCredentialsProvidersTest, TestApiFramework, OverseerTest, XsltUpdateRequestHandlerTest, HealthCheckHandlerTest, UpdateParamsTest, TestUpdate, ResourceLoaderTest, ShardRoutingTest, CleanupOldIndexTest, SampleTest, TestFastOutputStream, TestSimPolicyCloud, SplitShardTest, TestPhraseSuggestions, ExitableDirectoryReaderTest, TestIntervalFaceting, EchoParamsTest, TestMiniSolrCloudClusterSSL, DistributedFacetPivotSmallTest, TestDocTermOrds, RulesTest, UUIDFieldTest, MoveReplicaTest, RecoveryZkTest, ZkControllerTest, TestNonDefinedSimilarityFactory, NodeLostTriggerTest, AsyncCallRequestStatusResponseTest, CurrencyRangeFacetCloudTest, TermsComponentTest, TestExportWriter, TestBulkSchemaAPI, DistributedFacetSimpleRefinementLongTailTest, CdcrBootstrapTest, TestCoreContainer, NestedShardedAtomicUpdateTest, WordBreakSolrSpellCheckerTest, BufferStoreTest, LeaderElectionTest, TestFieldCacheReopen, TestHttpShardHandlerFactory, BlockJoinFacetSimpleTest, TestManagedSynonymFilterFactory, SolrRrdBackendFactoryTest, TestLRUStatsCache, TestHashQParserPlugin, CustomHighlightComponentTest, TestInPlaceUpdateWithRouteField, TestRealTimeGet, TestCollationFieldDocValues, TestCloudPseudoReturnFields, TestNestedDocsSort, CoreAdminRequestStatusTest, TestRandomCollapseQParserPlugin, TestRTimerTree, CopyFieldTest, SortByFunctionTest, HdfsUnloadDistributedZkTest, TestExclusionRuleCollectionAccess, TestLeaderElectionWithEmptyReplica, TestSSLRandomization, TestSegmentSorting, TestUtilizeNode, TestWithCollection, CollectionsAPIDistributedZkTest, AutoAddReplicasIntegrationTest, HdfsAutoAddReplicasIntegrationTest, HttpTriggerListenerTest, NodeMarkersRegistrationTest, ScheduledMaintenanceTriggerTest, SearchRateTriggerIntegrationTest, TriggerSetPropertiesIntegrationTest, TestSimClusterStateProvider, TestSimLargeCluster, TestConfig, TestCorePropertiesReload, TestCustomStream, TestQuerySenderListener, TestShardHandlerFactory, TestSolrDeletionPolicy2, TestSolrXml, TestXIncludeConfig, TestSolrCloudSnapshots, TestBlobHandler, TestReplicationHandler, XmlUpdateRequestHandlerTest, CoreAdminOperationTest, CoreMergeIndexesAdminHandlerTest, DaemonStreamApiTest, InfoHandlerTest, LoggingHandlerTest, LukeRequestHandlerTest, MetricsHandlerTest, SegmentsInfoRequestHandlerTest, ShowFileRequestHandlerTest, SplitHandlerTest, SystemInfoHandlerTest, TestCoreAdminApis, ZookeeperStatusHandlerTest, BadComponentTest, DistributedExpandComponentTest, DistributedFacetPivotSmallAdvancedTest, DistributedMLTComponentTest, DistributedQueryElevationComponentTest, MoreLikeThisComponentTest, PhrasesIdentificationComponentTest, SuggestComponentTest, TestExpandComponent, TestTrackingShardHandlerFactory, TestUnifiedSolrHighlighter, WrapperMergePolicyFactoryTest, CheckHdfsIndexTest, TestUseDocValuesAsStored, TestCollapseQParserPlugin, TestFastLRUCache, TestFilteredDocIdSet, TestInitQParser, TestLRUCache, TestLegacyNumericRangeQueryBuilder, TestMaxScoreQueryParser, TestMissingGroups, TestNoOpRegenerator, TestQueryTypes, TestRangeQuery, TestReload, TestSearcherReuse, TestSolrCoreParser, TestSort, TestFunctionQuery, TestMinMaxOnMultiValuedField, TestSortByMinMaxFunction, DistanceFunctionTest, BJQParserTest, BlockJoinFacetDistribTest, BlockJoinFacetRandomTest, TestScoreJoinQPScore, BJQFilterAccessibleTest, SimpleMLTQParserTest, TestBM25SimilarityFactory, TestClassicSimilarityFactory, TestDFISimilarityFactory, TestDFRSimilarityFactory, TestIBSimilarityFactory, TestLMDirichletSimilarityFactory, TestLMJelinekMercerSimilarityFactory, TestLegacyBM25SimilarityFactory, AuditLoggerIntegrationTest, SolrLogAuditLoggerPluginTest, TestPKIAuthenticationPlugin, TestSha256AuthenticationProvider, TestDelegationWithHadoopAuth, TestZkAclsWithHadoopAuth, CacheHeaderTest, NoCacheHeaderTest, ConjunctionSolrSpellCheckerTest, SuggesterTest, TestAnalyzeInfixSuggestions, TestFieldCacheSort, TestUninvertingReader, AnalysisErrorHandlingTest, MaxSizeAutoCommitTest, PeerSyncWithLeaderAndIndexFingerprintCachingTest, RootFieldTest, SoftAutoCommitTest, OrderedExecutorTest, PrimUtilsTest, SolrPluginUtilsTest]
   [junit4] Completed [863/880 (1!)] on J0 in 3.88s, 9 tests, 1 failure <<< FAILURES!

[...truncated 52842 lines...]

---------------------------------------------------------------------
To unsubscribe, e-mail: [hidden email]
For additional commands, e-mail: [hidden email]