Re: [JENKINS] Lucene-Solr-NightlyTests-master - Build # 2062 - Unstable

classic Classic list List threaded Threaded
1 message Options
Reply | Threaded
Open this post in threaded view
|

Re: [JENKINS] Lucene-Solr-NightlyTests-master - Build # 2062 - Unstable

Dawid Weiss-2
This called RamUsageTester.sizeOf(buf) over and over again on nightly
runs. I disabled those checks (for nightlies) since we're doing it in
normal runs and at the end of the test anyway.

D.

On Thu, Jan 2, 2020 at 8:16 PM Apache Jenkins Server
<[hidden email]> wrote:

>
> Build: https://builds.apache.org/job/Lucene-Solr-NightlyTests-master/2062/
>
> 2 tests failed.
> FAILED:  org.apache.lucene.util.packed.TestPackedInts.testPackedLongValues
>
> Error Message:
> Test abandoned because suite timeout was reached.
>
> Stack Trace:
> java.lang.Exception: Test abandoned because suite timeout was reached.
>         at __randomizedtesting.SeedInfo.seed([55D847340F5FA649]:0)
>
>
> FAILED:  junit.framework.TestSuite.org.apache.lucene.util.packed.TestPackedInts
>
> Error Message:
> Suite timeout exceeded (>= 7200000 msec).
>
> Stack Trace:
> java.lang.Exception: Suite timeout exceeded (>= 7200000 msec).
>         at __randomizedtesting.SeedInfo.seed([55D847340F5FA649]:0)
>
>
>
>
> Build Log:
> [...truncated 1919 lines...]
>    [junit4] Suite: org.apache.lucene.util.packed.TestPackedInts
>    [junit4]   2> Mbe 02, 2020 4:46:19 ?YAKWAKYA com.carrotsearch.randomizedtesting.ThreadLeakControl$2 evaluate
>    [junit4]   2> WARNING: Suite execution timed out: org.apache.lucene.util.packed.TestPackedInts
>    [junit4]   2>    1) Thread[id=1, name=main, state=WAITING, group=main]
>    [junit4]   2>         at java.base@11.0.4/java.lang.Object.wait(Native Method)
>    [junit4]   2>         at java.base@11.0.4/java.lang.Thread.join(Thread.java:1305)
>    [junit4]   2>         at java.base@11.0.4/java.lang.Thread.join(Thread.java:1379)
>    [junit4]   2>         at app//com.carrotsearch.randomizedtesting.RandomizedRunner.runSuite(RandomizedRunner.java:643)
>    [junit4]   2>         at app//com.carrotsearch.randomizedtesting.RandomizedRunner.run(RandomizedRunner.java:500)
>    [junit4]   2>         at app//com.carrotsearch.ant.tasks.junit4.slave.SlaveMain.execute(SlaveMain.java:269)
>    [junit4]   2>         at app//com.carrotsearch.ant.tasks.junit4.slave.SlaveMain.main(SlaveMain.java:394)
>    [junit4]   2>         at app//com.carrotsearch.ant.tasks.junit4.slave.SlaveMainSafe.main(SlaveMainSafe.java:13)
>    [junit4]   2>    2) Thread[id=11, name=JUnit4-serializer-daemon, state=TIMED_WAITING, group=main]
>    [junit4]   2>         at java.base@11.0.4/java.lang.Thread.sleep(Native Method)
>    [junit4]   2>         at app//com.carrotsearch.ant.tasks.junit4.events.Serializer$1.run(Serializer.java:50)
>    [junit4]   2>    3) Thread[id=1010, name=SUITE-TestPackedInts-seed#[55D847340F5FA649], state=RUNNABLE, group=TGRP-TestPackedInts]
>    [junit4]   2>         at java.base/java.lang.Thread.getStackTrace(Thread.java:1606)
>    [junit4]   2>         at com.carrotsearch.randomizedtesting.ThreadLeakControl$4.run(ThreadLeakControl.java:698)
>    [junit4]   2>         at com.carrotsearch.randomizedtesting.ThreadLeakControl$4.run(ThreadLeakControl.java:695)
>    [junit4]   2>         at java.base/java.security.AccessController.doPrivileged(Native Method)
>    [junit4]   2>         at com.carrotsearch.randomizedtesting.ThreadLeakControl.getStackTrace(ThreadLeakControl.java:695)
>    [junit4]   2>         at com.carrotsearch.randomizedtesting.ThreadLeakControl.getThreadsWithTraces(ThreadLeakControl.java:711)
>    [junit4]   2>         at com.carrotsearch.randomizedtesting.ThreadLeakControl.formatThreadStacksFull(ThreadLeakControl.java:691)
>    [junit4]   2>         at com.carrotsearch.randomizedtesting.ThreadLeakControl.access$1000(ThreadLeakControl.java:67)
>    [junit4]   2>         at com.carrotsearch.randomizedtesting.ThreadLeakControl$2.evaluate(ThreadLeakControl.java:417)
>    [junit4]   2>         at com.carrotsearch.randomizedtesting.RandomizedRunner.runSuite(RandomizedRunner.java:712)
>    [junit4]   2>         at com.carrotsearch.randomizedtesting.RandomizedRunner.access$200(RandomizedRunner.java:138)
>    [junit4]   2>         at com.carrotsearch.randomizedtesting.RandomizedRunner$2.run(RandomizedRunner.java:633)
>    [junit4]   2>    4) Thread[id=1011, name=TEST-TestPackedInts.testPackedLongValues-seed#[55D847340F5FA649], state=RUNNABLE, group=TGRP-TestPackedInts]
>    [junit4]   2>         at java.base@11.0.4/java.security.AccessController.doPrivileged(Native Method)
>    [junit4]   2>         at app//org.apache.lucene.util.RamUsageEstimator.shallowSizeOfInstance(RamUsageEstimator.java:559)
>    [junit4]   2>         at app//org.apache.lucene.util.RamUsageEstimator.shallowSizeOf(RamUsageEstimator.java:536)
>    [junit4]   2>         at app//org.apache.lucene.util.RamUsageTester.handleOther(RamUsageTester.java:147)
>    [junit4]   2>         at app//org.apache.lucene.util.RamUsageTester.measureObjectSize(RamUsageTester.java:124)
>    [junit4]   2>         at app//org.apache.lucene.util.RamUsageTester.sizeOf(RamUsageTester.java:77)
>    [junit4]   2>         at app//org.apache.lucene.util.RamUsageTester.sizeOf(RamUsageTester.java:82)
>    [junit4]   2>         at app//org.apache.lucene.util.packed.TestPackedInts.testPackedLongValues(TestPackedInts.java:985)
>    [junit4]   2>         at java.base@11.0.4/jdk.internal.reflect.NativeMethodAccessorImpl.invoke0(Native Method)
>    [junit4]   2>         at java.base@11.0.4/jdk.internal.reflect.NativeMethodAccessorImpl.invoke(NativeMethodAccessorImpl.java:62)
>    [junit4]   2>         at java.base@11.0.4/jdk.internal.reflect.DelegatingMethodAccessorImpl.invoke(DelegatingMethodAccessorImpl.java:43)
>    [junit4]   2>         at java.base@11.0.4/java.lang.reflect.Method.invoke(Method.java:566)
>    [junit4]   2>         at app//com.carrotsearch.randomizedtesting.RandomizedRunner.invoke(RandomizedRunner.java:1754)
>    [junit4]   2>         at app//com.carrotsearch.randomizedtesting.RandomizedRunner$8.evaluate(RandomizedRunner.java:942)
>    [junit4]   2>         at app//com.carrotsearch.randomizedtesting.RandomizedRunner$9.evaluate(RandomizedRunner.java:978)
>    [junit4]   2>         at app//com.carrotsearch.randomizedtesting.RandomizedRunner$10.evaluate(RandomizedRunner.java:992)
>    [junit4]   2>         at app//org.apache.lucene.util.TestRuleSetupTeardownChained$1.evaluate(TestRuleSetupTeardownChained.java:49)
>    [junit4]   2>         at app//org.apache.lucene.util.AbstractBeforeAfterRule$1.evaluate(AbstractBeforeAfterRule.java:45)
>    [junit4]   2>         at app//org.apache.lucene.util.TestRuleThreadAndTestName$1.evaluate(TestRuleThreadAndTestName.java:48)
>    [junit4]   2>         at app//org.apache.lucene.util.TestRuleIgnoreAfterMaxFailures$1.evaluate(TestRuleIgnoreAfterMaxFailures.java:64)
>    [junit4]   2>         at app//org.apache.lucene.util.TestRuleMarkFailure$1.evaluate(TestRuleMarkFailure.java:47)
>    [junit4]   2>         at app//com.carrotsearch.randomizedtesting.rules.StatementAdapter.evaluate(StatementAdapter.java:36)
>    [junit4]   2>         at app//com.carrotsearch.randomizedtesting.ThreadLeakControl$StatementRunner.run(ThreadLeakControl.java:370)
>    [junit4]   2>         at app//com.carrotsearch.randomizedtesting.ThreadLeakControl.forkTimeoutingTask(ThreadLeakControl.java:819)
>    [junit4]   2>         at app//com.carrotsearch.randomizedtesting.ThreadLeakControl$3.evaluate(ThreadLeakControl.java:470)
>    [junit4]   2>         at app//com.carrotsearch.randomizedtesting.RandomizedRunner.runSingleTest(RandomizedRunner.java:951)
>    [junit4]   2>         at app//com.carrotsearch.randomizedtesting.RandomizedRunner$5.evaluate(RandomizedRunner.java:836)
>    [junit4]   2>         at app//com.carrotsearch.randomizedtesting.RandomizedRunner$6.evaluate(RandomizedRunner.java:887)
>    [junit4]   2>         at app//com.carrotsearch.randomizedtesting.RandomizedRunner$7.evaluate(RandomizedRunner.java:898)
>    [junit4]   2>         at app//org.apache.lucene.util.AbstractBeforeAfterRule$1.evaluate(AbstractBeforeAfterRule.java:45)
>    [junit4]   2>         at app//com.carrotsearch.randomizedtesting.rules.StatementAdapter.evaluate(StatementAdapter.java:36)
>    [junit4]   2>         at app//org.apache.lucene.util.TestRuleStoreClassName$1.evaluate(TestRuleStoreClassName.java:41)
>    [junit4]   2>         at app//com.carrotsearch.randomizedtesting.rules.NoShadowingOrOverridesOnMethodsRule$1.evaluate(NoShadowingOrOverridesOnMethodsRule.java:40)
>    [junit4]   2>         at app//com.carrotsearch.randomizedtesting.rules.NoShadowingOrOverridesOnMethodsRule$1.evaluate(NoShadowingOrOverridesOnMethodsRule.java:40)
>    [junit4]   2>         at app//com.carrotsearch.randomizedtesting.rules.StatementAdapter.evaluate(StatementAdapter.java:36)
>    [junit4]   2>         at app//com.carrotsearch.randomizedtesting.rules.StatementAdapter.evaluate(StatementAdapter.java:36)
>    [junit4]   2>         at app//org.apache.lucene.util.TestRuleAssertionsRequired$1.evaluate(TestRuleAssertionsRequired.java:53)
>    [junit4]   2>         at app//org.apache.lucene.util.TestRuleMarkFailure$1.evaluate(TestRuleMarkFailure.java:47)
>    [junit4]   2>         at app//org.apache.lucene.util.TestRuleIgnoreAfterMaxFailures$1.evaluate(TestRuleIgnoreAfterMaxFailures.java:64)
>    [junit4]   2>         at app//org.apache.lucene.util.TestRuleIgnoreTestSuites$1.evaluate(TestRuleIgnoreTestSuites.java:54)
>    [junit4]   2>         at app//com.carrotsearch.randomizedtesting.rules.StatementAdapter.evaluate(StatementAdapter.java:36)
>    [junit4]   2>         at app//com.carrotsearch.randomizedtesting.ThreadLeakControl$StatementRunner.run(ThreadLeakControl.java:370)
>    [junit4]   2>         at app//com.carrotsearch.randomizedtesting.ThreadLeakControl.lambda$forkTimeoutingTask$0(ThreadLeakControl.java:826)
>    [junit4]   2>         at app//com.carrotsearch.randomizedtesting.ThreadLeakControl$$Lambda$86/0x0000000100143040.run(Unknown Source)
>    [junit4]   2>         at java.base@11.0.4/java.lang.Thread.run(Thread.java:834)
>    [junit4]   2> NOTE: download the large Jenkins line-docs file by running 'ant get-jenkins-line-docs' in the lucene directory.
>    [junit4]   2> NOTE: reproduce with: ant test  -Dtestcase=TestPackedInts -Dtests.method=testPackedLongValues -Dtests.seed=55D847340F5FA649 -Dtests.multiplier=2 -Dtests.nightly=true -Dtests.slow=true -Dtests.linedocsfile=/home/jenkins/jenkins-slave/workspace/Lucene-Solr-NightlyTests-master/test-data/enwiki.random.lines.txt -Dtests.locale=kam-KE -Dtests.timezone=America/Inuvik -Dtests.asserts=true -Dtests.file.encoding=ISO-8859-1
>    [junit4] ERROR   7121s J0 | TestPackedInts.testPackedLongValues <<<
>    [junit4]    > Throwable #1: java.lang.Exception: Test abandoned because suite timeout was reached.
>    [junit4]    >        at __randomizedtesting.SeedInfo.seed([55D847340F5FA649]:0)
>    [junit4]   2> Mbe 02, 2020 4:46:19 ?YAKWAKYA com.carrotsearch.randomizedtesting.ThreadLeakControl checkThreadLeaks
>    [junit4]   2> WARNING: Will linger awaiting termination of 1 leaked thread(s).
>    [junit4]   2> Mbe 02, 2020 4:46:39 ?YAKWAKYA com.carrotsearch.randomizedtesting.ThreadLeakControl checkThreadLeaks
>    [junit4]   2> SEVERE: 1 thread leaked from SUITE scope at org.apache.lucene.util.packed.TestPackedInts:
>    [junit4]   2>    1) Thread[id=1011, name=TEST-TestPackedInts.testPackedLongValues-seed#[55D847340F5FA649], state=RUNNABLE, group=TGRP-TestPackedInts]
>    [junit4]   2>         at java.base@11.0.4/java.security.AccessController.doPrivileged(Native Method)
>    [junit4]   2>         at app//org.apache.lucene.util.RamUsageEstimator.shallowSizeOfInstance(RamUsageEstimator.java:559)
>    [junit4]   2>         at app//org.apache.lucene.util.RamUsageEstimator.shallowSizeOf(RamUsageEstimator.java:536)
>    [junit4]   2>         at app//org.apache.lucene.util.RamUsageTester.handleOther(RamUsageTester.java:147)
>    [junit4]   2>         at app//org.apache.lucene.util.RamUsageTester.measureObjectSize(RamUsageTester.java:124)
>    [junit4]   2>         at app//org.apache.lucene.util.RamUsageTester.sizeOf(RamUsageTester.java:77)
>    [junit4]   2>         at app//org.apache.lucene.util.RamUsageTester.sizeOf(RamUsageTester.java:82)
>    [junit4]   2>         at app//org.apache.lucene.util.packed.TestPackedInts.testPackedLongValues(TestPackedInts.java:985)
>    [junit4]   2>         at java.base@11.0.4/jdk.internal.reflect.NativeMethodAccessorImpl.invoke0(Native Method)
>    [junit4]   2>         at java.base@11.0.4/jdk.internal.reflect.NativeMethodAccessorImpl.invoke(NativeMethodAccessorImpl.java:62)
>    [junit4]   2>         at java.base@11.0.4/jdk.internal.reflect.DelegatingMethodAccessorImpl.invoke(DelegatingMethodAccessorImpl.java:43)
>    [junit4]   2>         at java.base@11.0.4/java.lang.reflect.Method.invoke(Method.java:566)
>    [junit4]   2>         at app//com.carrotsearch.randomizedtesting.RandomizedRunner.invoke(RandomizedRunner.java:1754)
>    [junit4]   2>         at app//com.carrotsearch.randomizedtesting.RandomizedRunner$8.evaluate(RandomizedRunner.java:942)
>    [junit4]   2>         at app//com.carrotsearch.randomizedtesting.RandomizedRunner$9.evaluate(RandomizedRunner.java:978)
>    [junit4]   2>         at app//com.carrotsearch.randomizedtesting.RandomizedRunner$10.evaluate(RandomizedRunner.java:992)
>    [junit4]   2>         at app//org.apache.lucene.util.TestRuleSetupTeardownChained$1.evaluate(TestRuleSetupTeardownChained.java:49)
>    [junit4]   2>         at app//org.apache.lucene.util.AbstractBeforeAfterRule$1.evaluate(AbstractBeforeAfterRule.java:45)
>    [junit4]   2>         at app//org.apache.lucene.util.TestRuleThreadAndTestName$1.evaluate(TestRuleThreadAndTestName.java:48)
>    [junit4]   2>         at app//org.apache.lucene.util.TestRuleIgnoreAfterMaxFailures$1.evaluate(TestRuleIgnoreAfterMaxFailures.java:64)
>    [junit4]   2>         at app//org.apache.lucene.util.TestRuleMarkFailure$1.evaluate(TestRuleMarkFailure.java:47)
>    [junit4]   2>         at app//com.carrotsearch.randomizedtesting.rules.StatementAdapter.evaluate(StatementAdapter.java:36)
>    [junit4]   2>         at app//com.carrotsearch.randomizedtesting.ThreadLeakControl$StatementRunner.run(ThreadLeakControl.java:370)
>    [junit4]   2>         at app//com.carrotsearch.randomizedtesting.ThreadLeakControl.forkTimeoutingTask(ThreadLeakControl.java:819)
>    [junit4]   2>         at app//com.carrotsearch.randomizedtesting.ThreadLeakControl$3.evaluate(ThreadLeakControl.java:470)
>    [junit4]   2>         at app//com.carrotsearch.randomizedtesting.RandomizedRunner.runSingleTest(RandomizedRunner.java:951)
>    [junit4]   2>         at app//com.carrotsearch.randomizedtesting.RandomizedRunner$5.evaluate(RandomizedRunner.java:836)
>    [junit4]   2>         at app//com.carrotsearch.randomizedtesting.RandomizedRunner$6.evaluate(RandomizedRunner.java:887)
>    [junit4]   2>         at app//com.carrotsearch.randomizedtesting.RandomizedRunner$7.evaluate(RandomizedRunner.java:898)
>    [junit4]   2>         at app//org.apache.lucene.util.AbstractBeforeAfterRule$1.evaluate(AbstractBeforeAfterRule.java:45)
>    [junit4]   2>         at app//com.carrotsearch.randomizedtesting.rules.StatementAdapter.evaluate(StatementAdapter.java:36)
>    [junit4]   2>         at app//org.apache.lucene.util.TestRuleStoreClassName$1.evaluate(TestRuleStoreClassName.java:41)
>    [junit4]   2>         at app//com.carrotsearch.randomizedtesting.rules.NoShadowingOrOverridesOnMethodsRule$1.evaluate(NoShadowingOrOverridesOnMethodsRule.java:40)
>    [junit4]   2>         at app//com.carrotsearch.randomizedtesting.rules.NoShadowingOrOverridesOnMethodsRule$1.evaluate(NoShadowingOrOverridesOnMethodsRule.java:40)
>    [junit4]   2>         at app//com.carrotsearch.randomizedtesting.rules.StatementAdapter.evaluate(StatementAdapter.java:36)
>    [junit4]   2>         at app//com.carrotsearch.randomizedtesting.rules.StatementAdapter.evaluate(StatementAdapter.java:36)
>    [junit4]   2>         at app//org.apache.lucene.util.TestRuleAssertionsRequired$1.evaluate(TestRuleAssertionsRequired.java:53)
>    [junit4]   2>         at app//org.apache.lucene.util.TestRuleMarkFailure$1.evaluate(TestRuleMarkFailure.java:47)
>    [junit4]   2>         at app//org.apache.lucene.util.TestRuleIgnoreAfterMaxFailures$1.evaluate(TestRuleIgnoreAfterMaxFailures.java:64)
>    [junit4]   2>         at app//org.apache.lucene.util.TestRuleIgnoreTestSuites$1.evaluate(TestRuleIgnoreTestSuites.java:54)
>    [junit4]   2>         at app//com.carrotsearch.randomizedtesting.rules.StatementAdapter.evaluate(StatementAdapter.java:36)
>    [junit4]   2>         at app//com.carrotsearch.randomizedtesting.ThreadLeakControl$StatementRunner.run(ThreadLeakControl.java:370)
>    [junit4]   2>         at app//com.carrotsearch.randomizedtesting.ThreadLeakControl.lambda$forkTimeoutingTask$0(ThreadLeakControl.java:826)
>    [junit4]   2>         at app//com.carrotsearch.randomizedtesting.ThreadLeakControl$$Lambda$86/0x0000000100143040.run(Unknown Source)
>    [junit4]   2>         at java.base@11.0.4/java.lang.Thread.run(Thread.java:834)
>    [junit4]   2> Mbe 02, 2020 4:46:39 ?YAKWAKYA com.carrotsearch.randomizedtesting.ThreadLeakControl tryToInterruptAll
>    [junit4]   2> INFO: Starting to interrupt leaked threads:
>    [junit4]   2>    1) Thread[id=1011, name=TEST-TestPackedInts.testPackedLongValues-seed#[55D847340F5FA649], state=RUNNABLE, group=TGRP-TestPackedInts]
>    [junit4]   2> Mbe 02, 2020 4:46:42 ?YAKWAKYA com.carrotsearch.randomizedtesting.ThreadLeakControl tryToInterruptAll
>    [junit4]   2> SEVERE: There are still zombie threads that couldn't be terminated:
>    [junit4]   2>    1) Thread[id=1011, name=TEST-TestPackedInts.testPackedLongValues-seed#[55D847340F5FA649], state=RUNNABLE, group=TGRP-TestPackedInts]
>    [junit4]   2>         at java.base@11.0.4/java.security.AccessController.doPrivileged(Native Method)
>    [junit4]   2>         at app//org.apache.lucene.util.RamUsageEstimator.shallowSizeOfInstance(RamUsageEstimator.java:559)
>    [junit4]   2>         at app//org.apache.lucene.util.RamUsageEstimator.shallowSizeOf(RamUsageEstimator.java:536)
>    [junit4]   2>         at app//org.apache.lucene.util.RamUsageTester.handleOther(RamUsageTester.java:147)
>    [junit4]   2>         at app//org.apache.lucene.util.RamUsageTester.measureObjectSize(RamUsageTester.java:124)
>    [junit4]   2>         at app//org.apache.lucene.util.RamUsageTester.sizeOf(RamUsageTester.java:77)
>    [junit4]   2>         at app//org.apache.lucene.util.RamUsageTester.sizeOf(RamUsageTester.java:82)
>    [junit4]   2>         at app//org.apache.lucene.util.packed.TestPackedInts.testPackedLongValues(TestPackedInts.java:985)
>    [junit4]   2>         at java.base@11.0.4/jdk.internal.reflect.NativeMethodAccessorImpl.invoke0(Native Method)
>    [junit4]   2>         at java.base@11.0.4/jdk.internal.reflect.NativeMethodAccessorImpl.invoke(NativeMethodAccessorImpl.java:62)
>    [junit4]   2>         at java.base@11.0.4/jdk.internal.reflect.DelegatingMethodAccessorImpl.invoke(DelegatingMethodAccessorImpl.java:43)
>    [junit4]   2>         at java.base@11.0.4/java.lang.reflect.Method.invoke(Method.java:566)
>    [junit4]   2>         at app//com.carrotsearch.randomizedtesting.RandomizedRunner.invoke(RandomizedRunner.java:1754)
>    [junit4]   2>         at app//com.carrotsearch.randomizedtesting.RandomizedRunner$8.evaluate(RandomizedRunner.java:942)
>    [junit4]   2>         at app//com.carrotsearch.randomizedtesting.RandomizedRunner$9.evaluate(RandomizedRunner.java:978)
>    [junit4]   2>         at app//com.carrotsearch.randomizedtesting.RandomizedRunner$10.evaluate(RandomizedRunner.java:992)
>    [junit4]   2>         at app//org.apache.lucene.util.TestRuleSetupTeardownChained$1.evaluate(TestRuleSetupTeardownChained.java:49)
>    [junit4]   2>         at app//org.apache.lucene.util.AbstractBeforeAfterRule$1.evaluate(AbstractBeforeAfterRule.java:45)
>    [junit4]   2>         at app//org.apache.lucene.util.TestRuleThreadAndTestName$1.evaluate(TestRuleThreadAndTestName.java:48)
>    [junit4]   2>         at app//org.apache.lucene.util.TestRuleIgnoreAfterMaxFailures$1.evaluate(TestRuleIgnoreAfterMaxFailures.java:64)
>    [junit4]   2>         at app//org.apache.lucene.util.TestRuleMarkFailure$1.evaluate(TestRuleMarkFailure.java:47)
>    [junit4]   2>         at app//com.carrotsearch.randomizedtesting.rules.StatementAdapter.evaluate(StatementAdapter.java:36)
>    [junit4]   2>         at app//com.carrotsearch.randomizedtesting.ThreadLeakControl$StatementRunner.run(ThreadLeakControl.java:370)
>    [junit4]   2>         at app//com.carrotsearch.randomizedtesting.ThreadLeakControl.forkTimeoutingTask(ThreadLeakControl.java:819)
>    [junit4]   2>         at app//com.carrotsearch.randomizedtesting.ThreadLeakControl$3.evaluate(ThreadLeakControl.java:470)
>    [junit4]   2>         at app//com.carrotsearch.randomizedtesting.RandomizedRunner.runSingleTest(RandomizedRunner.java:951)
>    [junit4]   2>         at app//com.carrotsearch.randomizedtesting.RandomizedRunner$5.evaluate(RandomizedRunner.java:836)
>    [junit4]   2>         at app//com.carrotsearch.randomizedtesting.RandomizedRunner$6.evaluate(RandomizedRunner.java:887)
>    [junit4]   2>         at app//com.carrotsearch.randomizedtesting.RandomizedRunner$7.evaluate(RandomizedRunner.java:898)
>    [junit4]   2>         at app//org.apache.lucene.util.AbstractBeforeAfterRule$1.evaluate(AbstractBeforeAfterRule.java:45)
>    [junit4]   2>         at app//com.carrotsearch.randomizedtesting.rules.StatementAdapter.evaluate(StatementAdapter.java:36)
>    [junit4]   2>         at app//org.apache.lucene.util.TestRuleStoreClassName$1.evaluate(TestRuleStoreClassName.java:41)
>    [junit4]   2>         at app//com.carrotsearch.randomizedtesting.rules.NoShadowingOrOverridesOnMethodsRule$1.evaluate(NoShadowingOrOverridesOnMethodsRule.java:40)
>    [junit4]   2>         at app//com.carrotsearch.randomizedtesting.rules.NoShadowingOrOverridesOnMethodsRule$1.evaluate(NoShadowingOrOverridesOnMethodsRule.java:40)
>    [junit4]   2>         at app//com.carrotsearch.randomizedtesting.rules.StatementAdapter.evaluate(StatementAdapter.java:36)
>    [junit4]   2>         at app//com.carrotsearch.randomizedtesting.rules.StatementAdapter.evaluate(StatementAdapter.java:36)
>    [junit4]   2>         at app//org.apache.lucene.util.TestRuleAssertionsRequired$1.evaluate(TestRuleAssertionsRequired.java:53)
>    [junit4]   2>         at app//org.apache.lucene.util.TestRuleMarkFailure$1.evaluate(TestRuleMarkFailure.java:47)
>    [junit4]   2>         at app//org.apache.lucene.util.TestRuleIgnoreAfterMaxFailures$1.evaluate(TestRuleIgnoreAfterMaxFailures.java:64)
>    [junit4]   2>         at app//org.apache.lucene.util.TestRuleIgnoreTestSuites$1.evaluate(TestRuleIgnoreTestSuites.java:54)
>    [junit4]   2>         at app//com.carrotsearch.randomizedtesting.rules.StatementAdapter.evaluate(StatementAdapter.java:36)
>    [junit4]   2>         at app//com.carrotsearch.randomizedtesting.ThreadLeakControl$StatementRunner.run(ThreadLeakControl.java:370)
>    [junit4]   2>         at app//com.carrotsearch.randomizedtesting.ThreadLeakControl.lambda$forkTimeoutingTask$0(ThreadLeakControl.java:826)
>    [junit4]   2>         at app//com.carrotsearch.randomizedtesting.ThreadLeakControl$$Lambda$86/0x0000000100143040.run(Unknown Source)
>    [junit4]   2>         at java.base@11.0.4/java.lang.Thread.run(Thread.java:834)
>    [junit4]   2> NOTE: test params are: codec=Asserting(Lucene84): {}, docValues:{}, maxPointsInLeafNode=998, maxMBSortInHeap=7.551428608565204, sim=Asserting(org.apache.lucene.search.similarities.AssertingSimilarity@a95bc78), locale=kam-KE, timezone=America/Inuvik
>    [junit4]   2> NOTE: Linux 4.4.0-112-generic amd64/Oracle Corporation 11.0.4 (64-bit)/cpus=4,threads=2,free=261574856,total=535822336
>    [junit4]   2> NOTE: All tests run in this JVM: [TestMultiDocValues, TestNoDeletionPolicy, TestBasicModelIF, TestDeterminizeLexicon, TestMultiTermsEnum, TestManyFields, TestScorerPerf, TestLucene60FieldInfoFormat, TestFSTs, TestTopDocsMerge, TestPhrasePrefixQuery, TestLongRangeFieldQueries, TestMultiCollector, TestStressNRT, TestSegmentTermDocs, TestField, TestTermVectorsReader, TestArrayUtil, TestRegexpRandom, FiniteStringsIteratorTest, TestPostingsOffsets, TestCloseableThreadLocal, TestWANDScorer, TestTerm, TestBoolean2ScorerSupplier, TestTransactionRollback, TestFastCompressionMode, TestDistributionSPL, TestSynonymQuery, TestParallelReaderEmptyIndex, TestPolygon, TestAnalyzerWrapper, TestSloppyMath, TestThreadedForceMerge, TestLucene50StoredFieldsFormatHighCompression, TestIndependenceStandardized, TestInfoStream, TestLucene50CompoundFormat, TestPagedBytes, TestSoftDeletesRetentionMergePolicy, TestTermScorer, TestOrdinalMap, TestWordlistLoader, TestIndexReaderClose, TestDocsWithFieldSet, TestMaxScoreAccumulator, TestAtomicUpdate, TestStressDeletes, TestBufferedIndexInput, TestConjunctions, TestMultiThreadTermVectors, TestOmitPositions, TestIntroSorter, TestBytesRefHash, TestDelegatingAnalyzerWrapper, TestRadixSelector, TestTotalHitCountCollector, TestPackedInts]
>    [junit4]   2> NOTE: download the large Jenkins line-docs file by running 'ant get-jenkins-line-docs' in the lucene directory.
>    [junit4]   2> NOTE: reproduce with: ant test  -Dtestcase=TestPackedInts -Dtests.seed=55D847340F5FA649 -Dtests.multiplier=2 -Dtests.nightly=true -Dtests.slow=true -Dtests.linedocsfile=/home/jenkins/jenkins-slave/workspace/Lucene-Solr-NightlyTests-master/test-data/enwiki.random.lines.txt -Dtests.locale=kam-KE -Dtests.timezone=America/Inuvik -Dtests.asserts=true -Dtests.file.encoding=ISO-8859-1
>    [junit4] ERROR   0.00s J0 | TestPackedInts (suite) <<<
>    [junit4]    > Throwable #1: java.lang.Exception: Suite timeout exceeded (>= 7200000 msec).
>    [junit4]    >        at __randomizedtesting.SeedInfo.seed([55D847340F5FA649]:0)
>    [junit4] Completed [385/526 (1!)] on J0 in 7223.20s, 16 tests, 2 errors <<< FAILURES!
>
> [...truncated 67772 lines...]
>
> ---------------------------------------------------------------------
> To unsubscribe, e-mail: [hidden email]
> For additional commands, e-mail: [hidden email]

---------------------------------------------------------------------
To unsubscribe, e-mail: [hidden email]
For additional commands, e-mail: [hidden email]