Re: [JENKINS] Lucene-Solr-SOLR-13661-Linux (64bit/jdk-13) - Build # 42 - Still Unstable!

classic Classic list List threaded Threaded
1 message Options
Reply | Threaded
Open this post in threaded view
|

Re: [JENKINS] Lucene-Solr-SOLR-13661-Linux (64bit/jdk-13) - Build # 42 - Still Unstable!

Ishan Chattopadhyaya
@Noble Paul നോബിള്‍ नोब्ळ् is looking into the failures.

On Mon, Oct 21, 2019 at 12:06 AM Policeman Jenkins Server
<[hidden email]> wrote:

>
> Build: https://jenkins.thetaphi.de/job/Lucene-Solr-SOLR-13661-Linux/42/
> Java: 64bit/jdk-13 -XX:-UseCompressedOops -XX:+UseConcMarkSweepGC
>
> 186 tests failed.
> FAILED:  junit.framework.TestSuite.org.apache.solr.analysis.TestFoldingMultitermExtrasQuery
>
> Error Message:
>
>
> Stack Trace:
> java.lang.NullPointerException
>         at __randomizedtesting.SeedInfo.seed([DF0D21B696B9CF5B]:0)
>         at org.apache.solr.pkg.PackageAPI.<init>(PackageAPI.java:75)
>         at org.apache.solr.pkg.PackageLoader.<init>(PackageLoader.java:60)
>         at org.apache.solr.core.CoreContainer.load(CoreContainer.java:743)
>         at org.apache.solr.util.TestHarness.<init>(TestHarness.java:180)
>         at org.apache.solr.util.TestHarness.<init>(TestHarness.java:143)
>         at org.apache.solr.util.TestHarness.<init>(TestHarness.java:149)
>         at org.apache.solr.util.TestHarness.<init>(TestHarness.java:112)
>         at org.apache.solr.SolrTestCaseJ4.createCore(SolrTestCaseJ4.java:796)
>         at org.apache.solr.SolrTestCaseJ4.initCore(SolrTestCaseJ4.java:786)
>         at org.apache.solr.SolrTestCaseJ4.initCore(SolrTestCaseJ4.java:647)
>         at org.apache.solr.analysis.TestFoldingMultitermExtrasQuery.beforeTests(TestFoldingMultitermExtrasQuery.java:37)
>         at java.base/jdk.internal.reflect.NativeMethodAccessorImpl.invoke0(Native Method)
>         at java.base/jdk.internal.reflect.NativeMethodAccessorImpl.invoke(NativeMethodAccessorImpl.java:62)
>         at java.base/jdk.internal.reflect.DelegatingMethodAccessorImpl.invoke(DelegatingMethodAccessorImpl.java:43)
>         at java.base/java.lang.reflect.Method.invoke(Method.java:567)
>         at com.carrotsearch.randomizedtesting.RandomizedRunner.invoke(RandomizedRunner.java:1750)
>         at com.carrotsearch.randomizedtesting.RandomizedRunner$6.evaluate(RandomizedRunner.java:878)
>         at com.carrotsearch.randomizedtesting.RandomizedRunner$7.evaluate(RandomizedRunner.java:894)
>         at com.carrotsearch.randomizedtesting.rules.StatementAdapter.evaluate(StatementAdapter.java:36)
>         at com.carrotsearch.randomizedtesting.rules.SystemPropertiesRestoreRule$1.evaluate(SystemPropertiesRestoreRule.java:57)
>         at org.apache.lucene.util.AbstractBeforeAfterRule$1.evaluate(AbstractBeforeAfterRule.java:45)
>         at com.carrotsearch.randomizedtesting.rules.StatementAdapter.evaluate(StatementAdapter.java:36)
>         at org.apache.lucene.util.TestRuleStoreClassName$1.evaluate(TestRuleStoreClassName.java:41)
>         at com.carrotsearch.randomizedtesting.rules.NoShadowingOrOverridesOnMethodsRule$1.evaluate(NoShadowingOrOverridesOnMethodsRule.java:40)
>         at com.carrotsearch.randomizedtesting.rules.NoShadowingOrOverridesOnMethodsRule$1.evaluate(NoShadowingOrOverridesOnMethodsRule.java:40)
>         at com.carrotsearch.randomizedtesting.rules.StatementAdapter.evaluate(StatementAdapter.java:36)
>         at com.carrotsearch.randomizedtesting.rules.StatementAdapter.evaluate(StatementAdapter.java:36)
>         at org.apache.lucene.util.TestRuleAssertionsRequired$1.evaluate(TestRuleAssertionsRequired.java:53)
>         at org.apache.lucene.util.TestRuleMarkFailure$1.evaluate(TestRuleMarkFailure.java:47)
>         at org.apache.lucene.util.TestRuleIgnoreAfterMaxFailures$1.evaluate(TestRuleIgnoreAfterMaxFailures.java:64)
>         at org.apache.lucene.util.TestRuleIgnoreTestSuites$1.evaluate(TestRuleIgnoreTestSuites.java:54)
>         at com.carrotsearch.randomizedtesting.rules.StatementAdapter.evaluate(StatementAdapter.java:36)
>         at com.carrotsearch.randomizedtesting.ThreadLeakControl$StatementRunner.run(ThreadLeakControl.java:368)
>         at java.base/java.lang.Thread.run(Thread.java:830)
>
>
> FAILED:  junit.framework.TestSuite.org.apache.solr.analysis.TestFoldingMultitermExtrasQuery
>
> Error Message:
> ObjectTracker found 4 object(s) that were not released!!! [InternalHttpClient, Http2SolrClient, Http2SolrClient, InternalHttpClient] org.apache.solr.common.util.ObjectReleaseTracker$ObjectTrackerException: org.apache.http.impl.client.InternalHttpClient  at org.apache.solr.common.util.ObjectReleaseTracker.track(ObjectReleaseTracker.java:42)  at org.apache.solr.client.solrj.impl.HttpClientUtil.createClient(HttpClientUtil.java:322)  at org.apache.solr.update.UpdateShardHandler.<init>(UpdateShardHandler.java:123)  at org.apache.solr.core.CoreContainer.load(CoreContainer.java:633)  at org.apache.solr.util.TestHarness.<init>(TestHarness.java:180)  at org.apache.solr.util.TestHarness.<init>(TestHarness.java:143)  at org.apache.solr.util.TestHarness.<init>(TestHarness.java:149)  at org.apache.solr.util.TestHarness.<init>(TestHarness.java:112)  at org.apache.solr.SolrTestCaseJ4.createCore(SolrTestCaseJ4.java:796)  at org.apache.solr.SolrTestCaseJ4.initCore(SolrTestCaseJ4.java:786)  at org.apache.solr.SolrTestCaseJ4.initCore(SolrTestCaseJ4.java:647)  at org.apache.solr.analysis.TestFoldingMultitermExtrasQuery.beforeTests(TestFoldingMultitermExtrasQuery.java:37)  at java.base/jdk.internal.reflect.NativeMethodAccessorImpl.invoke0(Native Method)  at java.base/jdk.internal.reflect.NativeMethodAccessorImpl.invoke(NativeMethodAccessorImpl.java:62)  at java.base/jdk.internal.reflect.DelegatingMethodAccessorImpl.invoke(DelegatingMethodAccessorImpl.java:43)  at java.base/java.lang.reflect.Method.invoke(Method.java:567)  at com.carrotsearch.randomizedtesting.RandomizedRunner.invoke(RandomizedRunner.java:1750)  at com.carrotsearch.randomizedtesting.RandomizedRunner$6.evaluate(RandomizedRunner.java:878)  at com.carrotsearch.randomizedtesting.RandomizedRunner$7.evaluate(RandomizedRunner.java:894)  at com.carrotsearch.randomizedtesting.rules.StatementAdapter.evaluate(StatementAdapter.java:36)  at com.carrotsearch.randomizedtesting.rules.SystemPropertiesRestoreRule$1.evaluate(SystemPropertiesRestoreRule.java:57)  at org.apache.lucene.util.AbstractBeforeAfterRule$1.evaluate(AbstractBeforeAfterRule.java:45)  at com.carrotsearch.randomizedtesting.rules.StatementAdapter.evaluate(StatementAdapter.java:36)  at org.apache.lucene.util.TestRuleStoreClassName$1.evaluate(TestRuleStoreClassName.java:41)  at com.carrotsearch.randomizedtesting.rules.NoShadowingOrOverridesOnMethodsRule$1.evaluate(NoShadowingOrOverridesOnMethodsRule.java:40)  at com.carrotsearch.randomizedtesting.rules.NoShadowingOrOverridesOnMethodsRule$1.evaluate(NoShadowingOrOverridesOnMethodsRule.java:40)  at com.carrotsearch.randomizedtesting.rules.StatementAdapter.evaluate(StatementAdapter.java:36)  at com.carrotsearch.randomizedtesting.rules.StatementAdapter.evaluate(StatementAdapter.java:36)  at org.apache.lucene.util.TestRuleAssertionsRequired$1.evaluate(TestRuleAssertionsRequired.java:53)  at org.apache.lucene.util.TestRuleMarkFailure$1.evaluate(TestRuleMarkFailure.java:47)  at org.apache.lucene.util.TestRuleIgnoreAfterMaxFailures$1.evaluate(TestRuleIgnoreAfterMaxFailures.java:64)  at org.apache.lucene.util.TestRuleIgnoreTestSuites$1.evaluate(TestRuleIgnoreTestSuites.java:54)  at com.carrotsearch.randomizedtesting.rules.StatementAdapter.evaluate(StatementAdapter.java:36)  at com.carrotsearch.randomizedtesting.ThreadLeakControl$StatementRunner.run(ThreadLeakControl.java:368)  at java.base/java.lang.Thread.run(Thread.java:830)  org.apache.solr.common.util.ObjectReleaseTracker$ObjectTrackerException: org.apache.solr.client.solrj.impl.Http2SolrClient  at org.apache.solr.common.util.ObjectReleaseTracker.track(ObjectReleaseTracker.java:42)  at org.apache.solr.client.solrj.impl.Http2SolrClient.<init>(Http2SolrClient.java:159)  at org.apache.solr.client.solrj.impl.Http2SolrClient$Builder.build(Http2SolrClient.java:833)  at org.apache.solr.handler.component.HttpShardHandlerFactory.init(HttpShardHandlerFactory.java:321)  at org.apache.solr.handler.component.ShardHandlerFactory.newInstance(ShardHandlerFactory.java:51)  at org.apache.solr.core.CoreContainer.load(CoreContainer.java:627)  at org.apache.solr.util.TestHarness.<init>(TestHarness.java:180)  at org.apache.solr.util.TestHarness.<init>(TestHarness.java:143)  at org.apache.solr.util.TestHarness.<init>(TestHarness.java:149)  at org.apache.solr.util.TestHarness.<init>(TestHarness.java:112)  at org.apache.solr.SolrTestCaseJ4.createCore(SolrTestCaseJ4.java:796)  at org.apache.solr.SolrTestCaseJ4.initCore(SolrTestCaseJ4.java:786)  at org.apache.solr.SolrTestCaseJ4.initCore(SolrTestCaseJ4.java:647)  at org.apache.solr.analysis.TestFoldingMultitermExtrasQuery.beforeTests(TestFoldingMultitermExtrasQuery.java:37)  at java.base/jdk.internal.reflect.NativeMethodAccessorImpl.invoke0(Native Method)  at java.base/jdk.internal.reflect.NativeMethodAccessorImpl.invoke(NativeMethodAccessorImpl.java:62)  at java.base/jdk.internal.reflect.DelegatingMethodAccessorImpl.invoke(DelegatingMethodAccessorImpl.java:43)  at java.base/java.lang.reflect.Method.invoke(Method.java:567)  at com.carrotsearch.randomizedtesting.RandomizedRunner.invoke(RandomizedRunner.java:1750)  at com.carrotsearch.randomizedtesting.RandomizedRunner$6.evaluate(RandomizedRunner.java:878)  at com.carrotsearch.randomizedtesting.RandomizedRunner$7.evaluate(RandomizedRunner.java:894)  at com.carrotsearch.randomizedtesting.rules.StatementAdapter.evaluate(StatementAdapter.java:36)  at com.carrotsearch.randomizedtesting.rules.SystemPropertiesRestoreRule$1.evaluate(SystemPropertiesRestoreRule.java:57)  at org.apache.lucene.util.AbstractBeforeAfterRule$1.evaluate(AbstractBeforeAfterRule.java:45)  at com.carrotsearch.randomizedtesting.rules.StatementAdapter.evaluate(StatementAdapter.java:36)  at org.apache.lucene.util.TestRuleStoreClassName$1.evaluate(TestRuleStoreClassName.java:41)  at com.carrotsearch.randomizedtesting.rules.NoShadowingOrOverridesOnMethodsRule$1.evaluate(NoShadowingOrOverridesOnMethodsRule.java:40)  at com.carrotsearch.randomizedtesting.rules.NoShadowingOrOverridesOnMethodsRule$1.evaluate(NoShadowingOrOverridesOnMethodsRule.java:40)  at com.carrotsearch.randomizedtesting.rules.StatementAdapter.evaluate(StatementAdapter.java:36)  at com.carrotsearch.randomizedtesting.rules.StatementAdapter.evaluate(StatementAdapter.java:36)  at org.apache.lucene.util.TestRuleAssertionsRequired$1.evaluate(TestRuleAssertionsRequired.java:53)  at org.apache.lucene.util.TestRuleMarkFailure$1.evaluate(TestRuleMarkFailure.java:47)  at org.apache.lucene.util.TestRuleIgnoreAfterMaxFailures$1.evaluate(TestRuleIgnoreAfterMaxFailures.java:64)  at org.apache.lucene.util.TestRuleIgnoreTestSuites$1.evaluate(TestRuleIgnoreTestSuites.java:54)  at com.carrotsearch.randomizedtesting.rules.StatementAdapter.evaluate(StatementAdapter.java:36)  at com.carrotsearch.randomizedtesting.ThreadLeakControl$StatementRunner.run(ThreadLeakControl.java:368)  at java.base/java.lang.Thread.run(Thread.java:830)  org.apache.solr.common.util.ObjectReleaseTracker$ObjectTrackerException: org.apache.solr.client.solrj.impl.Http2SolrClient  at org.apache.solr.common.util.ObjectReleaseTracker.track(ObjectReleaseTracker.java:42)  at org.apache.solr.client.solrj.impl.Http2SolrClient.<init>(Http2SolrClient.java:159)  at org.apache.solr.client.solrj.impl.Http2SolrClient$Builder.build(Http2SolrClient.java:833)  at org.apache.solr.update.UpdateShardHandler.<init>(UpdateShardHandler.java:133)  at org.apache.solr.core.CoreContainer.load(CoreContainer.java:633)  at org.apache.solr.util.TestHarness.<init>(TestHarness.java:180)  at org.apache.solr.util.TestHarness.<init>(TestHarness.java:143)  at org.apache.solr.util.TestHarness.<init>(TestHarness.java:149)  at org.apache.solr.util.TestHarness.<init>(TestHarness.java:112)  at org.apache.solr.SolrTestCaseJ4.createCore(SolrTestCaseJ4.java:796)  at org.apache.solr.SolrTestCaseJ4.initCore(SolrTestCaseJ4.java:786)  at org.apache.solr.SolrTestCaseJ4.initCore(SolrTestCaseJ4.java:647)  at org.apache.solr.analysis.TestFoldingMultitermExtrasQuery.beforeTests(TestFoldingMultitermExtrasQuery.java:37)  at java.base/jdk.internal.reflect.NativeMethodAccessorImpl.invoke0(Native Method)  at java.base/jdk.internal.reflect.NativeMethodAccessorImpl.invoke(NativeMethodAccessorImpl.java:62)  at java.base/jdk.internal.reflect.DelegatingMethodAccessorImpl.invoke(DelegatingMethodAccessorImpl.java:43)  at java.base/java.lang.reflect.Method.invoke(Method.java:567)  at com.carrotsearch.randomizedtesting.RandomizedRunner.invoke(RandomizedRunner.java:1750)  at com.carrotsearch.randomizedtesting.RandomizedRunner$6.evaluate(RandomizedRunner.java:878)  at com.carrotsearch.randomizedtesting.RandomizedRunner$7.evaluate(RandomizedRunner.java:894)  at com.carrotsearch.randomizedtesting.rules.StatementAdapter.evaluate(StatementAdapter.java:36)  at com.carrotsearch.randomizedtesting.rules.SystemPropertiesRestoreRule$1.evaluate(SystemPropertiesRestoreRule.java:57)  at org.apache.lucene.util.AbstractBeforeAfterRule$1.evaluate(AbstractBeforeAfterRule.java:45)  at com.carrotsearch.randomizedtesting.rules.StatementAdapter.evaluate(StatementAdapter.java:36)  at org.apache.lucene.util.TestRuleStoreClassName$1.evaluate(TestRuleStoreClassName.java:41)  at com.carrotsearch.randomizedtesting.rules.NoShadowingOrOverridesOnMethodsRule$1.evaluate(NoShadowingOrOverridesOnMethodsRule.java:40)  at com.carrotsearch.randomizedtesting.rules.NoShadowingOrOverridesOnMethodsRule$1.evaluate(NoShadowingOrOverridesOnMethodsRule.java:40)  at com.carrotsearch.randomizedtesting.rules.StatementAdapter.evaluate(StatementAdapter.java:36)  at com.carrotsearch.randomizedtesting.rules.StatementAdapter.evaluate(StatementAdapter.java:36)  at org.apache.lucene.util.TestRuleAssertionsRequired$1.evaluate(TestRuleAssertionsRequired.java:53)  at org.apache.lucene.util.TestRuleMarkFailure$1.evaluate(TestRuleMarkFailure.java:47)  at org.apache.lucene.util.TestRuleIgnoreAfterMaxFailures$1.evaluate(TestRuleIgnoreAfterMaxFailures.java:64)  at org.apache.lucene.util.TestRuleIgnoreTestSuites$1.evaluate(TestRuleIgnoreTestSuites.java:54)  at com.carrotsearch.randomizedtesting.rules.StatementAdapter.evaluate(StatementAdapter.java:36)  at com.carrotsearch.randomizedtesting.ThreadLeakControl$StatementRunner.run(ThreadLeakControl.java:368)  at java.base/java.lang.Thread.run(Thread.java:830)  org.apache.solr.common.util.ObjectReleaseTracker$ObjectTrackerException: org.apache.http.impl.client.InternalHttpClient  at org.apache.solr.common.util.ObjectReleaseTracker.track(ObjectReleaseTracker.java:42)  at org.apache.solr.client.solrj.impl.HttpClientUtil.createClient(HttpClientUtil.java:322)  at org.apache.solr.update.UpdateShardHandler.<init>(UpdateShardHandler.java:124)  at org.apache.solr.core.CoreContainer.load(CoreContainer.java:633)  at org.apache.solr.util.TestHarness.<init>(TestHarness.java:180)  at org.apache.solr.util.TestHarness.<init>(TestHarness.java:143)  at org.apache.solr.util.TestHarness.<init>(TestHarness.java:149)  at org.apache.solr.util.TestHarness.<init>(TestHarness.java:112)  at org.apache.solr.SolrTestCaseJ4.createCore(SolrTestCaseJ4.java:796)  at org.apache.solr.SolrTestCaseJ4.initCore(SolrTestCaseJ4.java:786)  at org.apache.solr.SolrTestCaseJ4.initCore(SolrTestCaseJ4.java:647)  at org.apache.solr.analysis.TestFoldingMultitermExtrasQuery.beforeTests(TestFoldingMultitermExtrasQuery.java:37)  at java.base/jdk.internal.reflect.NativeMethodAccessorImpl.invoke0(Native Method)  at java.base/jdk.internal.reflect.NativeMethodAccessorImpl.invoke(NativeMethodAccessorImpl.java:62)  at java.base/jdk.internal.reflect.DelegatingMethodAccessorImpl.invoke(DelegatingMethodAccessorImpl.java:43)  at java.base/java.lang.reflect.Method.invoke(Method.java:567)  at com.carrotsearch.randomizedtesting.RandomizedRunner.invoke(RandomizedRunner.java:1750)  at com.carrotsearch.randomizedtesting.RandomizedRunner$6.evaluate(RandomizedRunner.java:878)  at com.carrotsearch.randomizedtesting.RandomizedRunner$7.evaluate(RandomizedRunner.java:894)  at com.carrotsearch.randomizedtesting.rules.StatementAdapter.evaluate(StatementAdapter.java:36)  at com.carrotsearch.randomizedtesting.rules.SystemPropertiesRestoreRule$1.evaluate(SystemPropertiesRestoreRule.java:57)  at org.apache.lucene.util.AbstractBeforeAfterRule$1.evaluate(AbstractBeforeAfterRule.java:45)  at com.carrotsearch.randomizedtesting.rules.StatementAdapter.evaluate(StatementAdapter.java:36)  at org.apache.lucene.util.TestRuleStoreClassName$1.evaluate(TestRuleStoreClassName.java:41)  at com.carrotsearch.randomizedtesting.rules.NoShadowingOrOverridesOnMethodsRule$1.evaluate(NoShadowingOrOverridesOnMethodsRule.java:40)  at com.carrotsearch.randomizedtesting.rules.NoShadowingOrOverridesOnMethodsRule$1.evaluate(NoShadowingOrOverridesOnMethodsRule.java:40)  at com.carrotsearch.randomizedtesting.rules.StatementAdapter.evaluate(StatementAdapter.java:36)  at com.carrotsearch.randomizedtesting.rules.StatementAdapter.evaluate(StatementAdapter.java:36)  at org.apache.lucene.util.TestRuleAssertionsRequired$1.evaluate(TestRuleAssertionsRequired.java:53)  at org.apache.lucene.util.TestRuleMarkFailure$1.evaluate(TestRuleMarkFailure.java:47)  at org.apache.lucene.util.TestRuleIgnoreAfterMaxFailures$1.evaluate(TestRuleIgnoreAfterMaxFailures.java:64)  at org.apache.lucene.util.TestRuleIgnoreTestSuites$1.evaluate(TestRuleIgnoreTestSuites.java:54)  at com.carrotsearch.randomizedtesting.rules.StatementAdapter.evaluate(StatementAdapter.java:36)  at com.carrotsearch.randomizedtesting.ThreadLeakControl$StatementRunner.run(ThreadLeakControl.java:368)  at java.base/java.lang.Thread.run(Thread.java:830)   expected null, but was:<ObjectTracker found 4 object(s) that were not released!!! [InternalHttpClient, Http2SolrClient, Http2SolrClient, InternalHttpClient] org.apache.solr.common.util.ObjectReleaseTracker$ObjectTrackerException: org.apache.http.impl.client.InternalHttpClient  at org.apache.solr.common.util.ObjectReleaseTracker.track(ObjectReleaseTracker.java:42)  at org.apache.solr.client.solrj.impl.HttpClientUtil.createClient(HttpClientUtil.java:322)  at org.apache.solr.update.UpdateShardHandler.<init>(UpdateShardHandler.java:123)  at org.apache.solr.core.CoreContainer.load(CoreContainer.java:633)  at org.apache.solr.util.TestHarness.<init>(TestHarness.java:180)  at org.apache.solr.util.TestHarness.<init>(TestHarness.java:143)  at org.apache.solr.util.TestHarness.<init>(TestHarness.java:149)  at org.apache.solr.util.TestHarness.<init>(TestHarness.java:112)  at org.apache.solr.SolrTestCaseJ4.createCore(SolrTestCaseJ4.java:796)  at org.apache.solr.SolrTestCaseJ4.initCore(SolrTestCaseJ4.java:786)  at org.apache.solr.SolrTestCaseJ4.initCore(SolrTestCaseJ4.java:647)  at org.apache.solr.analysis.TestFoldingMultitermExtrasQuery.beforeTests(TestFoldingMultitermExtrasQuery.java:37)  at java.base/jdk.internal.reflect.NativeMethodAccessorImpl.invoke0(Native Method)  at java.base/jdk.internal.reflect.NativeMethodAccessorImpl.invoke(NativeMethodAccessorImpl.java:62)  at java.base/jdk.internal.reflect.DelegatingMethodAccessorImpl.invoke(DelegatingMethodAccessorImpl.java:43)  at java.base/java.lang.reflect.Method.invoke(Method.java:567)  at com.carrotsearch.randomizedtesting.RandomizedRunner.invoke(RandomizedRunner.java:1750)  at com.carrotsearch.randomizedtesting.RandomizedRunner$6.evaluate(RandomizedRunner.java:878)  at com.carrotsearch.randomizedtesting.RandomizedRunner$7.evaluate(RandomizedRunner.java:894)  at com.carrotsearch.randomizedtesting.rules.StatementAdapter.evaluate(StatementAdapter.java:36)  at com.carrotsearch.randomizedtesting.rules.SystemPropertiesRestoreRule$1.evaluate(SystemPropertiesRestoreRule.java:57)  at org.apache.lucene.util.AbstractBeforeAfterRule$1.evaluate(AbstractBeforeAfterRule.java:45)  at com.carrotsearch.randomizedtesting.rules.StatementAdapter.evaluate(StatementAdapter.java:36)  at org.apache.lucene.util.TestRuleStoreClassName$1.evaluate(TestRuleStoreClassName.java:41)  at com.carrotsearch.randomizedtesting.rules.NoShadowingOrOverridesOnMethodsRule$1.evaluate(NoShadowingOrOverridesOnMethodsRule.java:40)  at com.carrotsearch.randomizedtesting.rules.NoShadowingOrOverridesOnMethodsRule$1.evaluate(NoShadowingOrOverridesOnMethodsRule.java:40)  at com.carrotsearch.randomizedtesting.rules.StatementAdapter.evaluate(StatementAdapter.java:36)  at com.carrotsearch.randomizedtesting.rules.StatementAdapter.evaluate(StatementAdapter.java:36)  at org.apache.lucene.util.TestRuleAssertionsRequired$1.evaluate(TestRuleAssertionsRequired.java:53)  at org.apache.lucene.util.TestRuleMarkFailure$1.evaluate(TestRuleMarkFailure.java:47)  at org.apache.lucene.util.TestRuleIgnoreAfterMaxFailures$1.evaluate(TestRuleIgnoreAfterMaxFailures.java:64)  at org.apache.lucene.util.TestRuleIgnoreTestSuites$1.evaluate(TestRuleIgnoreTestSuites.java:54)  at com.carrotsearch.randomizedtesting.rules.StatementAdapter.evaluate(StatementAdapter.java:36)  at com.carrotsearch.randomizedtesting.ThreadLeakControl$StatementRunner.run(ThreadLeakControl.java:368)  at java.base/java.lang.Thread.run(Thread.java:830)  org.apache.solr.common.util.ObjectReleaseTracker$ObjectTrackerException: org.apache.solr.client.solrj.impl.Http2SolrClient  at org.apache.solr.common.util.ObjectReleaseTracker.track(ObjectReleaseTracker.java:42)  at org.apache.solr.client.solrj.impl.Http2SolrClient.<init>(Http2SolrClient.java:159)  at org.apache.solr.client.solrj.impl.Http2SolrClient$Builder.build(Http2SolrClient.java:833)  at org.apache.solr.handler.component.HttpShardHandlerFactory.init(HttpShardHandlerFactory.java:321)  at org.apache.solr.handler.component.ShardHandlerFactory.newInstance(ShardHandlerFactory.java:51)  at org.apache.solr.core.CoreContainer.load(CoreContainer.java:627)  at org.apache.solr.util.TestHarness.<init>(TestHarness.java:180)  at org.apache.solr.util.TestHarness.<init>(TestHarness.java:143)  at org.apache.solr.util.TestHarness.<init>(TestHarness.java:149)  at org.apache.solr.util.TestHarness.<init>(TestHarness.java:112)  at org.apache.solr.SolrTestCaseJ4.createCore(SolrTestCaseJ4.java:796)  at org.apache.solr.SolrTestCaseJ4.initCore(SolrTestCaseJ4.java:786)  at org.apache.solr.SolrTestCaseJ4.initCore(SolrTestCaseJ4.java:647)  at org.apache.solr.analysis.TestFoldingMultitermExtrasQuery.beforeTests(TestFoldingMultitermExtrasQuery.java:37)  at java.base/jdk.internal.reflect.NativeMethodAccessorImpl.invoke0(Native Method)  at java.base/jdk.internal.reflect.NativeMethodAccessorImpl.invoke(NativeMethodAccessorImpl.java:62)  at java.base/jdk.internal.reflect.DelegatingMethodAccessorImpl.invoke(DelegatingMethodAccessorImpl.java:43)  at java.base/java.lang.reflect.Method.invoke(Method.java:567)  at com.carrotsearch.randomizedtesting.RandomizedRunner.invoke(RandomizedRunner.java:1750)  at com.carrotsearch.randomizedtesting.RandomizedRunner$6.evaluate(RandomizedRunner.java:878)  at com.carrotsearch.randomizedtesting.RandomizedRunner$7.evaluate(RandomizedRunner.java:894)  at com.carrotsearch.randomizedtesting.rules.StatementAdapter.evaluate(StatementAdapter.java:36)  at com.carrotsearch.randomizedtesting.rules.SystemPropertiesRestoreRule$1.evaluate(SystemPropertiesRestoreRule.java:57)  at org.apache.lucene.util.AbstractBeforeAfterRule$1.evaluate(AbstractBeforeAfterRule.java:45)  at com.carrotsearch.randomizedtesting.rules.StatementAdapter.evaluate(StatementAdapter.java:36)  at org.apache.lucene.util.TestRuleStoreClassName$1.evaluate(TestRuleStoreClassName.java:41)  at com.carrotsearch.randomizedtesting.rules.NoShadowingOrOverridesOnMethodsRule$1.evaluate(NoShadowingOrOverridesOnMethodsRule.java:40)  at com.carrotsearch.randomizedtesting.rules.NoShadowingOrOverridesOnMethodsRule$1.evaluate(NoShadowingOrOverridesOnMethodsRule.java:40)  at com.carrotsearch.randomizedtesting.rules.StatementAdapter.evaluate(StatementAdapter.java:36)  at com.carrotsearch.randomizedtesting.rules.StatementAdapter.evaluate(StatementAdapter.java:36)  at org.apache.lucene.util.TestRuleAssertionsRequired$1.evaluate(TestRuleAssertionsRequired.java:53)  at org.apache.lucene.util.TestRuleMarkFailure$1.evaluate(TestRuleMarkFailure.java:47)  at org.apache.lucene.util.TestRuleIgnoreAfterMaxFailures$1.evaluate(TestRuleIgnoreAfterMaxFailures.java:64)  at org.apache.lucene.util.TestRuleIgnoreTestSuites$1.evaluate(TestRuleIgnoreTestSuites.java:54)  at com.carrotsearch.randomizedtesting.rules.StatementAdapter.evaluate(StatementAdapter.java:36)  at com.carrotsearch.randomizedtesting.ThreadLeakControl$StatementRunner.run(ThreadLeakControl.java:368)  at java.base/java.lang.Thread.run(Thread.java:830)  org.apache.solr.common.util.ObjectReleaseTracker$ObjectTrackerException: org.apache.solr.client.solrj.impl.Http2SolrClient  at org.apache.solr.common.util.ObjectReleaseTracker.track(ObjectReleaseTracker.java:42)  at org.apache.solr.client.solrj.impl.Http2SolrClient.<init>(Http2SolrClient.java:159)  at org.apache.solr.client.solrj.impl.Http2SolrClient$Builder.build(Http2SolrClient.java:833)  at org.apache.solr.update.UpdateShardHandler.<init>(UpdateShardHandler.java:133)  at org.apache.solr.core.CoreContainer.load(CoreContainer.java:633)  at org.apache.solr.util.TestHarness.<init>(TestHarness.java:180)  at org.apache.solr.util.TestHarness.<init>(TestHarness.java:143)  at org.apache.solr.util.TestHarness.<init>(TestHarness.java:149)  at org.apache.solr.util.TestHarness.<init>(TestHarness.java:112)  at org.apache.solr.SolrTestCaseJ4.createCore(SolrTestCaseJ4.java:796)  at org.apache.solr.SolrTestCaseJ4.initCore(SolrTestCaseJ4.java:786)  at org.apache.solr.SolrTestCaseJ4.initCore(SolrTestCaseJ4.java:647)  at org.apache.solr.analysis.TestFoldingMultitermExtrasQuery.beforeTests(TestFoldingMultitermExtrasQuery.java:37)  at java.base/jdk.internal.reflect.NativeMethodAccessorImpl.invoke0(Native Method)  at java.base/jdk.internal.reflect.NativeMethodAccessorImpl.invoke(NativeMethodAccessorImpl.java:62)  at java.base/jdk.internal.reflect.DelegatingMethodAccessorImpl.invoke(DelegatingMethodAccessorImpl.java:43)  at java.base/java.lang.reflect.Method.invoke(Method.java:567)  at com.carrotsearch.randomizedtesting.RandomizedRunner.invoke(RandomizedRunner.java:1750)  at com.carrotsearch.randomizedtesting.RandomizedRunner$6.evaluate(RandomizedRunner.java:878)  at com.carrotsearch.randomizedtesting.RandomizedRunner$7.evaluate(RandomizedRunner.java:894)  at com.carrotsearch.randomizedtesting.rules.StatementAdapter.evaluate(StatementAdapter.java:36)  at com.carrotsearch.randomizedtesting.rules.SystemPropertiesRestoreRule$1.evaluate(SystemPropertiesRestoreRule.java:57)  at org.apache.lucene.util.AbstractBeforeAfterRule$1.evaluate(AbstractBeforeAfterRule.java:45)  at com.carrotsearch.randomizedtesting.rules.StatementAdapter.evaluate(StatementAdapter.java:36)  at org.apache.lucene.util.TestRuleStoreClassName$1.evaluate(TestRuleStoreClassName.java:41)  at com.carrotsearch.randomizedtesting.rules.NoShadowingOrOverridesOnMethodsRule$1.evaluate(NoShadowingOrOverridesOnMethodsRule.java:40)  at com.carrotsearch.randomizedtesting.rules.NoShadowingOrOverridesOnMethodsRule$1.evaluate(NoShadowingOrOverridesOnMethodsRule.java:40)  at com.carrotsearch.randomizedtesting.rules.StatementAdapter.evaluate(StatementAdapter.java:36)  at com.carrotsearch.randomizedtesting.rules.StatementAdapter.evaluate(StatementAdapter.java:36)  at org.apache.lucene.util.TestRuleAssertionsRequired$1.evaluate(TestRuleAssertionsRequired.java:53)  at org.apache.lucene.util.TestRuleMarkFailure$1.evaluate(TestRuleMarkFailure.java:47)  at org.apache.lucene.util.TestRuleIgnoreAfterMaxFailures$1.evaluate(TestRuleIgnoreAfterMaxFailures.java:64)  at org.apache.lucene.util.TestRuleIgnoreTestSuites$1.evaluate(TestRuleIgnoreTestSuites.java:54)  at com.carrotsearch.randomizedtesting.rules.StatementAdapter.evaluate(StatementAdapter.java:36)  at com.carrotsearch.randomizedtesting.ThreadLeakControl$StatementRunner.run(ThreadLeakControl.java:368)  at java.base/java.lang.Thread.run(Thread.java:830)  org.apache.solr.common.util.ObjectReleaseTracker$ObjectTrackerException: org.apache.http.impl.client.InternalHttpClient  at org.apache.solr.common.util.ObjectReleaseTracker.track(ObjectReleaseTracker.java:42)  at org.apache.solr.client.solrj.impl.HttpClientUtil.createClient(HttpClientUtil.java:322)  at org.apache.solr.update.UpdateShardHandler.<init>(UpdateShardHandler.java:124)  at org.apache.solr.core.CoreContainer.load(CoreContainer.java:633)  at org.apache.solr.util.TestHarness.<init>(TestHarness.java:180)  at org.apache.solr.util.TestHarness.<init>(TestHarness.java:143)  at org.apache.solr.util.TestHarness.<init>(TestHarness.java:149)  at org.apache.solr.util.TestHarness.<init>(TestHarness.java:112)  at org.apache.solr.SolrTestCaseJ4.createCore(SolrTestCaseJ4.java:796)  at org.apache.solr.SolrTestCaseJ4.initCore(SolrTestCaseJ4.java:786)  at org.apache.solr.SolrTestCaseJ4.initCore(SolrTestCaseJ4.java:647)  at org.apache.solr.analysis.TestFoldingMultitermExtrasQuery.beforeTests(TestFoldingMultitermExtrasQuery.java:37)  at java.base/jdk.internal.reflect.NativeMethodAccessorImpl.invoke0(Native Method)  at java.base/jdk.internal.reflect.NativeMethodAccessorImpl.invoke(NativeMethodAccessorImpl.java:62)  at java.base/jdk.internal.reflect.DelegatingMethodAccessorImpl.invoke(DelegatingMethodAccessorImpl.java:43)  at java.base/java.lang.reflect.Method.invoke(Method.java:567)  at com.carrotsearch.randomizedtesting.RandomizedRunner.invoke(RandomizedRunner.java:1750)  at com.carrotsearch.randomizedtesting.RandomizedRunner$6.evaluate(RandomizedRunner.java:878)  at com.carrotsearch.randomizedtesting.RandomizedRunner$7.evaluate(RandomizedRunner.java:894)  at com.carrotsearch.randomizedtesting.rules.StatementAdapter.evaluate(StatementAdapter.java:36)  at com.carrotsearch.randomizedtesting.rules.SystemPropertiesRestoreRule$1.evaluate(SystemPropertiesRestoreRule.java:57)  at org.apache.lucene.util.AbstractBeforeAfterRule$1.evaluate(AbstractBeforeAfterRule.java:45)  at com.carrotsearch.randomizedtesting.rules.StatementAdapter.evaluate(StatementAdapter.java:36)  at org.apache.lucene.util.TestRuleStoreClassName$1.evaluate(TestRuleStoreClassName.java:41)  at com.carrotsearch.randomizedtesting.rules.NoShadowingOrOverridesOnMethodsRule$1.evaluate(NoShadowingOrOverridesOnMethodsRule.java:40)  at com.carrotsearch.randomizedtesting.rules.NoShadowingOrOverridesOnMethodsRule$1.evaluate(NoShadowingOrOverridesOnMethodsRule.java:40)  at com.carrotsearch.randomizedtesting.rules.StatementAdapter.evaluate(StatementAdapter.java:36)  at com.carrotsearch.randomizedtesting.rules.StatementAdapter.evaluate(StatementAdapter.java:36)  at org.apache.lucene.util.TestRuleAssertionsRequired$1.evaluate(TestRuleAssertionsRequired.java:53)  at org.apache.lucene.util.TestRuleMarkFailure$1.evaluate(TestRuleMarkFailure.java:47)  at org.apache.lucene.util.TestRuleIgnoreAfterMaxFailures$1.evaluate(TestRuleIgnoreAfterMaxFailures.java:64)  at org.apache.lucene.util.TestRuleIgnoreTestSuites$1.evaluate(TestRuleIgnoreTestSuites.java:54)  at com.carrotsearch.randomizedtesting.rules.StatementAdapter.evaluate(StatementAdapter.java:36)  at com.carrotsearch.randomizedtesting.ThreadLeakControl$StatementRunner.run(ThreadLeakControl.java:368)  at java.base/java.lang.Thread.run(Thread.java:830)  >
>
> Stack Trace:
> java.lang.AssertionError: ObjectTracker found 4 object(s) that were not released!!! [InternalHttpClient, Http2SolrClient, Http2SolrClient, InternalHttpClient]
> org.apache.solr.common.util.ObjectReleaseTracker$ObjectTrackerException: org.apache.http.impl.client.InternalHttpClient
>         at org.apache.solr.common.util.ObjectReleaseTracker.track(ObjectReleaseTracker.java:42)
>         at org.apache.solr.client.solrj.impl.HttpClientUtil.createClient(HttpClientUtil.java:322)
>         at org.apache.solr.update.UpdateShardHandler.<init>(UpdateShardHandler.java:123)
>         at org.apache.solr.core.CoreContainer.load(CoreContainer.java:633)
>         at org.apache.solr.util.TestHarness.<init>(TestHarness.java:180)
>         at org.apache.solr.util.TestHarness.<init>(TestHarness.java:143)
>         at org.apache.solr.util.TestHarness.<init>(TestHarness.java:149)
>         at org.apache.solr.util.TestHarness.<init>(TestHarness.java:112)
>         at org.apache.solr.SolrTestCaseJ4.createCore(SolrTestCaseJ4.java:796)
>         at org.apache.solr.SolrTestCaseJ4.initCore(SolrTestCaseJ4.java:786)
>         at org.apache.solr.SolrTestCaseJ4.initCore(SolrTestCaseJ4.java:647)
>         at org.apache.solr.analysis.TestFoldingMultitermExtrasQuery.beforeTests(TestFoldingMultitermExtrasQuery.java:37)
>         at java.base/jdk.internal.reflect.NativeMethodAccessorImpl.invoke0(Native Method)
>         at java.base/jdk.internal.reflect.NativeMethodAccessorImpl.invoke(NativeMethodAccessorImpl.java:62)
>         at java.base/jdk.internal.reflect.DelegatingMethodAccessorImpl.invoke(DelegatingMethodAccessorImpl.java:43)
>         at java.base/java.lang.reflect.Method.invoke(Method.java:567)
>         at com.carrotsearch.randomizedtesting.RandomizedRunner.invoke(RandomizedRunner.java:1750)
>         at com.carrotsearch.randomizedtesting.RandomizedRunner$6.evaluate(RandomizedRunner.java:878)
>         at com.carrotsearch.randomizedtesting.RandomizedRunner$7.evaluate(RandomizedRunner.java:894)
>         at com.carrotsearch.randomizedtesting.rules.StatementAdapter.evaluate(StatementAdapter.java:36)
>         at com.carrotsearch.randomizedtesting.rules.SystemPropertiesRestoreRule$1.evaluate(SystemPropertiesRestoreRule.java:57)
>         at org.apache.lucene.util.AbstractBeforeAfterRule$1.evaluate(AbstractBeforeAfterRule.java:45)
>         at com.carrotsearch.randomizedtesting.rules.StatementAdapter.evaluate(StatementAdapter.java:36)
>         at org.apache.lucene.util.TestRuleStoreClassName$1.evaluate(TestRuleStoreClassName.java:41)
>         at com.carrotsearch.randomizedtesting.rules.NoShadowingOrOverridesOnMethodsRule$1.evaluate(NoShadowingOrOverridesOnMethodsRule.java:40)
>         at com.carrotsearch.randomizedtesting.rules.NoShadowingOrOverridesOnMethodsRule$1.evaluate(NoShadowingOrOverridesOnMethodsRule.java:40)
>         at com.carrotsearch.randomizedtesting.rules.StatementAdapter.evaluate(StatementAdapter.java:36)
>         at com.carrotsearch.randomizedtesting.rules.StatementAdapter.evaluate(StatementAdapter.java:36)
>         at org.apache.lucene.util.TestRuleAssertionsRequired$1.evaluate(TestRuleAssertionsRequired.java:53)
>         at org.apache.lucene.util.TestRuleMarkFailure$1.evaluate(TestRuleMarkFailure.java:47)
>         at org.apache.lucene.util.TestRuleIgnoreAfterMaxFailures$1.evaluate(TestRuleIgnoreAfterMaxFailures.java:64)
>         at org.apache.lucene.util.TestRuleIgnoreTestSuites$1.evaluate(TestRuleIgnoreTestSuites.java:54)
>         at com.carrotsearch.randomizedtesting.rules.StatementAdapter.evaluate(StatementAdapter.java:36)
>         at com.carrotsearch.randomizedtesting.ThreadLeakControl$StatementRunner.run(ThreadLeakControl.java:368)
>         at java.base/java.lang.Thread.run(Thread.java:830)
>
> org.apache.solr.common.util.ObjectReleaseTracker$ObjectTrackerException: org.apache.solr.client.solrj.impl.Http2SolrClient
>         at org.apache.solr.common.util.ObjectReleaseTracker.track(ObjectReleaseTracker.java:42)
>         at org.apache.solr.client.solrj.impl.Http2SolrClient.<init>(Http2SolrClient.java:159)
>         at org.apache.solr.client.solrj.impl.Http2SolrClient$Builder.build(Http2SolrClient.java:833)
>         at org.apache.solr.handler.component.HttpShardHandlerFactory.init(HttpShardHandlerFactory.java:321)
>         at org.apache.solr.handler.component.ShardHandlerFactory.newInstance(ShardHandlerFactory.java:51)
>         at org.apache.solr.core.CoreContainer.load(CoreContainer.java:627)
>         at org.apache.solr.util.TestHarness.<init>(TestHarness.java:180)
>         at org.apache.solr.util.TestHarness.<init>(TestHarness.java:143)
>         at org.apache.solr.util.TestHarness.<init>(TestHarness.java:149)
>         at org.apache.solr.util.TestHarness.<init>(TestHarness.java:112)
>         at org.apache.solr.SolrTestCaseJ4.createCore(SolrTestCaseJ4.java:796)
>         at org.apache.solr.SolrTestCaseJ4.initCore(SolrTestCaseJ4.java:786)
>         at org.apache.solr.SolrTestCaseJ4.initCore(SolrTestCaseJ4.java:647)
>         at org.apache.solr.analysis.TestFoldingMultitermExtrasQuery.beforeTests(TestFoldingMultitermExtrasQuery.java:37)
>         at java.base/jdk.internal.reflect.NativeMethodAccessorImpl.invoke0(Native Method)
>         at java.base/jdk.internal.reflect.NativeMethodAccessorImpl.invoke(NativeMethodAccessorImpl.java:62)
>         at java.base/jdk.internal.reflect.DelegatingMethodAccessorImpl.invoke(DelegatingMethodAccessorImpl.java:43)
>         at java.base/java.lang.reflect.Method.invoke(Method.java:567)
>         at com.carrotsearch.randomizedtesting.RandomizedRunner.invoke(RandomizedRunner.java:1750)
>         at com.carrotsearch.randomizedtesting.RandomizedRunner$6.evaluate(RandomizedRunner.java:878)
>         at com.carrotsearch.randomizedtesting.RandomizedRunner$7.evaluate(RandomizedRunner.java:894)
>         at com.carrotsearch.randomizedtesting.rules.StatementAdapter.evaluate(StatementAdapter.java:36)
>         at com.carrotsearch.randomizedtesting.rules.SystemPropertiesRestoreRule$1.evaluate(SystemPropertiesRestoreRule.java:57)
>         at org.apache.lucene.util.AbstractBeforeAfterRule$1.evaluate(AbstractBeforeAfterRule.java:45)
>         at com.carrotsearch.randomizedtesting.rules.StatementAdapter.evaluate(StatementAdapter.java:36)
>         at org.apache.lucene.util.TestRuleStoreClassName$1.evaluate(TestRuleStoreClassName.java:41)
>         at com.carrotsearch.randomizedtesting.rules.NoShadowingOrOverridesOnMethodsRule$1.evaluate(NoShadowingOrOverridesOnMethodsRule.java:40)
>         at com.carrotsearch.randomizedtesting.rules.NoShadowingOrOverridesOnMethodsRule$1.evaluate(NoShadowingOrOverridesOnMethodsRule.java:40)
>         at com.carrotsearch.randomizedtesting.rules.StatementAdapter.evaluate(StatementAdapter.java:36)
>         at com.carrotsearch.randomizedtesting.rules.StatementAdapter.evaluate(StatementAdapter.java:36)
>         at org.apache.lucene.util.TestRuleAssertionsRequired$1.evaluate(TestRuleAssertionsRequired.java:53)
>         at org.apache.lucene.util.TestRuleMarkFailure$1.evaluate(TestRuleMarkFailure.java:47)
>         at org.apache.lucene.util.TestRuleIgnoreAfterMaxFailures$1.evaluate(TestRuleIgnoreAfterMaxFailures.java:64)
>         at org.apache.lucene.util.TestRuleIgnoreTestSuites$1.evaluate(TestRuleIgnoreTestSuites.java:54)
>         at com.carrotsearch.randomizedtesting.rules.StatementAdapter.evaluate(StatementAdapter.java:36)
>         at com.carrotsearch.randomizedtesting.ThreadLeakControl$StatementRunner.run(ThreadLeakControl.java:368)
>         at java.base/java.lang.Thread.run(Thread.java:830)
>
> org.apache.solr.common.util.ObjectReleaseTracker$ObjectTrackerException: org.apache.solr.client.solrj.impl.Http2SolrClient
>         at org.apache.solr.common.util.ObjectReleaseTracker.track(ObjectReleaseTracker.java:42)
>         at org.apache.solr.client.solrj.impl.Http2SolrClient.<init>(Http2SolrClient.java:159)
>         at org.apache.solr.client.solrj.impl.Http2SolrClient$Builder.build(Http2SolrClient.java:833)
>         at org.apache.solr.update.UpdateShardHandler.<init>(UpdateShardHandler.java:133)
>         at org.apache.solr.core.CoreContainer.load(CoreContainer.java:633)
>         at org.apache.solr.util.TestHarness.<init>(TestHarness.java:180)
>         at org.apache.solr.util.TestHarness.<init>(TestHarness.java:143)
>         at org.apache.solr.util.TestHarness.<init>(TestHarness.java:149)
>         at org.apache.solr.util.TestHarness.<init>(TestHarness.java:112)
>         at org.apache.solr.SolrTestCaseJ4.createCore(SolrTestCaseJ4.java:796)
>         at org.apache.solr.SolrTestCaseJ4.initCore(SolrTestCaseJ4.java:786)
>         at org.apache.solr.SolrTestCaseJ4.initCore(SolrTestCaseJ4.java:647)
>         at org.apache.solr.analysis.TestFoldingMultitermExtrasQuery.beforeTests(TestFoldingMultitermExtrasQuery.java:37)
>         at java.base/jdk.internal.reflect.NativeMethodAccessorImpl.invoke0(Native Method)
>         at java.base/jdk.internal.reflect.NativeMethodAccessorImpl.invoke(NativeMethodAccessorImpl.java:62)
>         at java.base/jdk.internal.reflect.DelegatingMethodAccessorImpl.invoke(DelegatingMethodAccessorImpl.java:43)
>         at java.base/java.lang.reflect.Method.invoke(Method.java:567)
>         at com.carrotsearch.randomizedtesting.RandomizedRunner.invoke(RandomizedRunner.java:1750)
>         at com.carrotsearch.randomizedtesting.RandomizedRunner$6.evaluate(RandomizedRunner.java:878)
>         at com.carrotsearch.randomizedtesting.RandomizedRunner$7.evaluate(RandomizedRunner.java:894)
>         at com.carrotsearch.randomizedtesting.rules.StatementAdapter.evaluate(StatementAdapter.java:36)
>         at com.carrotsearch.randomizedtesting.rules.SystemPropertiesRestoreRule$1.evaluate(SystemPropertiesRestoreRule.java:57)
>         at org.apache.lucene.util.AbstractBeforeAfterRule$1.evaluate(AbstractBeforeAfterRule.java:45)
>         at com.carrotsearch.randomizedtesting.rules.StatementAdapter.evaluate(StatementAdapter.java:36)
>         at org.apache.lucene.util.TestRuleStoreClassName$1.evaluate(TestRuleStoreClassName.java:41)
>         at com.carrotsearch.randomizedtesting.rules.NoShadowingOrOverridesOnMethodsRule$1.evaluate(NoShadowingOrOverridesOnMethodsRule.java:40)
>         at com.carrotsearch.randomizedtesting.rules.NoShadowingOrOverridesOnMethodsRule$1.evaluate(NoShadowingOrOverridesOnMethodsRule.java:40)
>         at com.carrotsearch.randomizedtesting.rules.StatementAdapter.evaluate(StatementAdapter.java:36)
>         at com.carrotsearch.randomizedtesting.rules.StatementAdapter.evaluate(StatementAdapter.java:36)
>         at org.apache.lucene.util.TestRuleAssertionsRequired$1.evaluate(TestRuleAssertionsRequired.java:53)
>         at org.apache.lucene.util.TestRuleMarkFailure$1.evaluate(TestRuleMarkFailure.java:47)
>         at org.apache.lucene.util.TestRuleIgnoreAfterMaxFailures$1.evaluate(TestRuleIgnoreAfterMaxFailures.java:64)
>         at org.apache.lucene.util.TestRuleIgnoreTestSuites$1.evaluate(TestRuleIgnoreTestSuites.java:54)
>         at com.carrotsearch.randomizedtesting.rules.StatementAdapter.evaluate(StatementAdapter.java:36)
>         at com.carrotsearch.randomizedtesting.ThreadLeakControl$StatementRunner.run(ThreadLeakControl.java:368)
>         at java.base/java.lang.Thread.run(Thread.java:830)
>
> org.apache.solr.common.util.ObjectReleaseTracker$ObjectTrackerException: org.apache.http.impl.client.InternalHttpClient
>         at org.apache.solr.common.util.ObjectReleaseTracker.track(ObjectReleaseTracker.java:42)
>         at org.apache.solr.client.solrj.impl.HttpClientUtil.createClient(HttpClientUtil.java:322)
>         at org.apache.solr.update.UpdateShardHandler.<init>(UpdateShardHandler.java:124)
>         at org.apache.solr.core.CoreContainer.load(CoreContainer.java:633)
>         at org.apache.solr.util.TestHarness.<init>(TestHarness.java:180)
>         at org.apache.solr.util.TestHarness.<init>(TestHarness.java:143)
>         at org.apache.solr.util.TestHarness.<init>(TestHarness.java:149)
>         at org.apache.solr.util.TestHarness.<init>(TestHarness.java:112)
>         at org.apache.solr.SolrTestCaseJ4.createCore(SolrTestCaseJ4.java:796)
>         at org.apache.solr.SolrTestCaseJ4.initCore(SolrTestCaseJ4.java:786)
>         at org.apache.solr.SolrTestCaseJ4.initCore(SolrTestCaseJ4.java:647)
>         at org.apache.solr.analysis.TestFoldingMultitermExtrasQuery.beforeTests(TestFoldingMultitermExtrasQuery.java:37)
>         at java.base/jdk.internal.reflect.NativeMethodAccessorImpl.invoke0(Native Method)
>         at java.base/jdk.internal.reflect.NativeMethodAccessorImpl.invoke(NativeMethodAccessorImpl.java:62)
>         at java.base/jdk.internal.reflect.DelegatingMethodAccessorImpl.invoke(DelegatingMethodAccessorImpl.java:43)
>         at java.base/java.lang.reflect.Method.invoke(Method.java:567)
>         at com.carrotsearch.randomizedtesting.RandomizedRunner.invoke(RandomizedRunner.java:1750)
>         at com.carrotsearch.randomizedtesting.RandomizedRunner$6.evaluate(RandomizedRunner.java:878)
>         at com.carrotsearch.randomizedtesting.RandomizedRunner$7.evaluate(RandomizedRunner.java:894)
>         at com.carrotsearch.randomizedtesting.rules.StatementAdapter.evaluate(StatementAdapter.java:36)
>         at com.carrotsearch.randomizedtesting.rules.SystemPropertiesRestoreRule$1.evaluate(SystemPropertiesRestoreRule.java:57)
>         at org.apache.lucene.util.AbstractBeforeAfterRule$1.evaluate(AbstractBeforeAfterRule.java:45)
>         at com.carrotsearch.randomizedtesting.rules.StatementAdapter.evaluate(StatementAdapter.java:36)
>         at org.apache.lucene.util.TestRuleStoreClassName$1.evaluate(TestRuleStoreClassName.java:41)
>         at com.carrotsearch.randomizedtesting.rules.NoShadowingOrOverridesOnMethodsRule$1.evaluate(NoShadowingOrOverridesOnMethodsRule.java:40)
>         at com.carrotsearch.randomizedtesting.rules.NoShadowingOrOverridesOnMethodsRule$1.evaluate(NoShadowingOrOverridesOnMethodsRule.java:40)
>         at com.carrotsearch.randomizedtesting.rules.StatementAdapter.evaluate(StatementAdapter.java:36)
>         at com.carrotsearch.randomizedtesting.rules.StatementAdapter.evaluate(StatementAdapter.java:36)
>         at org.apache.lucene.util.TestRuleAssertionsRequired$1.evaluate(TestRuleAssertionsRequired.java:53)
>         at org.apache.lucene.util.TestRuleMarkFailure$1.evaluate(TestRuleMarkFailure.java:47)
>         at org.apache.lucene.util.TestRuleIgnoreAfterMaxFailures$1.evaluate(TestRuleIgnoreAfterMaxFailures.java:64)
>         at org.apache.lucene.util.TestRuleIgnoreTestSuites$1.evaluate(TestRuleIgnoreTestSuites.java:54)
>         at com.carrotsearch.randomizedtesting.rules.StatementAdapter.evaluate(StatementAdapter.java:36)
>         at com.carrotsearch.randomizedtesting.ThreadLeakControl$StatementRunner.run(ThreadLeakControl.java:368)
>         at java.base/java.lang.Thread.run(Thread.java:830)
>
>  expected null, but was:<ObjectTracker found 4 object(s) that were not released!!! [InternalHttpClient, Http2SolrClient, Http2SolrClient, InternalHttpClient]
> org.apache.solr.common.util.ObjectReleaseTracker$ObjectTrackerException: org.apache.http.impl.client.InternalHttpClient
>         at org.apache.solr.common.util.ObjectReleaseTracker.track(ObjectReleaseTracker.java:42)
>         at org.apache.solr.client.solrj.impl.HttpClientUtil.createClient(HttpClientUtil.java:322)
>         at org.apache.solr.update.UpdateShardHandler.<init>(UpdateShardHandler.java:123)
>         at org.apache.solr.core.CoreContainer.load(CoreContainer.java:633)
>         at org.apache.solr.util.TestHarness.<init>(TestHarness.java:180)
>         at org.apache.solr.util.TestHarness.<init>(TestHarness.java:143)
>         at org.apache.solr.util.TestHarness.<init>(TestHarness.java:149)
>         at org.apache.solr.util.TestHarness.<init>(TestHarness.java:112)
>         at org.apache.solr.SolrTestCaseJ4.createCore(SolrTestCaseJ4.java:796)
>         at org.apache.solr.SolrTestCaseJ4.initCore(SolrTestCaseJ4.java:786)
>         at org.apache.solr.SolrTestCaseJ4.initCore(SolrTestCaseJ4.java:647)
>         at org.apache.solr.analysis.TestFoldingMultitermExtrasQuery.beforeTests(TestFoldingMultitermExtrasQuery.java:37)
>         at java.base/jdk.internal.reflect.NativeMethodAccessorImpl.invoke0(Native Method)
>         at java.base/jdk.internal.reflect.NativeMethodAccessorImpl.invoke(NativeMethodAccessorImpl.java:62)
>         at java.base/jdk.internal.reflect.DelegatingMethodAccessorImpl.invoke(DelegatingMethodAccessorImpl.java:43)
>         at java.base/java.lang.reflect.Method.invoke(Method.java:567)
>         at com.carrotsearch.randomizedtesting.RandomizedRunner.invoke(RandomizedRunner.java:1750)
>         at com.carrotsearch.randomizedtesting.RandomizedRunner$6.evaluate(RandomizedRunner.java:878)
>         at com.carrotsearch.randomizedtesting.RandomizedRunner$7.evaluate(RandomizedRunner.java:894)
>         at com.carrotsearch.randomizedtesting.rules.StatementAdapter.evaluate(StatementAdapter.java:36)
>         at com.carrotsearch.randomizedtesting.rules.SystemPropertiesRestoreRule$1.evaluate(SystemPropertiesRestoreRule.java:57)
>         at org.apache.lucene.util.AbstractBeforeAfterRule$1.evaluate(AbstractBeforeAfterRule.java:45)
>         at com.carrotsearch.randomizedtesting.rules.StatementAdapter.evaluate(StatementAdapter.java:36)
>         at org.apache.lucene.util.TestRuleStoreClassName$1.evaluate(TestRuleStoreClassName.java:41)
>         at com.carrotsearch.randomizedtesting.rules.NoShadowingOrOverridesOnMethodsRule$1.evaluate(NoShadowingOrOverridesOnMethodsRule.java:40)
>         at com.carrotsearch.randomizedtesting.rules.NoShadowingOrOverridesOnMethodsRule$1.evaluate(NoShadowingOrOverridesOnMethodsRule.java:40)
>         at com.carrotsearch.randomizedtesting.rules.StatementAdapter.evaluate(StatementAdapter.java:36)
>         at com.carrotsearch.randomizedtesting.rules.StatementAdapter.evaluate(StatementAdapter.java:36)
>         at org.apache.lucene.util.TestRuleAssertionsRequired$1.evaluate(TestRuleAssertionsRequired.java:53)
>         at org.apache.lucene.util.TestRuleMarkFailure$1.evaluate(TestRuleMarkFailure.java:47)
>         at org.apache.lucene.util.TestRuleIgnoreAfterMaxFailures$1.evaluate(TestRuleIgnoreAfterMaxFailures.java:64)
>         at org.apache.lucene.util.TestRuleIgnoreTestSuites$1.evaluate(TestRuleIgnoreTestSuites.java:54)
>         at com.carrotsearch.randomizedtesting.rules.StatementAdapter.evaluate(StatementAdapter.java:36)
>         at com.carrotsearch.randomizedtesting.ThreadLeakControl$StatementRunner.run(ThreadLeakControl.java:368)
>         at java.base/java.lang.Thread.run(Thread.java:830)
>
> org.apache.solr.common.util.ObjectReleaseTracker$ObjectTrackerException: org.apache.solr.client.solrj.impl.Http2SolrClient
>         at org.apache.solr.common.util.ObjectReleaseTracker.track(ObjectReleaseTracker.java:42)
>         at org.apache.solr.client.solrj.impl.Http2SolrClient.<init>(Http2SolrClient.java:159)
>         at org.apache.solr.client.solrj.impl.Http2SolrClient$Builder.build(Http2SolrClient.java:833)
>         at org.apache.solr.handler.component.HttpShardHandlerFactory.init(HttpShardHandlerFactory.java:321)
>         at org.apache.solr.handler.component.ShardHandlerFactory.newInstance(ShardHandlerFactory.java:51)
>         at org.apache.solr.core.CoreContainer.load(CoreContainer.java:627)
>         at org.apache.solr.util.TestHarness.<init>(TestHarness.java:180)
>         at org.apache.solr.util.TestHarness.<init>(TestHarness.java:143)
>         at org.apache.solr.util.TestHarness.<init>(TestHarness.java:149)
>         at org.apache.solr.util.TestHarness.<init>(TestHarness.java:112)
>         at org.apache.solr.SolrTestCaseJ4.createCore(SolrTestCaseJ4.java:796)
>         at org.apache.solr.SolrTestCaseJ4.initCore(SolrTestCaseJ4.java:786)
>         at org.apache.solr.SolrTestCaseJ4.initCore(SolrTestCaseJ4.java:647)
>         at org.apache.solr.analysis.TestFoldingMultitermExtrasQuery.beforeTests(TestFoldingMultitermExtrasQuery.java:37)
>         at java.base/jdk.internal.reflect.NativeMethodAccessorImpl.invoke0(Native Method)
>         at java.base/jdk.internal.reflect.NativeMethodAccessorImpl.invoke(NativeMethodAccessorImpl.java:62)
>         at java.base/jdk.internal.reflect.DelegatingMethodAccessorImpl.invoke(DelegatingMethodAccessorImpl.java:43)
>         at java.base/java.lang.reflect.Method.invoke(Method.java:567)
>         at com.carrotsearch.randomizedtesting.RandomizedRunner.invoke(RandomizedRunner.java:1750)
>         at com.carrotsearch.randomizedtesting.RandomizedRunner$6.evaluate(RandomizedRunner.java:878)
>         at com.carrotsearch.randomizedtesting.RandomizedRunner$7.evaluate(RandomizedRunner.java:894)
>         at com.carrotsearch.randomizedtesting.rules.StatementAdapter.evaluate(StatementAdapter.java:36)
>         at com.carrotsearch.randomizedtesting.rules.SystemPropertiesRestoreRule$1.evaluate(SystemPropertiesRestoreRule.java:57)
>         at org.apache.lucene.util.AbstractBeforeAfterRule$1.evaluate(AbstractBeforeAfterRule.java:45)
>         at com.carrotsearch.randomizedtesting.rules.StatementAdapter.evaluate(StatementAdapter.java:36)
>         at org.apache.lucene.util.TestRuleStoreClassName$1.evaluate(TestRuleStoreClassName.java:41)
>         at com.carrotsearch.randomizedtesting.rules.NoShadowingOrOverridesOnMethodsRule$1.evaluate(NoShadowingOrOverridesOnMethodsRule.java:40)
>         at com.carrotsearch.randomizedtesting.rules.NoShadowingOrOverridesOnMethodsRule$1.evaluate(NoShadowingOrOverridesOnMethodsRule.java:40)
>         at com.carrotsearch.randomizedtesting.rules.StatementAdapter.evaluate(StatementAdapter.java:36)
>         at com.carrotsearch.randomizedtesting.rules.StatementAdapter.evaluate(StatementAdapter.java:36)
>         at org.apache.lucene.util.TestRuleAssertionsRequired$1.evaluate(TestRuleAssertionsRequired.java:53)
>         at org.apache.lucene.util.TestRuleMarkFailure$1.evaluate(TestRuleMarkFailure.java:47)
>         at org.apache.lucene.util.TestRuleIgnoreAfterMaxFailures$1.evaluate(TestRuleIgnoreAfterMaxFailures.java:64)
>         at org.apache.lucene.util.TestRuleIgnoreTestSuites$1.evaluate(TestRuleIgnoreTestSuites.java:54)
>         at com.carrotsearch.randomizedtesting.rules.StatementAdapter.evaluate(StatementAdapter.java:36)
>         at com.carrotsearch.randomizedtesting.ThreadLeakControl$StatementRunner.run(ThreadLeakControl.java:368)
>         at java.base/java.lang.Thread.run(Thread.java:830)
>
> org.apache.solr.common.util.ObjectReleaseTracker$ObjectTrackerException: org.apache.solr.client.solrj.impl.Http2SolrClient
>         at org.apache.solr.common.util.ObjectReleaseTracker.track(ObjectReleaseTracker.java:42)
>         at org.apache.solr.client.solrj.impl.Http2SolrClient.<init>(Http2SolrClient.java:159)
>         at org.apache.solr.client.solrj.impl.Http2SolrClient$Builder.build(Http2SolrClient.java:833)
>         at org.apache.solr.update.UpdateShardHandler.<init>(UpdateShardHandler.java:133)
>         at org.apache.solr.core.CoreContainer.load(CoreContainer.java:633)
>         at org.apache.solr.util.TestHarness.<init>(TestHarness.java:180)
>         at org.apache.solr.util.TestHarness.<init>(TestHarness.java:143)
>         at org.apache.solr.util.TestHarness.<init>(TestHarness.java:149)
>         at org.apache.solr.util.TestHarness.<init>(TestHarness.java:112)
>         at org.apache.solr.SolrTestCaseJ4.createCore(SolrTestCaseJ4.java:796)
>         at org.apache.solr.SolrTestCaseJ4.initCore(SolrTestCaseJ4.java:786)
>         at org.apache.solr.SolrTestCaseJ4.initCore(SolrTestCaseJ4.java:647)
>         at org.apache.solr.analysis.TestFoldingMultitermExtrasQuery.beforeTests(TestFoldingMultitermExtrasQuery.java:37)
>         at java.base/jdk.internal.reflect.NativeMethodAccessorImpl.invoke0(Native Method)
>         at java.base/jdk.internal.reflect.NativeMethodAccessorImpl.invoke(NativeMethodAccessorImpl.java:62)
>         at java.base/jdk.internal.reflect.DelegatingMethodAccessorImpl.invoke(DelegatingMethodAccessorImpl.java:43)
>         at java.base/java.lang.reflect.Method.invoke(Method.java:567)
>         at com.carrotsearch.randomizedtesting.RandomizedRunner.invoke(RandomizedRunner.java:1750)
>         at com.carrotsearch.randomizedtesting.RandomizedRunner$6.evaluate(RandomizedRunner.java:878)
>         at com.carrotsearch.randomizedtesting.RandomizedRunner$7.evaluate(RandomizedRunner.java:894)
>         at com.carrotsearch.randomizedtesting.rules.StatementAdapter.evaluate(StatementAdapter.java:36)
>         at com.carrotsearch.randomizedtesting.rules.SystemPropertiesRestoreRule$1.evaluate(SystemPropertiesRestoreRule.java:57)
>         at org.apache.lucene.util.AbstractBeforeAfterRule$1.evaluate(AbstractBeforeAfterRule.java:45)
>         at com.carrotsearch.randomizedtesting.rules.StatementAdapter.evaluate(StatementAdapter.java:36)
>         at org.apache.lucene.util.TestRuleStoreClassName$1.evaluate(TestRuleStoreClassName.java:41)
>         at com.carrotsearch.randomizedtesting.rules.NoShadowingOrOverridesOnMethodsRule$1.evaluate(NoShadowingOrOverridesOnMethodsRule.java:40)
>         at com.carrotsearch.randomizedtesting.rules.NoShadowingOrOverridesOnMethodsRule$1.evaluate(NoShadowingOrOverridesOnMethodsRule.java:40)
>         at com.carrotsearch.randomizedtesting.rules.StatementAdapter.evaluate(StatementAdapter.java:36)
>         at com.carrotsearch.randomizedtesting.rules.StatementAdapter.evaluate(StatementAdapter.java:36)
>         at org.apache.lucene.util.TestRuleAssertionsRequired$1.evaluate(TestRuleAssertionsRequired.java:53)
>         at org.apache.lucene.util.TestRuleMarkFailure$1.evaluate(TestRuleMarkFailure.java:47)
>         at org.apache.lucene.util.TestRuleIgnoreAfterMaxFailures$1.evaluate(TestRuleIgnoreAfterMaxFailures.java:64)
>         at org.apache.lucene.util.TestRuleIgnoreTestSuites$1.evaluate(TestRuleIgnoreTestSuites.java:54)
>         at com.carrotsearch.randomizedtesting.rules.StatementAdapter.evaluate(StatementAdapter.java:36)
>         at com.carrotsearch.randomizedtesting.ThreadLeakControl$StatementRunner.run(ThreadLeakControl.java:368)
>         at java.base/java.lang.Thread.run(Thread.java:830)
>
> org.apache.solr.common.util.ObjectReleaseTracker$ObjectTrackerException: org.apache.http.impl.client.InternalHttpClient
>         at org.apache.solr.common.util.ObjectReleaseTracker.track(ObjectReleaseTracker.java:42)
>         at org.apache.solr.client.solrj.impl.HttpClientUtil.createClient(HttpClientUtil.java:322)
>         at org.apache.solr.update.UpdateShardHandler.<init>(UpdateShardHandler.java:124)
>         at org.apache.solr.core.CoreContainer.load(CoreContainer.java:633)
>         at org.apache.solr.util.TestHarness.<init>(TestHarness.java:180)
>         at org.apache.solr.util.TestHarness.<init>(TestHarness.java:143)
>         at org.apache.solr.util.TestHarness.<init>(TestHarness.java:149)
>         at org.apache.solr.util.TestHarness.<init>(TestHarness.java:112)
>         at org.apache.solr.SolrTestCaseJ4.createCore(SolrTestCaseJ4.java:796)
>         at org.apache.solr.SolrTestCaseJ4.initCore(SolrTestCaseJ4.java:786)
>         at org.apache.solr.SolrTestCaseJ4.initCore(SolrTestCaseJ4.java:647)
>         at org.apache.solr.analysis.TestFoldingMultitermExtrasQuery.beforeTests(TestFoldingMultitermExtrasQuery.java:37)
>         at java.base/jdk.internal.reflect.NativeMethodAccessorImpl.invoke0(Native Method)
>         at java.base/jdk.internal.reflect.NativeMethodAccessorImpl.invoke(NativeMethodAccessorImpl.java:62)
>         at java.base/jdk.internal.reflect.DelegatingMethodAccessorImpl.invoke(DelegatingMethodAccessorImpl.java:43)
>         at java.base/java.lang.reflect.Method.invoke(Method.java:567)
>         at com.carrotsearch.randomizedtesting.RandomizedRunner.invoke(RandomizedRunner.java:1750)
>         at com.carrotsearch.randomizedtesting.RandomizedRunner$6.evaluate(RandomizedRunner.java:878)
>         at com.carrotsearch.randomizedtesting.RandomizedRunner$7.evaluate(RandomizedRunner.java:894)
>         at com.carrotsearch.randomizedtesting.rules.StatementAdapter.evaluate(StatementAdapter.java:36)
>         at com.carrotsearch.randomizedtesting.rules.SystemPropertiesRestoreRule$1.evaluate(SystemPropertiesRestoreRule.java:57)
>         at org.apache.lucene.util.AbstractBeforeAfterRule$1.evaluate(AbstractBeforeAfterRule.java:45)
>         at com.carrotsearch.randomizedtesting.rules.StatementAdapter.evaluate(StatementAdapter.java:36)
>         at org.apache.lucene.util.TestRuleStoreClassName$1.evaluate(TestRuleStoreClassName.java:41)
>         at com.carrotsearch.randomizedtesting.rules.NoShadowingOrOverridesOnMethodsRule$1.evaluate(NoShadowingOrOverridesOnMethodsRule.java:40)
>         at com.carrotsearch.randomizedtesting.rules.NoShadowingOrOverridesOnMethodsRule$1.evaluate(NoShadowingOrOverridesOnMethodsRule.java:40)
>         at com.carrotsearch.randomizedtesting.rules.StatementAdapter.evaluate(StatementAdapter.java:36)
>         at com.carrotsearch.randomizedtesting.rules.StatementAdapter.evaluate(StatementAdapter.java:36)
>         at org.apache.lucene.util.TestRuleAssertionsRequired$1.evaluate(TestRuleAssertionsRequired.java:53)
>         at org.apache.lucene.util.TestRuleMarkFailure$1.evaluate(TestRuleMarkFailure.java:47)
>         at org.apache.lucene.util.TestRuleIgnoreAfterMaxFailures$1.evaluate(TestRuleIgnoreAfterMaxFailures.java:64)
>         at org.apache.lucene.util.TestRuleIgnoreTestSuites$1.evaluate(TestRuleIgnoreTestSuites.java:54)
>         at com.carrotsearch.randomizedtesting.rules.StatementAdapter.evaluate(StatementAdapter.java:36)
>         at com.carrotsearch.randomizedtesting.ThreadLeakControl$StatementRunner.run(ThreadLeakControl.java:368)
>         at java.base/java.lang.Thread.run(Thread.java:830)
>
> >
>         at __randomizedtesting.SeedInfo.seed([DF0D21B696B9CF5B]:0)
>         at org.junit.Assert.fail(Assert.java:88)
>         at org.junit.Assert.failNotNull(Assert.java:755)
>         at org.junit.Assert.assertNull(Assert.java:737)
>         at org.apache.solr.SolrTestCaseJ4.teardownTestCases(SolrTestCaseJ4.java:341)
>         at java.base/jdk.internal.reflect.NativeMethodAccessorImpl.invoke0(Native Method)
>         at java.base/jdk.internal.reflect.NativeMethodAccessorImpl.invoke(NativeMethodAccessorImpl.java:62)
>         at java.base/jdk.internal.reflect.DelegatingMethodAccessorImpl.invoke(DelegatingMethodAccessorImpl.java:43)
>         at java.base/java.lang.reflect.Method.invoke(Method.java:567)
>         at com.carrotsearch.randomizedtesting.RandomizedRunner.invoke(RandomizedRunner.java:1750)
>         at com.carrotsearch.randomizedtesting.RandomizedRunner$7.evaluate(RandomizedRunner.java:901)
>         at com.carrotsearch.randomizedtesting.rules.StatementAdapter.evaluate(StatementAdapter.java:36)
>         at com.carrotsearch.randomizedtesting.rules.SystemPropertiesRestoreRule$1.evaluate(SystemPropertiesRestoreRule.java:57)
>         at org.apache.lucene.util.AbstractBeforeAfterRule$1.evaluate(AbstractBeforeAfterRule.java:45)
>         at com.carrotsearch.randomizedtesting.rules.StatementAdapter.evaluate(StatementAdapter.java:36)
>         at org.apache.lucene.util.TestRuleStoreClassName$1.evaluate(TestRuleStoreClassName.java:41)
>         at com.carrotsearch.randomizedtesting.rules.NoShadowingOrOverridesOnMethodsRule$1.evaluate(NoShadowingOrOverridesOnMethodsRule.java:40)
>         at com.carrotsearch.randomizedtesting.rules.NoShadowingOrOverridesOnMethodsRule$1.evaluate(NoShadowingOrOverridesOnMethodsRule.java:40)
>         at com.carrotsearch.randomizedtesting.rules.StatementAdapter.evaluate(StatementAdapter.java:36)
>         at com.carrotsearch.randomizedtesting.rules.StatementAdapter.evaluate(StatementAdapter.java:36)
>         at org.apache.lucene.util.TestRuleAssertionsRequired$1.evaluate(TestRuleAssertionsRequired.java:53)
>         at org.apache.lucene.util.TestRuleMarkFailure$1.evaluate(TestRuleMarkFailure.java:47)
>         at org.apache.lucene.util.TestRuleIgnoreAfterMaxFailures$1.evaluate(TestRuleIgnoreAfterMaxFailures.java:64)
>         at org.apache.lucene.util.TestRuleIgnoreTestSuites$1.evaluate(TestRuleIgnoreTestSuites.java:54)
>         at com.carrotsearch.randomizedtesting.rules.StatementAdapter.evaluate(StatementAdapter.java:36)
>         at com.carrotsearch.randomizedtesting.ThreadLeakControl$StatementRunner.run(ThreadLeakControl.java:368)
>         at java.base/java.lang.Thread.run(Thread.java:830)
>
>
> FAILED:  junit.framework.TestSuite.org.apache.solr.analysis.TestFoldingMultitermExtrasQuery
>
> Error Message:
> 5 threads leaked from SUITE scope at org.apache.solr.analysis.TestFoldingMultitermExtrasQuery:     1) Thread[id=22, name=SolrRrdBackendFactory-7-thread-2, state=WAITING, group=TGRP-TestFoldingMultitermExtrasQuery]         at java.base@13/jdk.internal.misc.Unsafe.park(Native Method)         at java.base@13/java.util.concurrent.locks.LockSupport.park(LockSupport.java:194)         at java.base@13/java.util.concurrent.locks.AbstractQueuedSynchronizer$ConditionObject.await(AbstractQueuedSynchronizer.java:2081)         at java.base@13/java.util.concurrent.ScheduledThreadPoolExecutor$DelayedWorkQueue.take(ScheduledThreadPoolExecutor.java:1177)         at java.base@13/java.util.concurrent.ScheduledThreadPoolExecutor$DelayedWorkQueue.take(ScheduledThreadPoolExecutor.java:899)         at java.base@13/java.util.concurrent.ThreadPoolExecutor.getTask(ThreadPoolExecutor.java:1054)         at java.base@13/java.util.concurrent.ThreadPoolExecutor.runWorker(ThreadPoolExecutor.java:1114)         at java.base@13/java.util.concurrent.ThreadPoolExecutor$Worker.run(ThreadPoolExecutor.java:628)         at java.base@13/java.lang.Thread.run(Thread.java:830)    2) Thread[id=20, name=SolrRrdBackendFactory-7-thread-1, state=TIMED_WAITING, group=TGRP-TestFoldingMultitermExtrasQuery]         at java.base@13/jdk.internal.misc.Unsafe.park(Native Method)         at java.base@13/java.util.concurrent.locks.LockSupport.parkNanos(LockSupport.java:235)         at java.base@13/java.util.concurrent.locks.AbstractQueuedSynchronizer$ConditionObject.awaitNanos(AbstractQueuedSynchronizer.java:2123)         at java.base@13/java.util.concurrent.ScheduledThreadPoolExecutor$DelayedWorkQueue.take(ScheduledThreadPoolExecutor.java:1182)         at java.base@13/java.util.concurrent.ScheduledThreadPoolExecutor$DelayedWorkQueue.take(ScheduledThreadPoolExecutor.java:899)         at java.base@13/java.util.concurrent.ThreadPoolExecutor.getTask(ThreadPoolExecutor.java:1054)         at java.base@13/java.util.concurrent.ThreadPoolExecutor.runWorker(ThreadPoolExecutor.java:1114)         at java.base@13/java.util.concurrent.ThreadPoolExecutor$Worker.run(ThreadPoolExecutor.java:628)         at java.base@13/java.lang.Thread.run(Thread.java:830)    3) Thread[id=16, name=h2sc-3-thread-1, state=RUNNABLE, group=TGRP-TestFoldingMultitermExtrasQuery]         at java.base@13/sun.nio.ch.EPoll.wait(Native Method)         at java.base@13/sun.nio.ch.EPollSelectorImpl.doSelect(EPollSelectorImpl.java:120)         at java.base@13/sun.nio.ch.SelectorImpl.lockAndDoSelect(SelectorImpl.java:124)         at java.base@13/sun.nio.ch.SelectorImpl.select(SelectorImpl.java:141)         at app//org.eclipse.jetty.io.ManagedSelector$SelectorProducer.select(ManagedSelector.java:464)         at app//org.eclipse.jetty.io.ManagedSelector$SelectorProducer.produce(ManagedSelector.java:401)         at app//org.eclipse.jetty.util.thread.strategy.EatWhatYouKill.produceTask(EatWhatYouKill.java:357)         at app//org.eclipse.jetty.util.thread.strategy.EatWhatYouKill.doProduce(EatWhatYouKill.java:181)         at app//org.eclipse.jetty.util.thread.strategy.EatWhatYouKill.tryProduce(EatWhatYouKill.java:168)         at app//org.eclipse.jetty.util.thread.strategy.EatWhatYouKill.produce(EatWhatYouKill.java:132)         at app//org.eclipse.jetty.io.ManagedSelector$$Lambda$215/0x00007f39ca6fa058.run(Unknown Source)         at app//org.apache.solr.common.util.ExecutorUtil$MDCAwareThreadPoolExecutor.lambda$execute$0(ExecutorUtil.java:209)         at app//org.apache.solr.common.util.ExecutorUtil$MDCAwareThreadPoolExecutor$$Lambda$216/0x00007f39ca6f91b8.run(Unknown Source)         at java.base@13/java.util.concurrent.ThreadPoolExecutor.runWorker(ThreadPoolExecutor.java:1128)         at java.base@13/java.util.concurrent.ThreadPoolExecutor$Worker.run(ThreadPoolExecutor.java:628)         at java.base@13/java.lang.Thread.run(Thread.java:830)    4) Thread[id=21, name=MetricsHistoryHandler-8-thread-1, state=TIMED_WAITING, group=TGRP-TestFoldingMultitermExtrasQuery]         at java.base@13/jdk.internal.misc.Unsafe.park(Native Method)         at java.base@13/java.util.concurrent.locks.LockSupport.parkNanos(LockSupport.java:235)         at java.base@13/java.util.concurrent.locks.AbstractQueuedSynchronizer$ConditionObject.awaitNanos(AbstractQueuedSynchronizer.java:2123)         at java.base@13/java.util.concurrent.ScheduledThreadPoolExecutor$DelayedWorkQueue.take(ScheduledThreadPoolExecutor.java:1182)         at java.base@13/java.util.concurrent.ScheduledThreadPoolExecutor$DelayedWorkQueue.take(ScheduledThreadPoolExecutor.java:899)         at java.base@13/java.util.concurrent.ThreadPoolExecutor.getTask(ThreadPoolExecutor.java:1054)         at java.base@13/java.util.concurrent.ThreadPoolExecutor.runWorker(ThreadPoolExecutor.java:1114)         at java.base@13/java.util.concurrent.ThreadPoolExecutor$Worker.run(ThreadPoolExecutor.java:628)         at java.base@13/java.lang.Thread.run(Thread.java:830)    5) Thread[id=19, name=h2sc-5-thread-1, state=RUNNABLE, group=TGRP-TestFoldingMultitermExtrasQuery]         at java.base@13/sun.nio.ch.EPoll.wait(Native Method)         at java.base@13/sun.nio.ch.EPollSelectorImpl.doSelect(EPollSelectorImpl.java:120)         at java.base@13/sun.nio.ch.SelectorImpl.lockAndDoSelect(SelectorImpl.java:124)         at java.base@13/sun.nio.ch.SelectorImpl.select(SelectorImpl.java:141)         at app//org.eclipse.jetty.io.ManagedSelector$SelectorProducer.select(ManagedSelector.java:464)         at app//org.eclipse.jetty.io.ManagedSelector$SelectorProducer.produce(ManagedSelector.java:401)         at app//org.eclipse.jetty.util.thread.strategy.EatWhatYouKill.produceTask(EatWhatYouKill.java:357)         at app//org.eclipse.jetty.util.thread.strategy.EatWhatYouKill.doProduce(EatWhatYouKill.java:181)         at app//org.eclipse.jetty.util.thread.strategy.EatWhatYouKill.tryProduce(EatWhatYouKill.java:168)         at app//org.eclipse.jetty.util.thread.strategy.EatWhatYouKill.produce(EatWhatYouKill.java:132)         at app//org.eclipse.jetty.io.ManagedSelector$$Lambda$215/0x00007f39ca6fa058.run(Unknown Source)         at app//org.apache.solr.common.util.ExecutorUtil$MDCAwareThreadPoolExecutor.lambda$execute$0(ExecutorUtil.java:209)         at app//org.apache.solr.common.util.ExecutorUtil$MDCAwareThreadPoolExecutor$$Lambda$216/0x00007f39ca6f91b8.run(Unknown Source)         at java.base@13/java.util.concurrent.ThreadPoolExecutor.runWorker(ThreadPoolExecutor.java:1128)         at java.base@13/java.util.concurrent.ThreadPoolExecutor$Worker.run(ThreadPoolExecutor.java:628)         at java.base@13/java.lang.Thread.run(Thread.java:830)
>
> Stack Trace:
> com.carrotsearch.randomizedtesting.ThreadLeakError: 5 threads leaked from SUITE scope at org.apache.solr.analysis.TestFoldingMultitermExtrasQuery:
>    1) Thread[id=22, name=SolrRrdBackendFactory-7-thread-2, state=WAITING, group=TGRP-TestFoldingMultitermExtrasQuery]
>         at java.base@13/jdk.internal.misc.Unsafe.park(Native Method)
>         at java.base@13/java.util.concurrent.locks.LockSupport.park(LockSupport.java:194)
>         at java.base@13/java.util.concurrent.locks.AbstractQueuedSynchronizer$ConditionObject.await(AbstractQueuedSynchronizer.java:2081)
>         at java.base@13/java.util.concurrent.ScheduledThreadPoolExecutor$DelayedWorkQueue.take(ScheduledThreadPoolExecutor.java:1177)
>         at java.base@13/java.util.concurrent.ScheduledThreadPoolExecutor$DelayedWorkQueue.take(ScheduledThreadPoolExecutor.java:899)
>         at java.base@13/java.util.concurrent.ThreadPoolExecutor.getTask(ThreadPoolExecutor.java:1054)
>         at java.base@13/java.util.concurrent.ThreadPoolExecutor.runWorker(ThreadPoolExecutor.java:1114)
>         at java.base@13/java.util.concurrent.ThreadPoolExecutor$Worker.run(ThreadPoolExecutor.java:628)
>         at java.base@13/java.lang.Thread.run(Thread.java:830)
>    2) Thread[id=20, name=SolrRrdBackendFactory-7-thread-1, state=TIMED_WAITING, group=TGRP-TestFoldingMultitermExtrasQuery]
>         at java.base@13/jdk.internal.misc.Unsafe.park(Native Method)
>         at java.base@13/java.util.concurrent.locks.LockSupport.parkNanos(LockSupport.java:235)
>         at java.base@13/java.util.concurrent.locks.AbstractQueuedSynchronizer$ConditionObject.awaitNanos(AbstractQueuedSynchronizer.java:2123)
>         at java.base@13/java.util.concurrent.ScheduledThreadPoolExecutor$DelayedWorkQueue.take(ScheduledThreadPoolExecutor.java:1182)
>         at java.base@13/java.util.concurrent.ScheduledThreadPoolExecutor$DelayedWorkQueue.take(ScheduledThreadPoolExecutor.java:899)
>         at java.base@13/java.util.concurrent.ThreadPoolExecutor.getTask(ThreadPoolExecutor.java:1054)
>         at java.base@13/java.util.concurrent.ThreadPoolExecutor.runWorker(ThreadPoolExecutor.java:1114)
>         at java.base@13/java.util.concurrent.ThreadPoolExecutor$Worker.run(ThreadPoolExecutor.java:628)
>         at java.base@13/java.lang.Thread.run(Thread.java:830)
>    3) Thread[id=16, name=h2sc-3-thread-1, state=RUNNABLE, group=TGRP-TestFoldingMultitermExtrasQuery]
>         at java.base@13/sun.nio.ch.EPoll.wait(Native Method)
>         at java.base@13/sun.nio.ch.EPollSelectorImpl.doSelect(EPollSelectorImpl.java:120)
>         at java.base@13/sun.nio.ch.SelectorImpl.lockAndDoSelect(SelectorImpl.java:124)
>         at java.base@13/sun.nio.ch.SelectorImpl.select(SelectorImpl.java:141)
>         at app//org.eclipse.jetty.io.ManagedSelector$SelectorProducer.select(ManagedSelector.java:464)
>         at app//org.eclipse.jetty.io.ManagedSelector$SelectorProducer.produce(ManagedSelector.java:401)
>         at app//org.eclipse.jetty.util.thread.strategy.EatWhatYouKill.produceTask(EatWhatYouKill.java:357)
>         at app//org.eclipse.jetty.util.thread.strategy.EatWhatYouKill.doProduce(EatWhatYouKill.java:181)
>         at app//org.eclipse.jetty.util.thread.strategy.EatWhatYouKill.tryProduce(EatWhatYouKill.java:168)
>         at app//org.eclipse.jetty.util.thread.strategy.EatWhatYouKill.produce(EatWhatYouKill.java:132)
>         at app//org.eclipse.jetty.io.ManagedSelector$$Lambda$215/0x00007f39ca6fa058.run(Unknown Source)
>         at app//org.apache.solr.common.util.ExecutorUtil$MDCAwareThreadPoolExecutor.lambda$execute$0(ExecutorUtil.java:209)
>         at app//org.apache.solr.common.util.ExecutorUtil$MDCAwareThreadPoolExecutor$$Lambda$216/0x00007f39ca6f91b8.run(Unknown Source)
>         at java.base@13/java.util.concurrent.ThreadPoolExecutor.runWorker(ThreadPoolExecutor.java:1128)
>         at java.base@13/java.util.concurrent.ThreadPoolExecutor$Worker.run(ThreadPoolExecutor.java:628)
>         at java.base@13/java.lang.Thread.run(Thread.java:830)
>    4) Thread[id=21, name=MetricsHistoryHandler-8-thread-1, state=TIMED_WAITING, group=TGRP-TestFoldingMultitermExtrasQuery]
>         at java.base@13/jdk.internal.misc.Unsafe.park(Native Method)
>         at java.base@13/java.util.concurrent.locks.LockSupport.parkNanos(LockSupport.java:235)
>         at java.base@13/java.util.concurrent.locks.AbstractQueuedSynchronizer$ConditionObject.awaitNanos(AbstractQueuedSynchronizer.java:2123)
>         at java.base@13/java.util.concurrent.ScheduledThreadPoolExecutor$DelayedWorkQueue.take(ScheduledThreadPoolExecutor.java:1182)
>         at java.base@13/java.util.concurrent.ScheduledThreadPoolExecutor$DelayedWorkQueue.take(ScheduledThreadPoolExecutor.java:899)
>         at java.base@13/java.util.concurrent.ThreadPoolExecutor.getTask(ThreadPoolExecutor.java:1054)
>         at java.base@13/java.util.concurrent.ThreadPoolExecutor.runWorker(ThreadPoolExecutor.java:1114)
>         at java.base@13/java.util.concurrent.ThreadPoolExecutor$Worker.run(ThreadPoolExecutor.java:628)
>         at java.base@13/java.lang.Thread.run(Thread.java:830)
>    5) Thread[id=19, name=h2sc-5-thread-1, state=RUNNABLE, group=TGRP-TestFoldingMultitermExtrasQuery]
>         at java.base@13/sun.nio.ch.EPoll.wait(Native Method)
>         at java.base@13/sun.nio.ch.EPollSelectorImpl.doSelect(EPollSelectorImpl.java:120)
>         at java.base@13/sun.nio.ch.SelectorImpl.lockAndDoSelect(SelectorImpl.java:124)
>         at java.base@13/sun.nio.ch.SelectorImpl.select(SelectorImpl.java:141)
>         at app//org.eclipse.jetty.io.ManagedSelector$SelectorProducer.select(ManagedSelector.java:464)
>         at app//org.eclipse.jetty.io.ManagedSelector$SelectorProducer.produce(ManagedSelector.java:401)
>         at app//org.eclipse.jetty.util.thread.strategy.EatWhatYouKill.produceTask(EatWhatYouKill.java:357)
>         at app//org.eclipse.jetty.util.thread.strategy.EatWhatYouKill.doProduce(EatWhatYouKill.java:181)
>         at app//org.eclipse.jetty.util.thread.strategy.EatWhatYouKill.tryProduce(EatWhatYouKill.java:168)
>         at app//org.eclipse.jetty.util.thread.strategy.EatWhatYouKill.produce(EatWhatYouKill.java:132)
>         at app//org.eclipse.jetty.io.ManagedSelector$$Lambda$215/0x00007f39ca6fa058.run(Unknown Source)
>         at app//org.apache.solr.common.util.ExecutorUtil$MDCAwareThreadPoolExecutor.lambda$execute$0(ExecutorUtil.java:209)
>         at app//org.apache.solr.common.util.ExecutorUtil$MDCAwareThreadPoolExecutor$$Lambda$216/0x00007f39ca6f91b8.run(Unknown Source)
>         at java.base@13/java.util.concurrent.ThreadPoolExecutor.runWorker(ThreadPoolExecutor.java:1128)
>         at java.base@13/java.util.concurrent.ThreadPoolExecutor$Worker.run(ThreadPoolExecutor.java:628)
>         at java.base@13/java.lang.Thread.run(Thread.java:830)
>         at __randomizedtesting.SeedInfo.seed([DF0D21B696B9CF5B]:0)
>
>
> FAILED:  junit.framework.TestSuite.org.apache.solr.analysis.TestFoldingMultitermExtrasQuery
>
> Error Message:
> There are still zombie threads that couldn't be terminated:    1) Thread[id=22, name=SolrRrdBackendFactory-7-thread-2, state=WAITING, group=TGRP-TestFoldingMultitermExtrasQuery]         at java.base@13/jdk.internal.misc.Unsafe.park(Native Method)         at java.base@13/java.util.concurrent.locks.LockSupport.park(LockSupport.java:194)         at java.base@13/java.util.concurrent.locks.AbstractQueuedSynchronizer$ConditionObject.await(AbstractQueuedSynchronizer.java:2081)         at java.base@13/java.util.concurrent.ScheduledThreadPoolExecutor$DelayedWorkQueue.take(ScheduledThreadPoolExecutor.java:1177)         at java.base@13/java.util.concurrent.ScheduledThreadPoolExecutor$DelayedWorkQueue.take(ScheduledThreadPoolExecutor.java:899)         at java.base@13/java.util.concurrent.ThreadPoolExecutor.getTask(ThreadPoolExecutor.java:1054)         at java.base@13/java.util.concurrent.ThreadPoolExecutor.runWorker(ThreadPoolExecutor.java:1114)         at java.base@13/java.util.concurrent.ThreadPoolExecutor$Worker.run(ThreadPoolExecutor.java:628)         at java.base@13/java.lang.Thread.run(Thread.java:830)    2) Thread[id=20, name=SolrRrdBackendFactory-7-thread-1, state=TIMED_WAITING, group=TGRP-TestFoldingMultitermExtrasQuery]         at java.base@13/jdk.internal.misc.Unsafe.park(Native Method)         at java.base@13/java.util.concurrent.locks.LockSupport.parkNanos(LockSupport.java:235)         at java.base@13/java.util.concurrent.locks.AbstractQueuedSynchronizer$ConditionObject.awaitNanos(AbstractQueuedSynchronizer.java:2123)         at java.base@13/java.util.concurrent.ScheduledThreadPoolExecutor$DelayedWorkQueue.take(ScheduledThreadPoolExecutor.java:1182)         at java.base@13/java.util.concurrent.ScheduledThreadPoolExecutor$DelayedWorkQueue.take(ScheduledThreadPoolExecutor.java:899)         at java.base@13/java.util.concurrent.ThreadPoolExecutor.getTask(ThreadPoolExecutor.java:1054)         at java.base@13/java.util.concurrent.ThreadPoolExecutor.runWorker(ThreadPoolExecutor.java:1114)         at java.base@13/java.util.concurrent.ThreadPoolExecutor$Worker.run(ThreadPoolExecutor.java:628)         at java.base@13/java.lang.Thread.run(Thread.java:830)    3) Thread[id=16, name=h2sc-3-thread-1, state=RUNNABLE, group=TGRP-TestFoldingMultitermExtrasQuery]         at java.base@13/sun.nio.ch.EPoll.wait(Native Method)         at java.base@13/sun.nio.ch.EPollSelectorImpl.doSelect(EPollSelectorImpl.java:120)         at java.base@13/sun.nio.ch.SelectorImpl.lockAndDoSelect(SelectorImpl.java:124)         at java.base@13/sun.nio.ch.SelectorImpl.select(SelectorImpl.java:141)         at app//org.eclipse.jetty.io.ManagedSelector$SelectorProducer.select(ManagedSelector.java:464)         at app//org.eclipse.jetty.io.ManagedSelector$SelectorProducer.produce(ManagedSelector.java:401)         at app//org.eclipse.jetty.util.thread.strategy.EatWhatYouKill.produceTask(EatWhatYouKill.java:357)         at app//org.eclipse.jetty.util.thread.strategy.EatWhatYouKill.doProduce(EatWhatYouKill.java:181)         at app//org.eclipse.jetty.util.thread.strategy.EatWhatYouKill.tryProduce(EatWhatYouKill.java:168)         at app//org.eclipse.jetty.util.thread.strategy.EatWhatYouKill.produce(EatWhatYouKill.java:132)         at app//org.eclipse.jetty.io.ManagedSelector$$Lambda$215/0x00007f39ca6fa058.run(Unknown Source)         at app//org.apache.solr.common.util.ExecutorUtil$MDCAwareThreadPoolExecutor.lambda$execute$0(ExecutorUtil.java:209)         at app//org.apache.solr.common.util.ExecutorUtil$MDCAwareThreadPoolExecutor$$Lambda$216/0x00007f39ca6f91b8.run(Unknown Source)         at java.base@13/java.util.concurrent.ThreadPoolExecutor.runWorker(ThreadPoolExecutor.java:1128)         at java.base@13/java.util.concurrent.ThreadPoolExecutor$Worker.run(ThreadPoolExecutor.java:628)         at java.base@13/java.lang.Thread.run(Thread.java:830)    4) Thread[id=21, name=MetricsHistoryHandler-8-thread-1, state=TIMED_WAITING, group=TGRP-TestFoldingMultitermExtrasQuery]         at java.base@13/jdk.internal.misc.Unsafe.park(Native Method)         at java.base@13/java.util.concurrent.locks.LockSupport.parkNanos(LockSupport.java:235)         at java.base@13/java.util.concurrent.locks.AbstractQueuedSynchronizer$ConditionObject.awaitNanos(AbstractQueuedSynchronizer.java:2123)         at java.base@13/java.util.concurrent.ScheduledThreadPoolExecutor$DelayedWorkQueue.take(ScheduledThreadPoolExecutor.java:1182)         at java.base@13/java.util.concurrent.ScheduledThreadPoolExecutor$DelayedWorkQueue.take(ScheduledThreadPoolExecutor.java:899)         at java.base@13/java.util.concurrent.ThreadPoolExecutor.getTask(ThreadPoolExecutor.java:1054)         at java.base@13/java.util.concurrent.ThreadPoolExecutor.runWorker(ThreadPoolExecutor.java:1114)         at java.base@13/java.util.concurrent.ThreadPoolExecutor$Worker.run(ThreadPoolExecutor.java:628)         at java.base@13/java.lang.Thread.run(Thread.java:830)    5) Thread[id=19, name=h2sc-5-thread-1, state=RUNNABLE, group=TGRP-TestFoldingMultitermExtrasQuery]         at java.base@13/sun.nio.ch.EPoll.wait(Native Method)         at java.base@13/sun.nio.ch.EPollSelectorImpl.doSelect(EPollSelectorImpl.java:120)         at java.base@13/sun.nio.ch.SelectorImpl.lockAndDoSelect(SelectorImpl.java:124)         at java.base@13/sun.nio.ch.SelectorImpl.select(SelectorImpl.java:141)         at app//org.eclipse.jetty.io.ManagedSelector$SelectorProducer.select(ManagedSelector.java:464)         at app//org.eclipse.jetty.io.ManagedSelector$SelectorProducer.produce(ManagedSelector.java:401)         at app//org.eclipse.jetty.util.thread.strategy.EatWhatYouKill.produceTask(EatWhatYouKill.java:357)         at app//org.eclipse.jetty.util.thread.strategy.EatWhatYouKill.doProduce(EatWhatYouKill.java:181)         at app//org.eclipse.jetty.util.thread.strategy.EatWhatYouKill.tryProduce(EatWhatYouKill.java:168)         at app//org.eclipse.jetty.util.thread.strategy.EatWhatYouKill.produce(EatWhatYouKill.java:132)         at app//org.eclipse.jetty.io.ManagedSelector$$Lambda$215/0x00007f39ca6fa058.run(Unknown Source)         at app//org.apache.solr.common.util.ExecutorUtil$MDCAwareThreadPoolExecutor.lambda$execute$0(ExecutorUtil.java:209)         at app//org.apache.solr.common.util.ExecutorUtil$MDCAwareThreadPoolExecutor$$Lambda$216/0x00007f39ca6f91b8.run(Unknown Source)         at java.base@13/java.util.concurrent.ThreadPoolExecutor.runWorker(ThreadPoolExecutor.java:1128)         at java.base@13/java.util.concurrent.ThreadPoolExecutor$Worker.run(ThreadPoolExecutor.java:628)         at java.base@13/java.lang.Thread.run(Thread.java:830)
>
> Stack Trace:
> com.carrotsearch.randomizedtesting.ThreadLeakError: There are still zombie threads that couldn't be terminated:
>    1) Thread[id=22, name=SolrRrdBackendFactory-7-thread-2, state=WAITING, group=TGRP-TestFoldingMultitermExtrasQuery]
>         at java.base@13/jdk.internal.misc.Unsafe.park(Native Method)
>         at java.base@13/java.util.concurrent.locks.LockSupport.park(LockSupport.java:194)
>         at java.base@13/java.util.concurrent.locks.AbstractQueuedSynchronizer$ConditionObject.await(AbstractQueuedSynchronizer.java:2081)
>         at java.base@13/java.util.concurrent.ScheduledThreadPoolExecutor$DelayedWorkQueue.take(ScheduledThreadPoolExecutor.java:1177)
>         at java.base@13/java.util.concurrent.ScheduledThreadPoolExecutor$DelayedWorkQueue.take(ScheduledThreadPoolExecutor.java:899)
>         at java.base@13/java.util.concurrent.ThreadPoolExecutor.getTask(ThreadPoolExecutor.java:1054)
>         at java.base@13/java.util.concurrent.ThreadPoolExecutor.runWorker(ThreadPoolExecutor.java:1114)
>         at java.base@13/java.util.concurrent.ThreadPoolExecutor$Worker.run(ThreadPoolExecutor.java:628)
>         at java.base@13/java.lang.Thread.run(Thread.java:830)
>    2) Thread[id=20, name=SolrRrdBackendFactory-7-thread-1, state=TIMED_WAITING, group=TGRP-TestFoldingMultitermExtrasQuery]
>         at java.base@13/jdk.internal.misc.Unsafe.park(Native Method)
>         at java.base@13/java.util.concurrent.locks.LockSupport.parkNanos(LockSupport.java:235)
>         at java.base@13/java.util.concurrent.locks.AbstractQueuedSynchronizer$ConditionObject.awaitNanos(AbstractQueuedSynchronizer.java:2123)
>         at java.base@13/java.util.concurrent.ScheduledThreadPoolExecutor$DelayedWorkQueue.take(ScheduledThreadPoolExecutor.java:1182)
>         at java.base@13/java.util.concurrent.ScheduledThreadPoolExecutor$DelayedWorkQueue.take(ScheduledThreadPoolExecutor.java:899)
>         at java.base@13/java.util.concurrent.ThreadPoolExecutor.getTask(ThreadPoolExecutor.java:1054)
>         at java.base@13/java.util.concurrent.ThreadPoolExecutor.runWorker(ThreadPoolExecutor.java:1114)
>         at java.base@13/java.util.concurrent.ThreadPoolExecutor$Worker.run(ThreadPoolExecutor.java:628)
>         at java.base@13/java.lang.Thread.run(Thread.java:830)
>    3) Thread[id=16, name=h2sc-3-thread-1, state=RUNNABLE, group=TGRP-TestFoldingMultitermExtrasQuery]
>         at java.base@13/sun.nio.ch.EPoll.wait(Native Method)
>         at java.base@13/sun.nio.ch.EPollSelectorImpl.doSelect(EPollSelectorImpl.java:120)
>         at java.base@13/sun.nio.ch.SelectorImpl.lockAndDoSelect(SelectorImpl.java:124)
>         at java.base@13/sun.nio.ch.SelectorImpl.select(SelectorImpl.java:141)
>         at app//org.eclipse.jetty.io.ManagedSelector$SelectorProducer.select(ManagedSelector.java:464)
>         at app//org.eclipse.jetty.io.ManagedSelector$SelectorProducer.produce(ManagedSelector.java:401)
>         at app//org.eclipse.jetty.util.thread.strategy.EatWhatYouKill.produceTask(EatWhatYouKill.java:357)
>         at app//org.eclipse.jetty.util.thread.strategy.EatWhatYouKill.doProduce(EatWhatYouKill.java:181)
>         at app//org.eclipse.jetty.util.thread.strategy.EatWhatYouKill.tryProduce(EatWhatYouKill.java:168)
>         at app//org.eclipse.jetty.util.thread.strategy.EatWhatYouKill.produce(EatWhatYouKill.java:132)
>         at app//org.eclipse.jetty.io.ManagedSelector$$Lambda$215/0x00007f39ca6fa058.run(Unknown Source)
>         at app//org.apache.solr.common.util.ExecutorUtil$MDCAwareThreadPoolExecutor.lambda$execute$0(ExecutorUtil.java:209)
>         at app//org.apache.solr.common.util.ExecutorUtil$MDCAwareThreadPoolExecutor$$Lambda$216/0x00007f39ca6f91b8.run(Unknown Source)
>         at java.base@13/java.util.concurrent.ThreadPoolExecutor.runWorker(ThreadPoolExecutor.java:1128)
>         at java.base@13/java.util.concurrent.ThreadPoolExecutor$Worker.run(ThreadPoolExecutor.java:628)
>         at java.base@13/java.lang.Thread.run(Thread.java:830)
>    4) Thread[id=21, name=MetricsHistoryHandler-8-thread-1, state=TIMED_WAITING, group=TGRP-TestFoldingMultitermExtrasQuery]
>         at java.base@13/jdk.internal.misc.Unsafe.park(Native Method)
>         at java.base@13/java.util.concurrent.locks.LockSupport.parkNanos(LockSupport.java:235)
>         at java.base@13/java.util.concurrent.locks.AbstractQueuedSynchronizer$ConditionObject.awaitNanos(AbstractQueuedSynchronizer.java:2123)
>         at java.base@13/java.util.concurrent.ScheduledThreadPoolExecutor$DelayedWorkQueue.take(ScheduledThreadPoolExecutor.java:1182)
>         at java.base@13/java.util.concurrent.ScheduledThreadPoolExecutor$DelayedWorkQueue.take(ScheduledThreadPoolExecutor.java:899)
>         at java.base@13/java.util.concurrent.ThreadPoolExecutor.getTask(ThreadPoolExecutor.java:1054)
>         at java.base@13/java.util.concurrent.ThreadPoolExecutor.runWorker(ThreadPoolExecutor.java:1114)
>         at java.base@13/java.util.concurrent.ThreadPoolExecutor$Worker.run(ThreadPoolExecutor.java:628)
>         at java.base@13/java.lang.Thread.run(Thread.java:830)
>    5) Thread[id=19, name=h2sc-5-thread-1, state=RUNNABLE, group=TGRP-TestFoldingMultitermExtrasQuery]
>         at java.base@13/sun.nio.ch.EPoll.wait(Native Method)
>         at java.base@13/sun.nio.ch.EPollSelectorImpl.doSelect(EPollSelectorImpl.java:120)
>         at java.base@13/sun.nio.ch.SelectorImpl.lockAndDoSelect(SelectorImpl.java:124)
>         at java.base@13/sun.nio.ch.SelectorImpl.select(SelectorImpl.java:141)
>         at app//org.eclipse.jetty.io.ManagedSelector$SelectorProducer.select(ManagedSelector.java:464)
>         at app//org.eclipse.jetty.io.ManagedSelector$SelectorProducer.produce(ManagedSelector.java:401)
>         at app//org.eclipse.jetty.util.thread.strategy.EatWhatYouKill.produceTask(EatWhatYouKill.java:357)
>         at app//org.eclipse.jetty.util.thread.strategy.EatWhatYouKill.doProduce(EatWhatYouKill.java:181)
>         at app//org.eclipse.jetty.util.thread.strategy.EatWhatYouKill.tryProduce(EatWhatYouKill.java:168)
>         at app//org.eclipse.jetty.util.thread.strategy.EatWhatYouKill.produce(EatWhatYouKill.java:132)
>         at app//org.eclipse.jetty.io.ManagedSelector$$Lambda$215/0x00007f39ca6fa058.run(Unknown Source)
>         at app//org.apache.solr.common.util.ExecutorUtil$MDCAwareThreadPoolExecutor.lambda$execute$0(ExecutorUtil.java:209)
>         at app//org.apache.solr.common.util.ExecutorUtil$MDCAwareThreadPoolExecutor$$Lambda$216/0x00007f39ca6f91b8.run(Unknown Source)
>         at java.base@13/java.util.concurrent.ThreadPoolExecutor.runWorker(ThreadPoolExecutor.java:1128)
>         at java.base@13/java.util.concurrent.ThreadPoolExecutor$Worker.run(ThreadPoolExecutor.java:628)
>         at java.base@13/java.lang.Thread.run(Thread.java:830)
>         at __randomizedtesting.SeedInfo.seed([DF0D21B696B9CF5B]:0)
>
>
> FAILED:  junit.framework.TestSuite.org.apache.solr.schema.TestICUCollationField
>
> Error Message:
>
>
> Stack Trace:
> java.lang.NullPointerException
>         at __randomizedtesting.SeedInfo.seed([DF0D21B696B9CF5B]:0)
>         at org.apache.solr.pkg.PackageAPI.<init>(PackageAPI.java:75)
>         at org.apache.solr.pkg.PackageLoader.<init>(PackageLoader.java:60)
>         at org.apache.solr.core.CoreContainer.load(CoreContainer.java:743)
>         at org.apache.solr.util.TestHarness.<init>(TestHarness.java:180)
>         at org.apache.solr.util.TestHarness.<init>(TestHarness.java:143)
>         at org.apache.solr.util.TestHarness.<init>(TestHarness.java:149)
>         at org.apache.solr.util.TestHarness.<init>(TestHarness.java:112)
>         at org.apache.solr.SolrTestCaseJ4.createCore(SolrTestCaseJ4.java:796)
>         at org.apache.solr.SolrTestCaseJ4.initCore(SolrTestCaseJ4.java:786)
>         at org.apache.solr.SolrTestCaseJ4.initCore(SolrTestCaseJ4.java:647)
>         at org.apache.solr.schema.TestICUCollationField.beforeClass(TestICUCollationField.java:42)
>         at java.base/jdk.internal.reflect.NativeMethodAccessorImpl.invoke0(Native Method)
>         at java.base/jdk.internal.reflect.NativeMethodAccessorImpl.invoke(NativeMethodAccessorImpl.java:62)
>         at java.base/jdk.internal.reflect.DelegatingMethodAccessorImpl.invoke(DelegatingMethodAccessorImpl.java:43)
>         at java.base/java.lang.reflect.Method.invoke(Method.java:567)
>         at com.carrotsearch.randomizedtesting.RandomizedRunner.invoke(RandomizedRunner.java:1750)
>         at com.carrotsearch.randomizedtesting.RandomizedRunner$6.evaluate(RandomizedRunner.java:878)
>         at com.carrotsearch.randomizedtesting.RandomizedRunner$7.evaluate(RandomizedRunner.java:894)
>         at com.carrotsearch.randomizedtesting.rules.StatementAdapter.evaluate(StatementAdapter.java:36)
>         at com.carrotsearch.randomizedtesting.rules.SystemPropertiesRestoreRule$1.evaluate(SystemPropertiesRestoreRule.java:57)
>         at org.apache.lucene.util.AbstractBeforeAfterRule$1.evaluate(AbstractBeforeAfterRule.java:45)
>         at com.carrotsearch.randomizedtesting.rules.StatementAdapter.evaluate(StatementAdapter.java:36)
>         at org.apache.lucene.util.TestRuleStoreClassName$1.evaluate(TestRuleStoreClassName.java:41)
>         at com.carrotsearch.randomizedtesting.rules.NoShadowingOrOverridesOnMethodsRule$1.evaluate(NoShadowingOrOverridesOnMethodsRule.java:40)
>         at com.carrotsearch.randomizedtesting.rules.NoShadowingOrOverridesOnMethodsRule$1.evaluate(NoShadowingOrOverridesOnMethodsRule.java:40)
>         at com.carrotsearch.randomizedtesting.rules.StatementAdapter.evaluate(StatementAdapter.java:36)
>         at com.carrotsearch.randomizedtesting.rules.StatementAd
>
> [...truncated too long message...]
>
> :141)
>    [junit4]    >         at app//org.eclipse.jetty.io.ManagedSelector$SelectorProducer.select(ManagedSelector.java:464)
>    [junit4]    >         at app//org.eclipse.jetty.io.ManagedSelector$SelectorProducer.produce(ManagedSelector.java:401)
>    [junit4]    >         at app//org.eclipse.jetty.util.thread.strategy.EatWhatYouKill.produceTask(EatWhatYouKill.java:357)
>    [junit4]    >         at app//org.eclipse.jetty.util.thread.strategy.EatWhatYouKill.doProduce(EatWhatYouKill.java:181)
>    [junit4]    >         at app//org.eclipse.jetty.util.thread.strategy.EatWhatYouKill.tryProduce(EatWhatYouKill.java:168)
>    [junit4]    >         at app//org.eclipse.jetty.util.thread.strategy.EatWhatYouKill.produce(EatWhatYouKill.java:132)
>    [junit4]    >         at app//org.eclipse.jetty.io.ManagedSelector$$Lambda$210/0x00007f49ff8fa058.run(Unknown Source)
>    [junit4]    >         at app//org.apache.solr.common.util.ExecutorUtil$MDCAwareThreadPoolExecutor.lambda$execute$0(ExecutorUtil.java:209)
>    [junit4]    >         at app//org.apache.solr.common.util.ExecutorUtil$MDCAwareThreadPoolExecutor$$Lambda$211/0x00007f49ff8f91b8.run(Unknown Source)
>    [junit4]    >         at java.base@13/java.util.concurrent.ThreadPoolExecutor.runWorker(ThreadPoolExecutor.java:1128)
>    [junit4]    >         at java.base@13/java.util.concurrent.ThreadPoolExecutor$Worker.run(ThreadPoolExecutor.java:628)
>    [junit4]    >         at java.base@13/java.lang.Thread.run(Thread.java:830)
>    [junit4]    >    4) Thread[id=22, name=MetricsHistoryHandler-8-thread-1, state=TIMED_WAITING, group=TGRP-ExitableDirectoryReaderTest]
>    [junit4]    >         at java.base@13/jdk.internal.misc.Unsafe.park(Native Method)
>    [junit4]    >         at java.base@13/java.util.concurrent.locks.LockSupport.parkNanos(LockSupport.java:235)
>    [junit4]    >         at java.base@13/java.util.concurrent.locks.AbstractQueuedSynchronizer$ConditionObject.awaitNanos(AbstractQueuedSynchronizer.java:2123)
>    [junit4]    >         at java.base@13/java.util.concurrent.ScheduledThreadPoolExecutor$DelayedWorkQueue.take(ScheduledThreadPoolExecutor.java:1182)
>    [junit4]    >         at java.base@13/java.util.concurrent.ScheduledThreadPoolExecutor$DelayedWorkQueue.take(ScheduledThreadPoolExecutor.java:899)
>    [junit4]    >         at java.base@13/java.util.concurrent.ThreadPoolExecutor.getTask(ThreadPoolExecutor.java:1054)
>    [junit4]    >         at java.base@13/java.util.concurrent.ThreadPoolExecutor.runWorker(ThreadPoolExecutor.java:1114)
>    [junit4]    >         at java.base@13/java.util.concurrent.ThreadPoolExecutor$Worker.run(ThreadPoolExecutor.java:628)
>    [junit4]    >         at java.base@13/java.lang.Thread.run(Thread.java:830)
>    [junit4]    >    5) Thread[id=23, name=SolrRrdBackendFactory-7-thread-2, state=WAITING, group=TGRP-ExitableDirectoryReaderTest]
>    [junit4]    >         at java.base@13/jdk.internal.misc.Unsafe.park(Native Method)
>    [junit4]    >         at java.base@13/java.util.concurrent.locks.LockSupport.park(LockSupport.java:194)
>    [junit4]    >         at java.base@13/java.util.concurrent.locks.AbstractQueuedSynchronizer$ConditionObject.await(AbstractQueuedSynchronizer.java:2081)
>    [junit4]    >         at java.base@13/java.util.concurrent.ScheduledThreadPoolExecutor$DelayedWorkQueue.take(ScheduledThreadPoolExecutor.java:1177)
>    [junit4]    >         at java.base@13/java.util.concurrent.ScheduledThreadPoolExecutor$DelayedWorkQueue.take(ScheduledThreadPoolExecutor.java:899)
>    [junit4]    >         at java.base@13/java.util.concurrent.ThreadPoolExecutor.getTask(ThreadPoolExecutor.java:1054)
>    [junit4]    >         at java.base@13/java.util.concurrent.ThreadPoolExecutor.runWorker(ThreadPoolExecutor.java:1114)
>    [junit4]    >         at java.base@13/java.util.concurrent.ThreadPoolExecutor$Worker.run(ThreadPoolExecutor.java:628)
>    [junit4]    >         at java.base@13/java.lang.Thread.run(Thread.java:830)
>    [junit4]    >        at __randomizedtesting.SeedInfo.seed([EF30C12A6639D12F]:0)
>    [junit4] Completed [14/15 (3!)] on J2 in 77.53s, 0 tests, 1 failure, 3 errors <<< FAILURES!
>    [junit4]
>    [junit4] Suite: org.apache.solr.core.ExitableDirectoryReaderTest
>    [junit4] Completed [15/15 (3!)] on J2 in 0.01s, 3 tests, 3 skipped
>    [junit4]
>    [junit4] JVM J2: stderr was not empty, see: /home/jenkins/workspace/Lucene-Solr-SOLR-13661-Linux/solr/build/solr-core/test/temp/junit4-J2-20191020_183213_0718326649371179285686.syserr
>    [junit4] >>> JVM J2 emitted unexpected output (verbatim) ----
>    [junit4] OpenJDK 64-Bit Server VM warning: Option UseConcMarkSweepGC was deprecated in version 9.0 and will likely be removed in a future release.
>    [junit4] <<< JVM J2: EOF ----
>    [junit4]
>    [junit4] Tests with failures [seed: EF30C12A6639D12F]:
>    [junit4]   - org.apache.solr.search.facet.DistributedFacetSimpleRefinementLongTailTest.test
>    [junit4]   - org.apache.solr.search.facet.DistributedFacetSimpleRefinementLongTailTest.test
>    [junit4]   - org.apache.solr.search.facet.DistributedFacetSimpleRefinementLongTailTest (suite)
>    [junit4]   - org.apache.solr.search.facet.DistributedFacetSimpleRefinementLongTailTest (suite)
>    [junit4]   - org.apache.solr.core.ExitableDirectoryReaderTest (suite)
>    [junit4]
>    [junit4]
>    [junit4] JVM J0:     0.72 ..    20.23 =    19.50s
>    [junit4] JVM J1:     0.72 ..    20.48 =    19.75s
>    [junit4] JVM J2:     0.72 ..    78.59 =    77.87s
>    [junit4] Execution time total: 1 minute 18 seconds
>    [junit4] Tests summary: 15 suites, 27 tests, 8 suite-level errors, 2 errors, 25 ignored
>
> BUILD FAILED
> /home/jenkins/workspace/Lucene-Solr-SOLR-13661-Linux/lucene/common-build.xml:1510: The following error occurred while executing this line:
> /home/jenkins/workspace/Lucene-Solr-SOLR-13661-Linux/lucene/common-build.xml:1037: There were test failures: 15 suites, 27 tests, 8 suite-level errors, 2 errors, 25 ignored [seed: EF30C12A6639D12F]
>
> Total time: 1 minute 20 seconds
>
> [repro] Setting last failure code to 256
>
> [repro] Failures:
> [repro]   0/5 failed: org.apache.solr.SolrTestCaseJ4Test
> [repro]   0/5 failed: org.apache.solr.analysis.TestFoldingMultitermExtrasQuery
> [repro]   0/5 failed: org.apache.solr.analytics.legacy.facet.LegacyFieldFacetTest
> [repro]   0/5 failed: org.apache.solr.analytics.legacy.facet.LegacyQueryFacetTest
> [repro]   0/5 failed: org.apache.solr.client.solrj.impl.BasicHttpSolrClientTest
> [repro]   0/5 failed: org.apache.solr.client.solrj.response.TestSpellCheckResponse
> [repro]   0/5 failed: org.apache.solr.handler.clustering.ClusteringComponentTest
> [repro]   0/5 failed: org.apache.solr.ltr.feature.TestUserTermScorerQuery
> [repro]   0/5 failed: org.apache.solr.update.processor.LangDetectLanguageIdentifierUpdateProcessorFactoryTest
> [repro]   0/5 failed: org.apache.solr.update.processor.OpenNLPLangDetectUpdateProcessorFactoryTest
> [repro]   1/5 failed: org.apache.solr.core.ExitableDirectoryReaderTest
> [repro]   1/5 failed: org.apache.solr.handler.clustering.carrot2.CarrotClusteringEngineTest
> [repro]   1/5 failed: org.apache.solr.handler.dataimport.TestContentStreamDataSource
> [repro]   1/5 failed: org.apache.solr.handler.dataimport.TestVariableResolverEndToEnd
> [repro]   1/5 failed: org.apache.solr.handler.dataimport.TestWriterImpl
> [repro]   1/5 failed: org.apache.solr.handler.extraction.TestXLSXResponseWriter
> [repro]   1/5 failed: org.apache.solr.ltr.TestParallelWeightCreation
> [repro]   1/5 failed: org.apache.solr.schema.TestICUCollationFieldDocValues
> [repro]   2/5 failed: org.apache.solr.handler.clustering.DistributedClusteringComponentTest
> [repro]   2/5 failed: org.apache.solr.handler.extraction.ExtractingRequestHandlerTest
> [repro]   2/5 failed: org.apache.solr.ltr.TestLTRWithSort
> [repro]   2/5 failed: org.apache.solr.schema.TestICUCollationField
> [repro]   2/5 failed: org.apache.solr.search.facet.DistributedFacetSimpleRefinementLongTailTest
> [repro]   3/5 failed: org.apache.solr.analytics.legacy.facet.LegacyRangeFacetTest
> [repro]   3/5 failed: org.apache.solr.client.solrj.response.TestSuggesterResponse
> [repro]   3/5 failed: org.apache.solr.handler.dataimport.TestTikaEntityProcessor
> [repro]   3/5 failed: org.apache.solr.prometheus.scraper.SolrStandaloneScraperTest
> [repro]   3/5 failed: org.apache.solr.update.processor.TikaLanguageIdentifierUpdateProcessorFactoryTest
> [repro]   3/5 failed: org.apache.solr.velocity.VelocityResponseWriterTest
> [repro] Exiting with code 256
> + mv lucene/build lucene/build.repro
> + mv solr/build solr/build.repro
> + mv lucene/build.orig lucene/build
> + mv solr/build.orig solr/build
> Archiving artifacts
> Setting ANT_1_8_2_HOME=/home/jenkins/tools/hudson.tasks.Ant_AntInstallation/ANT_1.8.2
> [WARNINGS] Parsing warnings in console log with parser Java Compiler (javac)
> Setting ANT_1_8_2_HOME=/home/jenkins/tools/hudson.tasks.Ant_AntInstallation/ANT_1.8.2
> No credentials specified
> Setting ANT_1_8_2_HOME=/home/jenkins/tools/hudson.tasks.Ant_AntInstallation/ANT_1.8.2
> <Git Blamer> Using GitBlamer to create author and commit information for all warnings.
> <Git Blamer> GIT_COMMIT=0fd262ae406cbbbb19597efb02ffabaaf76f2a26, workspace=/home/jenkins/workspace/Lucene-Solr-SOLR-13661-Linux
> [WARNINGS] Computing warning deltas based on reference build #41
> Recording test results
> Setting ANT_1_8_2_HOME=/home/jenkins/tools/hudson.tasks.Ant_AntInstallation/ANT_1.8.2
> Build step 'Publish JUnit test result report' changed build result to UNSTABLE
> Email was triggered for: Unstable (Test Failures)
> Sending email for trigger: Unstable (Test Failures)
> Setting ANT_1_8_2_HOME=/home/jenkins/tools/hudson.tasks.Ant_AntInstallation/ANT_1.8.2
> Setting ANT_1_8_2_HOME=/home/jenkins/tools/hudson.tasks.Ant_AntInstallation/ANT_1.8.2
> Setting ANT_1_8_2_HOME=/home/jenkins/tools/hudson.tasks.Ant_AntInstallation/ANT_1.8.2
> Setting ANT_1_8_2_HOME=/home/jenkins/tools/hudson.tasks.Ant_AntInstallation/ANT_1.8.2
> Setting ANT_1_8_2_HOME=/home/jenkins/tools/hudson.tasks.Ant_AntInstallation/ANT_1.8.2
> Setting ANT_1_8_2_HOME=/home/jenkins/tools/hudson.tasks.Ant_AntInstallation/ANT_1.8.2
>
> ---------------------------------------------------------------------
> To unsubscribe, e-mail: [hidden email]
> For additional commands, e-mail: [hidden email]

---------------------------------------------------------------------
To unsubscribe, e-mail: [hidden email]
For additional commands, e-mail: [hidden email]