Re: [JENKINS] Lucene-Solr-Tests-8.4 - Build # 29 - Still Unstable

classic Classic list List threaded Threaded
1 message Options
Reply | Threaded
Open this post in threaded view
|

Re: [JENKINS] Lucene-Solr-Tests-8.4 - Build # 29 - Still Unstable

Dawid Weiss-2
Couldn't reproduce, strange.

D.

On Wed, Jan 1, 2020 at 9:34 PM Apache Jenkins Server
<[hidden email]> wrote:

>
> Build: https://builds.apache.org/job/Lucene-Solr-Tests-8.4/29/
>
> 1 tests failed.
> FAILED:  org.apache.lucene.classification.utils.ConfusionMatrixGeneratorTest.testGetConfusionMatrixWithSNB
>
> Error Message:
> expected:<7> but was:<6>
>
> Stack Trace:
> java.lang.AssertionError: expected:<7> but was:<6>
>         at __randomizedtesting.SeedInfo.seed([BB44C5DE68632384:72D8C16DD76745F7]:0)
>         at org.junit.Assert.fail(Assert.java:88)
>         at org.junit.Assert.failNotEquals(Assert.java:834)
>         at org.junit.Assert.assertEquals(Assert.java:645)
>         at org.junit.Assert.assertEquals(Assert.java:631)
>         at org.apache.lucene.classification.utils.ConfusionMatrixGeneratorTest.checkCM(ConfusionMatrixGeneratorTest.java:110)
>         at org.apache.lucene.classification.utils.ConfusionMatrixGeneratorTest.testGetConfusionMatrixWithSNB(ConfusionMatrixGeneratorTest.java:99)
>         at sun.reflect.NativeMethodAccessorImpl.invoke0(Native Method)
>         at sun.reflect.NativeMethodAccessorImpl.invoke(NativeMethodAccessorImpl.java:62)
>         at sun.reflect.DelegatingMethodAccessorImpl.invoke(DelegatingMethodAccessorImpl.java:43)
>         at java.lang.reflect.Method.invoke(Method.java:498)
>         at com.carrotsearch.randomizedtesting.RandomizedRunner.invoke(RandomizedRunner.java:1750)
>         at com.carrotsearch.randomizedtesting.RandomizedRunner$8.evaluate(RandomizedRunner.java:938)
>         at com.carrotsearch.randomizedtesting.RandomizedRunner$9.evaluate(RandomizedRunner.java:974)
>         at com.carrotsearch.randomizedtesting.RandomizedRunner$10.evaluate(RandomizedRunner.java:988)
>         at org.apache.lucene.util.TestRuleSetupTeardownChained$1.evaluate(TestRuleSetupTeardownChained.java:49)
>         at org.apache.lucene.util.AbstractBeforeAfterRule$1.evaluate(AbstractBeforeAfterRule.java:45)
>         at org.apache.lucene.util.TestRuleThreadAndTestName$1.evaluate(TestRuleThreadAndTestName.java:48)
>         at org.apache.lucene.util.TestRuleIgnoreAfterMaxFailures$1.evaluate(TestRuleIgnoreAfterMaxFailures.java:64)
>         at org.apache.lucene.util.TestRuleMarkFailure$1.evaluate(TestRuleMarkFailure.java:47)
>         at com.carrotsearch.randomizedtesting.rules.StatementAdapter.evaluate(StatementAdapter.java:36)
>         at com.carrotsearch.randomizedtesting.ThreadLeakControl$StatementRunner.run(ThreadLeakControl.java:368)
>         at com.carrotsearch.randomizedtesting.ThreadLeakControl.forkTimeoutingTask(ThreadLeakControl.java:817)
>         at com.carrotsearch.randomizedtesting.ThreadLeakControl$3.evaluate(ThreadLeakControl.java:468)
>         at com.carrotsearch.randomizedtesting.RandomizedRunner.runSingleTest(RandomizedRunner.java:947)
>         at com.carrotsearch.randomizedtesting.RandomizedRunner$5.evaluate(RandomizedRunner.java:832)
>         at com.carrotsearch.randomizedtesting.RandomizedRunner$6.evaluate(RandomizedRunner.java:883)
>         at com.carrotsearch.randomizedtesting.RandomizedRunner$7.evaluate(RandomizedRunner.java:894)
>         at org.apache.lucene.util.AbstractBeforeAfterRule$1.evaluate(AbstractBeforeAfterRule.java:45)
>         at com.carrotsearch.randomizedtesting.rules.StatementAdapter.evaluate(StatementAdapter.java:36)
>         at org.apache.lucene.util.TestRuleStoreClassName$1.evaluate(TestRuleStoreClassName.java:41)
>         at com.carrotsearch.randomizedtesting.rules.NoShadowingOrOverridesOnMethodsRule$1.evaluate(NoShadowingOrOverridesOnMethodsRule.java:40)
>         at com.carrotsearch.randomizedtesting.rules.NoShadowingOrOverridesOnMethodsRule$1.evaluate(NoShadowingOrOverridesOnMethodsRule.java:40)
>         at com.carrotsearch.randomizedtesting.rules.StatementAdapter.evaluate(StatementAdapter.java:36)
>         at com.carrotsearch.randomizedtesting.rules.StatementAdapter.evaluate(StatementAdapter.java:36)
>         at com.carrotsearch.randomizedtesting.rules.StatementAdapter.evaluate(StatementAdapter.java:36)
>         at org.apache.lucene.util.TestRuleAssertionsRequired$1.evaluate(TestRuleAssertionsRequired.java:53)
>         at org.apache.lucene.util.TestRuleMarkFailure$1.evaluate(TestRuleMarkFailure.java:47)
>         at org.apache.lucene.util.TestRuleIgnoreAfterMaxFailures$1.evaluate(TestRuleIgnoreAfterMaxFailures.java:64)
>         at org.apache.lucene.util.TestRuleIgnoreTestSuites$1.evaluate(TestRuleIgnoreTestSuites.java:54)
>         at com.carrotsearch.randomizedtesting.rules.StatementAdapter.evaluate(StatementAdapter.java:36)
>         at com.carrotsearch.randomizedtesting.ThreadLeakControl$StatementRunner.run(ThreadLeakControl.java:368)
>         at java.lang.Thread.run(Thread.java:748)
>
>
>
>
> Build Log:
> [...truncated 7188 lines...]
>    [junit4] Suite: org.apache.lucene.classification.utils.ConfusionMatrixGeneratorTest
>    [junit4]   2> NOTE: reproduce with: ant test  -Dtestcase=ConfusionMatrixGeneratorTest -Dtests.method=testGetConfusionMatrixWithSNB -Dtests.seed=BB44C5DE68632384 -Dtests.multiplier=2 -Dtests.slow=true -Dtests.locale=id -Dtests.timezone=Asia/Damascus -Dtests.asserts=true -Dtests.file.encoding=UTF-8
>    [junit4] FAILURE 9.19s J2 | ConfusionMatrixGeneratorTest.testGetConfusionMatrixWithSNB <<<
>    [junit4]    > Throwable #1: java.lang.AssertionError: expected:<7> but was:<6>
>    [junit4]    >        at __randomizedtesting.SeedInfo.seed([BB44C5DE68632384:72D8C16DD76745F7]:0)
>    [junit4]    >        at org.apache.lucene.classification.utils.ConfusionMatrixGeneratorTest.checkCM(ConfusionMatrixGeneratorTest.java:110)
>    [junit4]    >        at org.apache.lucene.classification.utils.ConfusionMatrixGeneratorTest.testGetConfusionMatrixWithSNB(ConfusionMatrixGeneratorTest.java:99)
>    [junit4]    >        at java.lang.Thread.run(Thread.java:748)
>    [junit4]   2> NOTE: test params are: codec=Asserting(Lucene84): {bool=PostingsFormat(name=Asserting), cat=PostingsFormat(name=Asserting), text=BlockTreeOrds(blocksize=128)}, docValues:{}, maxPointsInLeafNode=254, maxMBSortInHeap=6.962127374890201, sim=Asserting(org.apache.lucene.search.similarities.AssertingSimilarity@503b924e), locale=id, timezone=Asia/Damascus
>    [junit4]   2> NOTE: Linux 4.4.0-112-generic amd64/Oracle Corporation 1.8.0_191 (64-bit)/cpus=4,threads=1,free=161629664,total=340787200
>    [junit4]   2> NOTE: All tests run in this JVM: [SimpleNaiveBayesClassifierTest, ConfusionMatrixGeneratorTest]
>    [junit4] Completed [10/11 (1!)] on J2 in 15.41s, 7 tests, 1 failure <<< FAILURES!
>
> [...truncated 62138 lines...]
>
> ---------------------------------------------------------------------
> To unsubscribe, e-mail: [hidden email]
> For additional commands, e-mail: [hidden email]

---------------------------------------------------------------------
To unsubscribe, e-mail: [hidden email]
For additional commands, e-mail: [hidden email]