Re: [JENKINS] Lucene-Solr-Tests-8.x - Build # 760 - Unstable

classic Classic list List threaded Threaded
1 message Options
Reply | Threaded
Open this post in threaded view
|

Re: [JENKINS] Lucene-Solr-Tests-8.x - Build # 760 - Unstable

Ishan Chattopadhyaya
Sigh. This is still failing after the fixes. I'll look into it.

On Fri, 15 Nov, 2019, 7:30 PM Apache Jenkins Server, <[hidden email]> wrote:
Build: https://builds.apache.org/job/Lucene-Solr-Tests-8.x/760/

2 tests failed.
FAILED:  org.apache.solr.cloud.api.collections.TestHdfsCloudBackupRestore.test

Error Message:
Timeout occurred while waiting response from server at: http://127.0.0.1:35347/solr

Stack Trace:
org.apache.solr.client.solrj.SolrServerException: Timeout occurred while waiting response from server at: http://127.0.0.1:35347/solr
        at __randomizedtesting.SeedInfo.seed([375F141CDBE18BCB:BF0B2BC6751DE633]:0)
        at org.apache.solr.client.solrj.impl.HttpSolrClient.executeMethod(HttpSolrClient.java:676)
        at org.apache.solr.client.solrj.impl.HttpSolrClient.request(HttpSolrClient.java:265)
        at org.apache.solr.client.solrj.impl.HttpSolrClient.request(HttpSolrClient.java:248)
        at org.apache.solr.client.solrj.impl.LBSolrClient.doRequest(LBSolrClient.java:368)
        at org.apache.solr.client.solrj.impl.LBSolrClient.request(LBSolrClient.java:296)
        at org.apache.solr.client.solrj.impl.BaseCloudSolrClient.sendRequest(BaseCloudSolrClient.java:1127)
        at org.apache.solr.client.solrj.impl.BaseCloudSolrClient.requestWithRetryOnStaleState(BaseCloudSolrClient.java:896)
        at org.apache.solr.client.solrj.impl.BaseCloudSolrClient.request(BaseCloudSolrClient.java:828)
        at org.apache.solr.client.solrj.SolrRequest.process(SolrRequest.java:211)
        at org.apache.solr.client.solrj.SolrRequest.process(SolrRequest.java:228)
        at org.apache.solr.cloud.api.collections.AbstractCloudBackupRestoreTestCase.test(AbstractCloudBackupRestoreTestCase.java:140)
        at org.apache.solr.cloud.api.collections.TestHdfsCloudBackupRestore.test(TestHdfsCloudBackupRestore.java:220)
        at sun.reflect.NativeMethodAccessorImpl.invoke0(Native Method)
        at sun.reflect.NativeMethodAccessorImpl.invoke(NativeMethodAccessorImpl.java:62)
        at sun.reflect.DelegatingMethodAccessorImpl.invoke(DelegatingMethodAccessorImpl.java:43)
        at java.lang.reflect.Method.invoke(Method.java:498)
        at com.carrotsearch.randomizedtesting.RandomizedRunner.invoke(RandomizedRunner.java:1750)
        at com.carrotsearch.randomizedtesting.RandomizedRunner$8.evaluate(RandomizedRunner.java:938)
        at com.carrotsearch.randomizedtesting.RandomizedRunner$9.evaluate(RandomizedRunner.java:974)
        at com.carrotsearch.randomizedtesting.RandomizedRunner$10.evaluate(RandomizedRunner.java:988)
        at com.carrotsearch.randomizedtesting.rules.SystemPropertiesRestoreRule$1.evaluate(SystemPropertiesRestoreRule.java:57)
        at org.apache.lucene.util.TestRuleSetupTeardownChained$1.evaluate(TestRuleSetupTeardownChained.java:49)
        at org.apache.lucene.util.AbstractBeforeAfterRule$1.evaluate(AbstractBeforeAfterRule.java:45)
        at org.apache.lucene.util.TestRuleThreadAndTestName$1.evaluate(TestRuleThreadAndTestName.java:48)
        at org.apache.lucene.util.TestRuleIgnoreAfterMaxFailures$1.evaluate(TestRuleIgnoreAfterMaxFailures.java:64)
        at org.apache.lucene.util.TestRuleMarkFailure$1.evaluate(TestRuleMarkFailure.java:47)
        at com.carrotsearch.randomizedtesting.rules.StatementAdapter.evaluate(StatementAdapter.java:36)
        at com.carrotsearch.randomizedtesting.ThreadLeakControl$StatementRunner.run(ThreadLeakControl.java:368)
        at com.carrotsearch.randomizedtesting.ThreadLeakControl.forkTimeoutingTask(ThreadLeakControl.java:817)
        at com.carrotsearch.randomizedtesting.ThreadLeakControl$3.evaluate(ThreadLeakControl.java:468)
        at com.carrotsearch.randomizedtesting.RandomizedRunner.runSingleTest(RandomizedRunner.java:947)
        at com.carrotsearch.randomizedtesting.RandomizedRunner$5.evaluate(RandomizedRunner.java:832)
        at com.carrotsearch.randomizedtesting.RandomizedRunner$6.evaluate(RandomizedRunner.java:883)
        at com.carrotsearch.randomizedtesting.RandomizedRunner$7.evaluate(RandomizedRunner.java:894)
        at com.carrotsearch.randomizedtesting.rules.StatementAdapter.evaluate(StatementAdapter.java:36)
        at com.carrotsearch.randomizedtesting.rules.SystemPropertiesRestoreRule$1.evaluate(SystemPropertiesRestoreRule.java:57)
        at org.apache.lucene.util.AbstractBeforeAfterRule$1.evaluate(AbstractBeforeAfterRule.java:45)
        at com.carrotsearch.randomizedtesting.rules.StatementAdapter.evaluate(StatementAdapter.java:36)
        at org.apache.lucene.util.TestRuleStoreClassName$1.evaluate(TestRuleStoreClassName.java:41)
        at com.carrotsearch.randomizedtesting.rules.NoShadowingOrOverridesOnMethodsRule$1.evaluate(NoShadowingOrOverridesOnMethodsRule.java:40)
        at com.carrotsearch.randomizedtesting.rules.NoShadowingOrOverridesOnMethodsRule$1.evaluate(NoShadowingOrOverridesOnMethodsRule.java:40)
        at com.carrotsearch.randomizedtesting.rules.StatementAdapter.evaluate(StatementAdapter.java:36)
        at com.carrotsearch.randomizedtesting.rules.StatementAdapter.evaluate(StatementAdapter.java:36)
        at com.carrotsearch.randomizedtesting.rules.StatementAdapter.evaluate(StatementAdapter.java:36)
        at org.apache.lucene.util.TestRuleAssertionsRequired$1.evaluate(TestRuleAssertionsRequired.java:53)
        at org.apache.lucene.util.TestRuleMarkFailure$1.evaluate(TestRuleMarkFailure.java:47)
        at org.apache.lucene.util.TestRuleIgnoreAfterMaxFailures$1.evaluate(TestRuleIgnoreAfterMaxFailures.java:64)
        at org.apache.lucene.util.TestRuleIgnoreTestSuites$1.evaluate(TestRuleIgnoreTestSuites.java:54)
        at com.carrotsearch.randomizedtesting.rules.StatementAdapter.evaluate(StatementAdapter.java:36)
        at com.carrotsearch.randomizedtesting.ThreadLeakControl$StatementRunner.run(ThreadLeakControl.java:368)
        at java.lang.Thread.run(Thread.java:748)
Caused by: java.net.SocketTimeoutException: Read timed out
        at java.net.SocketInputStream.socketRead0(Native Method)
        at java.net.SocketInputStream.socketRead(SocketInputStream.java:116)
        at java.net.SocketInputStream.read(SocketInputStream.java:171)
        at java.net.SocketInputStream.read(SocketInputStream.java:141)
        at org.apache.http.impl.io.SessionInputBufferImpl.streamRead(SessionInputBufferImpl.java:137)
        at org.apache.http.impl.io.SessionInputBufferImpl.fillBuffer(SessionInputBufferImpl.java:153)
        at org.apache.http.impl.io.SessionInputBufferImpl.readLine(SessionInputBufferImpl.java:282)
        at org.apache.http.impl.conn.DefaultHttpResponseParser.parseHead(DefaultHttpResponseParser.java:138)
        at org.apache.http.impl.conn.DefaultHttpResponseParser.parseHead(DefaultHttpResponseParser.java:56)
        at org.apache.http.impl.io.AbstractMessageParser.parse(AbstractMessageParser.java:259)
        at org.apache.http.impl.DefaultBHttpClientConnection.receiveResponseHeader(DefaultBHttpClientConnection.java:163)
        at org.apache.http.impl.conn.CPoolProxy.receiveResponseHeader(CPoolProxy.java:165)
        at org.apache.http.protocol.HttpRequestExecutor.doReceiveResponse(HttpRequestExecutor.java:273)
        at org.apache.http.protocol.HttpRequestExecutor.execute(HttpRequestExecutor.java:125)
        at org.apache.http.impl.execchain.MainClientExec.execute(MainClientExec.java:272)
        at org.apache.http.impl.execchain.ProtocolExec.execute(ProtocolExec.java:185)
        at org.apache.http.impl.execchain.RetryExec.execute(RetryExec.java:89)
        at org.apache.http.impl.execchain.RedirectExec.execute(RedirectExec.java:110)
        at org.apache.http.impl.client.InternalHttpClient.doExecute(InternalHttpClient.java:185)
        at org.apache.http.impl.client.CloseableHttpClient.execute(CloseableHttpClient.java:83)
        at org.apache.http.impl.client.CloseableHttpClient.execute(CloseableHttpClient.java:56)
        at org.apache.solr.client.solrj.impl.HttpSolrClient.executeMethod(HttpSolrClient.java:564)
        ... 50 more


FAILED:  org.apache.solr.cloud.PackageManagerCLITest.testPackageManager

Error Message:
Could not get expected value  '1.1.0' for path 'config/requestHandler/\/mypath2/_packageinfo_/version' full output: {   "responseHeader":{     "status":0,     "QTime":0},   "config":{"requestHandler":{"/mypath2":{         "name":"/mypath2",         "class":"question-answer:fullstory.QARequestHandler",         "_packageinfo_":{           "package":"question-answer",           "version":"1.0.0",           "files":["/package/question-answer/1.0.0/question-answer-request-handler-1.0.jar.tmp"],           "manifest":"/package/question-answer/1.0.0/manifest.json",           "manifestSHA512":"a91ab5a2c5abd53f0f72c256592c2be8b667cecb8226ac054aeed4d28aac9d743311442f2d58539bb83663a19bd1efb310aaadfd77bea458f3d475161721a114"}}}}},  from server:  https://127.0.0.1:46567/solr/abc

Stack Trace:
java.lang.AssertionError: Could not get expected value  '1.1.0' for path 'config/requestHandler/\/mypath2/_packageinfo_/version' full output: {
  "responseHeader":{
    "status":0,
    "QTime":0},
  "config":{"requestHandler":{"/mypath2":{
        "name":"/mypath2",
        "class":"question-answer:fullstory.QARequestHandler",
        "_packageinfo_":{
          "package":"question-answer",
          "version":"1.0.0",
          "files":["/package/question-answer/1.0.0/question-answer-request-handler-1.0.jar.tmp"],
          "manifest":"/package/question-answer/1.0.0/manifest.json",
          "manifestSHA512":"a91ab5a2c5abd53f0f72c256592c2be8b667cecb8226ac054aeed4d28aac9d743311442f2d58539bb83663a19bd1efb310aaadfd77bea458f3d475161721a114"}}}}},  from server:  https://127.0.0.1:46567/solr/abc
        at __randomizedtesting.SeedInfo.seed([375F141CDBE18BCB:34F55F72D90F5460]:0)
        at org.junit.Assert.fail(Assert.java:88)
        at org.junit.Assert.assertTrue(Assert.java:41)
        at org.apache.solr.core.TestSolrConfigHandler.testForResponseElement(TestSolrConfigHandler.java:590)
        at org.apache.solr.cloud.PackageManagerCLITest.assertPackageVersion(PackageManagerCLITest.java:149)
        at org.apache.solr.cloud.PackageManagerCLITest.testPackageManager(PackageManagerCLITest.java:129)
        at sun.reflect.NativeMethodAccessorImpl.invoke0(Native Method)
        at sun.reflect.NativeMethodAccessorImpl.invoke(NativeMethodAccessorImpl.java:62)
        at sun.reflect.DelegatingMethodAccessorImpl.invoke(DelegatingMethodAccessorImpl.java:43)
        at java.lang.reflect.Method.invoke(Method.java:498)
        at com.carrotsearch.randomizedtesting.RandomizedRunner.invoke(RandomizedRunner.java:1750)
        at com.carrotsearch.randomizedtesting.RandomizedRunner$8.evaluate(RandomizedRunner.java:938)
        at com.carrotsearch.randomizedtesting.RandomizedRunner$9.evaluate(RandomizedRunner.java:974)
        at com.carrotsearch.randomizedtesting.RandomizedRunner$10.evaluate(RandomizedRunner.java:988)
        at com.carrotsearch.randomizedtesting.rules.SystemPropertiesRestoreRule$1.evaluate(SystemPropertiesRestoreRule.java:57)
        at org.apache.lucene.util.TestRuleSetupTeardownChained$1.evaluate(TestRuleSetupTeardownChained.java:49)
        at org.apache.lucene.util.AbstractBeforeAfterRule$1.evaluate(AbstractBeforeAfterRule.java:45)
        at org.apache.lucene.util.TestRuleThreadAndTestName$1.evaluate(TestRuleThreadAndTestName.java:48)
        at org.apache.lucene.util.TestRuleIgnoreAfterMaxFailures$1.evaluate(TestRuleIgnoreAfterMaxFailures.java:64)
        at org.apache.lucene.util.TestRuleMarkFailure$1.evaluate(TestRuleMarkFailure.java:47)
        at com.carrotsearch.randomizedtesting.rules.StatementAdapter.evaluate(StatementAdapter.java:36)
        at com.carrotsearch.randomizedtesting.ThreadLeakControl$StatementRunner.run(ThreadLeakControl.java:368)
        at com.carrotsearch.randomizedtesting.ThreadLeakControl.forkTimeoutingTask(ThreadLeakControl.java:817)
        at com.carrotsearch.randomizedtesting.ThreadLeakControl$3.evaluate(ThreadLeakControl.java:468)
        at com.carrotsearch.randomizedtesting.RandomizedRunner.runSingleTest(RandomizedRunner.java:947)
        at com.carrotsearch.randomizedtesting.RandomizedRunner$5.evaluate(RandomizedRunner.java:832)
        at com.carrotsearch.randomizedtesting.RandomizedRunner$6.evaluate(RandomizedRunner.java:883)
        at com.carrotsearch.randomizedtesting.RandomizedRunner$7.evaluate(RandomizedRunner.java:894)
        at com.carrotsearch.randomizedtesting.rules.StatementAdapter.evaluate(StatementAdapter.java:36)
        at com.carrotsearch.randomizedtesting.rules.SystemPropertiesRestoreRule$1.evaluate(SystemPropertiesRestoreRule.java:57)
        at org.apache.lucene.util.AbstractBeforeAfterRule$1.evaluate(AbstractBeforeAfterRule.java:45)
        at com.carrotsearch.randomizedtesting.rules.StatementAdapter.evaluate(StatementAdapter.java:36)
        at org.apache.lucene.util.TestRuleStoreClassName$1.evaluate(TestRuleStoreClassName.java:41)
        at com.carrotsearch.randomizedtesting.rules.NoShadowingOrOverridesOnMethodsRule$1.evaluate(NoShadowingOrOverridesOnMethodsRule.java:40)
        at com.carrotsearch.randomizedtesting.rules.NoShadowingOrOverridesOnMethodsRule$1.evaluate(NoShadowingOrOverridesOnMethodsRule.java:40)
        at com.carrotsearch.randomizedtesting.rules.StatementAdapter.evaluate(StatementAdapter.java:36)
        at com.carrotsearch.randomizedtesting.rules.StatementAdapter.evaluate(StatementAdapter.java:36)
        at com.carrotsearch.randomizedtesting.rules.StatementAdapter.evaluate(StatementAdapter.java:36)
        at org.apache.lucene.util.TestRuleAssertionsRequired$1.evaluate(TestRuleAssertionsRequired.java:53)
        at org.apache.lucene.util.TestRuleMarkFailure$1.evaluate(TestRuleMarkFailure.java:47)
        at org.apache.lucene.util.TestRuleIgnoreAfterMaxFailures$1.evaluate(TestRuleIgnoreAfterMaxFailures.java:64)
        at org.apache.lucene.util.TestRuleIgnoreTestSuites$1.evaluate(TestRuleIgnoreTestSuites.java:54)
        at com.carrotsearch.randomizedtesting.rules.StatementAdapter.evaluate(StatementAdapter.java:36)
        at com.carrotsearch.randomizedtesting.ThreadLeakControl$StatementRunner.run(ThreadLeakControl.java:368)
        at java.lang.Thread.run(Thread.java:748)




Build Log:
[...truncated 14882 lines...]
   [junit4] Suite: org.apache.solr.cloud.PackageManagerCLITest
   [junit4]   2> 1497692 INFO  (SUITE-PackageManagerCLITest-seed#[375F141CDBE18BCB]-worker) [     ] o.a.s.SolrTestCaseJ4 SecureRandom sanity checks: test.solr.allowed.securerandom=null & java.security.egd=file:/dev/./urandom
   [junit4]   2> 1497693 INFO  (SUITE-PackageManagerCLITest-seed#[375F141CDBE18BCB]-worker) [     ] o.a.s.SolrTestCaseJ4 Created dataDir: /home/jenkins/jenkins-slave/workspace/Lucene-Solr-Tests-8.x/solr/build/solr-core/test/J2/temp/solr.cloud.PackageManagerCLITest_375F141CDBE18BCB-001/data-dir-171-001
   [junit4]   2> 1497693 WARN  (SUITE-PackageManagerCLITest-seed#[375F141CDBE18BCB]-worker) [     ] o.a.s.SolrTestCaseJ4 startTrackingSearchers: numOpens=16 numCloses=16
   [junit4]   2> 1497693 INFO  (SUITE-PackageManagerCLITest-seed#[375F141CDBE18BCB]-worker) [     ] o.a.s.SolrTestCaseJ4 Using PointFields (NUMERIC_POINTS_SYSPROP=true) w/NUMERIC_DOCVALUES_SYSPROP=true
   [junit4]   2> 1497694 INFO  (SUITE-PackageManagerCLITest-seed#[375F141CDBE18BCB]-worker) [     ] o.a.s.SolrTestCaseJ4 Randomized ssl (true) and clientAuth (false) via: @org.apache.solr.util.RandomizeSSL(reason=, ssl=NaN, value=NaN, clientAuth=NaN)
   [junit4]   2> 1497695 INFO  (SUITE-PackageManagerCLITest-seed#[375F141CDBE18BCB]-worker) [     ] o.a.s.c.MiniSolrCloudCluster Starting cluster of 1 servers in /home/jenkins/jenkins-slave/workspace/Lucene-Solr-Tests-8.x/solr/build/solr-core/test/J2/temp/solr.cloud.PackageManagerCLITest_375F141CDBE18BCB-001/tempDir-001
   [junit4]   2> 1497695 INFO  (SUITE-PackageManagerCLITest-seed#[375F141CDBE18BCB]-worker) [     ] o.a.s.c.ZkTestServer STARTING ZK TEST SERVER
   [junit4]   2> 1497695 INFO  (ZkTestServer Run Thread) [     ] o.a.s.c.ZkTestServer client port:0.0.0.0/0.0.0.0:0
   [junit4]   2> 1497695 INFO  (ZkTestServer Run Thread) [     ] o.a.s.c.ZkTestServer Starting server
   [junit4]   2> 1497795 INFO  (SUITE-PackageManagerCLITest-seed#[375F141CDBE18BCB]-worker) [     ] o.a.s.c.ZkTestServer start zk server on port:41777
   [junit4]   2> 1497795 INFO  (SUITE-PackageManagerCLITest-seed#[375F141CDBE18BCB]-worker) [     ] o.a.s.c.ZkTestServer waitForServerUp: 127.0.0.1:41777
   [junit4]   2> 1497795 INFO  (SUITE-PackageManagerCLITest-seed#[375F141CDBE18BCB]-worker) [     ] o.a.s.c.ZkTestServer parse host and port list: 127.0.0.1:41777
   [junit4]   2> 1497795 INFO  (SUITE-PackageManagerCLITest-seed#[375F141CDBE18BCB]-worker) [     ] o.a.s.c.ZkTestServer connecting to 127.0.0.1 41777
   [junit4]   2> 1497797 INFO  (SUITE-PackageManagerCLITest-seed#[375F141CDBE18BCB]-worker) [     ] o.a.s.c.c.ConnectionManager Waiting for client to connect to ZooKeeper
   [junit4]   2> 1497799 INFO  (zkConnectionManagerCallback-9036-thread-1) [     ] o.a.s.c.c.ConnectionManager zkClient has connected
   [junit4]   2> 1497799 INFO  (SUITE-PackageManagerCLITest-seed#[375F141CDBE18BCB]-worker) [     ] o.a.s.c.c.ConnectionManager Client is connected to ZooKeeper
   [junit4]   2> 1497800 INFO  (SUITE-PackageManagerCLITest-seed#[375F141CDBE18BCB]-worker) [     ] o.a.s.c.c.ConnectionManager Waiting for client to connect to ZooKeeper
   [junit4]   2> 1497801 INFO  (zkConnectionManagerCallback-9038-thread-1) [     ] o.a.s.c.c.ConnectionManager zkClient has connected
   [junit4]   2> 1497801 INFO  (SUITE-PackageManagerCLITest-seed#[375F141CDBE18BCB]-worker) [     ] o.a.s.c.c.ConnectionManager Client is connected to ZooKeeper
   [junit4]   2> 1497802 INFO  (SUITE-PackageManagerCLITest-seed#[375F141CDBE18BCB]-worker) [     ] o.a.s.c.c.ConnectionManager Waiting for client to connect to ZooKeeper
   [junit4]   2> 1497802 INFO  (zkConnectionManagerCallback-9040-thread-1) [     ] o.a.s.c.c.ConnectionManager zkClient has connected
   [junit4]   2> 1497802 INFO  (SUITE-PackageManagerCLITest-seed#[375F141CDBE18BCB]-worker) [     ] o.a.s.c.c.ConnectionManager Client is connected to ZooKeeper
   [junit4]   2> 1497906 WARN  (jetty-launcher-9041-thread-1) [     ] o.e.j.s.AbstractConnector Ignoring deprecated socket close linger time
   [junit4]   2> 1497906 INFO  (jetty-launcher-9041-thread-1) [     ] o.a.s.c.s.e.JettySolrRunner Start Jetty (configured port=0, binding port=0)
   [junit4]   2> 1497906 INFO  (jetty-launcher-9041-thread-1) [     ] o.a.s.c.s.e.JettySolrRunner Trying to start Jetty on port 0 try number 1 ...
   [junit4]   2> 1497906 INFO  (jetty-launcher-9041-thread-1) [     ] o.e.j.s.Server jetty-9.4.19.v20190610; built: 2019-06-10T16:30:51.723Z; git: afcf563148970e98786327af5e07c261fda175d3; jvm 1.8.0_191-b12
   [junit4]   2> 1497907 INFO  (jetty-launcher-9041-thread-1) [     ] o.e.j.s.session DefaultSessionIdManager workerName=node0
   [junit4]   2> 1497907 INFO  (jetty-launcher-9041-thread-1) [     ] o.e.j.s.session No SessionScavenger set, using defaults
   [junit4]   2> 1497907 INFO  (jetty-launcher-9041-thread-1) [     ] o.e.j.s.session node0 Scavenging every 600000ms
   [junit4]   2> 1497907 INFO  (jetty-launcher-9041-thread-1) [     ] o.e.j.s.h.ContextHandler Started o.e.j.s.ServletContextHandler@3c0fec06{/solr,null,AVAILABLE}
   [junit4]   2> 1497907 INFO  (jetty-launcher-9041-thread-1) [     ] o.e.j.s.AbstractConnector Started ServerConnector@3264cbd2{SSL,[ssl, http/1.1]}{127.0.0.1:46567}
   [junit4]   2> 1497907 INFO  (jetty-launcher-9041-thread-1) [     ] o.e.j.s.Server Started @1497943ms
   [junit4]   2> 1497908 INFO  (jetty-launcher-9041-thread-1) [     ] o.a.s.c.s.e.JettySolrRunner Jetty properties: {hostContext=/solr, hostPort=46567}
   [junit4]   2> 1497908 ERROR (jetty-launcher-9041-thread-1) [     ] o.a.s.u.StartupLoggingUtils Missing Java Option solr.log.dir. Logging may be missing or incomplete.
   [junit4]   2> 1497908 INFO  (jetty-launcher-9041-thread-1) [     ] o.a.s.s.SolrDispatchFilter Using logger factory org.apache.logging.slf4j.Log4jLoggerFactory
   [junit4]   2> 1497908 INFO  (jetty-launcher-9041-thread-1) [     ] o.a.s.s.SolrDispatchFilter  ___      _       Welcome to Apache Solr™ version 8.4.0
   [junit4]   2> 1497908 INFO  (jetty-launcher-9041-thread-1) [     ] o.a.s.s.SolrDispatchFilter / __| ___| |_ _   Starting in cloud mode on port null
   [junit4]   2> 1497908 INFO  (jetty-launcher-9041-thread-1) [     ] o.a.s.s.SolrDispatchFilter \__ \/ _ \ | '_|  Install dir: null
   [junit4]   2> 1497908 INFO  (jetty-launcher-9041-thread-1) [     ] o.a.s.s.SolrDispatchFilter |___/\___/_|_|    Start time: 2019-11-15T13:19:11.348Z
   [junit4]   2> 1497908 INFO  (jetty-launcher-9041-thread-1) [     ] o.a.s.c.c.ConnectionManager Waiting for client to connect to ZooKeeper
   [junit4]   2> 1497909 INFO  (zkConnectionManagerCallback-9043-thread-1) [     ] o.a.s.c.c.ConnectionManager zkClient has connected
   [junit4]   2> 1497909 INFO  (jetty-launcher-9041-thread-1) [     ] o.a.s.c.c.ConnectionManager Client is connected to ZooKeeper
   [junit4]   2> 1497910 INFO  (jetty-launcher-9041-thread-1) [     ] o.a.s.s.SolrDispatchFilter solr.xml found in ZooKeeper. Loading...
   [junit4]   2> 1498087 INFO  (jetty-launcher-9041-thread-1) [     ] o.a.s.h.c.HttpShardHandlerFactory Host whitelist initialized: WhitelistHostChecker [whitelistHosts=null, whitelistHostCheckingEnabled=true]
   [junit4]   2> 1498088 WARN  (jetty-launcher-9041-thread-1) [     ] o.a.s.c.s.i.Http2SolrClient Create Http2SolrClient with HTTP/1.1 transport since Java 8 or lower versions does not support SSL + HTTP/2
   [junit4]   2> 1498088 WARN  (jetty-launcher-9041-thread-1) [     ] o.e.j.u.s.S.config Trusting all certificates configured for Client@34762855[provider=null,keyStore=null,trustStore=null]
   [junit4]   2> 1498088 WARN  (jetty-launcher-9041-thread-1) [     ] o.e.j.u.s.S.config No Client EndPointIdentificationAlgorithm configured for Client@34762855[provider=null,keyStore=null,trustStore=null]
   [junit4]   2> 1498090 WARN  (jetty-launcher-9041-thread-1) [     ] o.a.s.c.s.i.Http2SolrClient Create Http2SolrClient with HTTP/1.1 transport since Java 8 or lower versions does not support SSL + HTTP/2
   [junit4]   2> 1498091 WARN  (jetty-launcher-9041-thread-1) [     ] o.e.j.u.s.S.config Trusting all certificates configured for Client@5f23410b[provider=null,keyStore=null,trustStore=null]
   [junit4]   2> 1498091 WARN  (jetty-launcher-9041-thread-1) [     ] o.e.j.u.s.S.config No Client EndPointIdentificationAlgorithm configured for Client@5f23410b[provider=null,keyStore=null,trustStore=null]
   [junit4]   2> 1498092 INFO  (jetty-launcher-9041-thread-1) [     ] o.a.s.c.ZkContainer Zookeeper client=127.0.0.1:41777/solr
   [junit4]   2> 1498092 INFO  (jetty-launcher-9041-thread-1) [     ] o.a.s.c.c.ConnectionManager Waiting for client to connect to ZooKeeper
   [junit4]   2> 1498093 INFO  (zkConnectionManagerCallback-9050-thread-1) [     ] o.a.s.c.c.ConnectionManager zkClient has connected
   [junit4]   2> 1498093 INFO  (jetty-launcher-9041-thread-1) [     ] o.a.s.c.c.ConnectionManager Client is connected to ZooKeeper
   [junit4]   2> 1498195 INFO  (jetty-launcher-9041-thread-1) [n:127.0.0.1:46567_solr     ] o.a.s.c.c.ConnectionManager Waiting for client to connect to ZooKeeper
   [junit4]   2> 1498196 INFO  (zkConnectionManagerCallback-9052-thread-1) [     ] o.a.s.c.c.ConnectionManager zkClient has connected
   [junit4]   2> 1498196 INFO  (jetty-launcher-9041-thread-1) [n:127.0.0.1:46567_solr     ] o.a.s.c.c.ConnectionManager Client is connected to ZooKeeper
   [junit4]   2> 1498240 INFO  (jetty-launcher-9041-thread-1) [n:127.0.0.1:46567_solr     ] o.a.s.c.OverseerElectionContext I am going to be the leader 127.0.0.1:46567_solr
   [junit4]   2> 1498240 INFO  (jetty-launcher-9041-thread-1) [n:127.0.0.1:46567_solr     ] o.a.s.c.Overseer Overseer (id=72729046034481157-127.0.0.1:46567_solr-n_0000000000) starting
   [junit4]   2> 1498243 INFO  (OverseerStateUpdate-72729046034481157-127.0.0.1:46567_solr-n_0000000000) [n:127.0.0.1:46567_solr     ] o.a.s.c.Overseer Starting to work on the main queue : 127.0.0.1:46567_solr
   [junit4]   2> 1498244 INFO  (jetty-launcher-9041-thread-1) [n:127.0.0.1:46567_solr     ] o.a.s.c.ZkController Register node as live in ZooKeeper:/live_nodes/127.0.0.1:46567_solr
   [junit4]   2> 1498245 INFO  (zkCallback-9051-thread-1) [     ] o.a.s.c.c.ZkStateReader Updated live nodes from ZooKeeper... (0) -> (1)
   [junit4]   2> 1498258 INFO  (jetty-launcher-9041-thread-1) [n:127.0.0.1:46567_solr     ] o.a.s.h.a.MetricsHistoryHandler No .system collection, keeping metrics history in memory.
   [junit4]   2> 1498276 INFO  (jetty-launcher-9041-thread-1) [n:127.0.0.1:46567_solr     ] o.a.s.m.r.SolrJmxReporter JMX monitoring for 'solr_46567.solr.node' (registry 'solr.node') enabled at server: com.sun.jmx.mbeanserver.JmxMBeanServer@41b42145
   [junit4]   2> 1498281 INFO  (jetty-launcher-9041-thread-1) [n:127.0.0.1:46567_solr     ] o.a.s.m.r.SolrJmxReporter JMX monitoring for 'solr_46567.solr.jvm' (registry 'solr.jvm') enabled at server: com.sun.jmx.mbeanserver.JmxMBeanServer@41b42145
   [junit4]   2> 1498281 INFO  (jetty-launcher-9041-thread-1) [n:127.0.0.1:46567_solr     ] o.a.s.m.r.SolrJmxReporter JMX monitoring for 'solr_46567.solr.jetty' (registry 'solr.jetty') enabled at server: com.sun.jmx.mbeanserver.JmxMBeanServer@41b42145
   [junit4]   2> 1498282 INFO  (jetty-launcher-9041-thread-1) [n:127.0.0.1:46567_solr     ] o.a.s.p.PackageLoader /packages.json updated to version -1
   [junit4]   2> 1498283 INFO  (jetty-launcher-9041-thread-1) [n:127.0.0.1:46567_solr     ] o.a.s.c.CorePropertiesLocator Found 0 core definitions underneath /home/jenkins/jenkins-slave/workspace/Lucene-Solr-Tests-8.x/solr/build/solr-core/test/J2/temp/solr.cloud.PackageManagerCLITest_375F141CDBE18BCB-001/tempDir-001/node1/.
   [junit4]   2> 1498295 INFO  (SUITE-PackageManagerCLITest-seed#[375F141CDBE18BCB]-worker) [     ] o.a.s.c.MiniSolrCloudCluster waitForAllNodes: numServers=1
   [junit4]   2> 1498295 INFO  (SUITE-PackageManagerCLITest-seed#[375F141CDBE18BCB]-worker) [     ] o.a.s.c.c.ConnectionManager Waiting for client to connect to ZooKeeper
   [junit4]   2> 1498296 INFO  (zkConnectionManagerCallback-9061-thread-1) [     ] o.a.s.c.c.ConnectionManager zkClient has connected
   [junit4]   2> 1498296 INFO  (SUITE-PackageManagerCLITest-seed#[375F141CDBE18BCB]-worker) [     ] o.a.s.c.c.ConnectionManager Client is connected to ZooKeeper
   [junit4]   2> 1498297 INFO  (SUITE-PackageManagerCLITest-seed#[375F141CDBE18BCB]-worker) [     ] o.a.s.c.c.ZkStateReader Updated live nodes from ZooKeeper... (0) -> (1)
   [junit4]   2> 1498297 INFO  (SUITE-PackageManagerCLITest-seed#[375F141CDBE18BCB]-worker) [     ] o.a.s.c.s.i.ZkClientClusterStateProvider Cluster at 127.0.0.1:41777/solr ready
   [junit4]   2> 1498308 INFO  (SUITE-PackageManagerCLITest-seed#[375F141CDBE18BCB]-worker) [     ] o.e.j.s.Server jetty-9.4.19.v20190610; built: 2019-06-10T16:30:51.723Z; git: afcf563148970e98786327af5e07c261fda175d3; jvm 1.8.0_191-b12
   [junit4]   2> 1498308 INFO  (SUITE-PackageManagerCLITest-seed#[375F141CDBE18BCB]-worker) [     ] o.e.j.s.AbstractConnector Started ServerConnector@43e6e3b7{HTTP/1.1,[http/1.1]}{0.0.0.0:46223}
   [junit4]   2> 1498309 INFO  (SUITE-PackageManagerCLITest-seed#[375F141CDBE18BCB]-worker) [     ] o.e.j.s.Server Started @1498344ms
   [junit4]   2> 1498323 INFO  (TEST-PackageManagerCLITest.testPackageManager-seed#[375F141CDBE18BCB]) [     ] o.a.s.SolrTestCaseJ4 ###Starting testPackageManager
   [junit4]   2> 1498328 INFO  (TEST-PackageManagerCLITest.testPackageManager-seed#[375F141CDBE18BCB]) [     ] o.a.s.u.PackageTool Solr url: https://127.0.0.1:46567/solr, solr base url: https://127.0.0.1:46567
   [junit4]   2> 1498342 INFO  (qtp949788834-27977) [n:127.0.0.1:46567_solr     ] o.a.s.s.HttpSolrCall [admin] webapp=null path=/admin/info/system params={wt=json} status=0 QTime=6
   [junit4]   2> 1498344 INFO  (qtp949788834-27973) [n:127.0.0.1:46567_solr     ] o.a.s.h.a.CollectionsHandler Invoked Collection Action :clusterstatus with params action=CLUSTERSTATUS&wt=json and sendToOCPQueue=true
   [junit4]   2> 1498344 INFO  (qtp949788834-27973) [n:127.0.0.1:46567_solr     ] o.a.s.s.HttpSolrCall [admin] webapp=null path=/admin/collections params={action=CLUSTERSTATUS&wt=json} status=0 QTime=0
   [junit4]   2> 1498345 INFO  (TEST-PackageManagerCLITest.testPackageManager-seed#[375F141CDBE18BCB]) [     ] o.a.s.u.PackageTool ZK: 127.0.0.1:41777/solr
   [junit4]   2> 1498351 INFO  (TEST-PackageManagerCLITest.testPackageManager-seed#[375F141CDBE18BCB]) [     ] o.a.s.c.c.ConnectionManager Waiting for client to connect to ZooKeeper
   [junit4]   2> 1498352 INFO  (zkConnectionManagerCallback-9063-thread-1) [     ] o.a.s.c.c.ConnectionManager zkClient has connected
   [junit4]   2> 1498352 INFO  (TEST-PackageManagerCLITest.testPackageManager-seed#[375F141CDBE18BCB]) [     ] o.a.s.c.c.ConnectionManager Client is connected to ZooKeeper
   [junit4]   2> 1498352 INFO  (TEST-PackageManagerCLITest.testPackageManager-seed#[375F141CDBE18BCB]) [     ] o.a.s.p.PackageManager Done initializing a zkClient instance...
   [junit4]   1>  [32mInstalled packages:
   [junit4]   1> ----- [0m
   [junit4]   2> 1498358 INFO  (TEST-PackageManagerCLITest.testPackageManager-seed#[375F141CDBE18BCB]) [     ] o.a.s.p.PackageManager Getting packages from packages.json...
   [junit4]   2> 1498359 INFO  (TEST-PackageManagerCLITest.testPackageManager-seed#[375F141CDBE18BCB]) [     ] o.a.s.p.PackageManager Got packages: []
   [junit4]   2> 1498460 INFO  (TEST-PackageManagerCLITest.testPackageManager-seed#[375F141CDBE18BCB]) [     ] o.a.s.u.PackageTool Finished: list-installed
   [junit4]   2> 1498460 INFO  (TEST-PackageManagerCLITest.testPackageManager-seed#[375F141CDBE18BCB]) [     ] o.a.s.u.PackageTool Solr url: https://127.0.0.1:46567/solr, solr base url: https://127.0.0.1:46567
   [junit4]   2> 1498469 INFO  (qtp949788834-27973) [n:127.0.0.1:46567_solr     ] o.a.s.s.HttpSolrCall [admin] webapp=null path=/admin/info/system params={wt=json} status=0 QTime=5
   [junit4]   2> 1498470 INFO  (qtp949788834-27975) [n:127.0.0.1:46567_solr     ] o.a.s.h.a.CollectionsHandler Invoked Collection Action :clusterstatus with params action=CLUSTERSTATUS&wt=json and sendToOCPQueue=true
   [junit4]   2> 1498471 INFO  (qtp949788834-27975) [n:127.0.0.1:46567_solr     ] o.a.s.s.HttpSolrCall [admin] webapp=null path=/admin/collections params={action=CLUSTERSTATUS&wt=json} status=0 QTime=0
   [junit4]   2> 1498471 INFO  (TEST-PackageManagerCLITest.testPackageManager-seed#[375F141CDBE18BCB]) [     ] o.a.s.u.PackageTool ZK: 127.0.0.1:41777/solr
   [junit4]   2> 1498472 INFO  (TEST-PackageManagerCLITest.testPackageManager-seed#[375F141CDBE18BCB]) [     ] o.a.s.c.c.ConnectionManager Waiting for client to connect to ZooKeeper
   [junit4]   2> 1498473 INFO  (zkConnectionManagerCallback-9065-thread-1) [     ] o.a.s.c.c.ConnectionManager zkClient has connected
   [junit4]   2> 1498473 INFO  (TEST-PackageManagerCLITest.testPackageManager-seed#[375F141CDBE18BCB]) [     ] o.a.s.c.c.ConnectionManager Client is connected to ZooKeeper
   [junit4]   2> 1498473 INFO  (TEST-PackageManagerCLITest.testPackageManager-seed#[375F141CDBE18BCB]) [     ] o.a.s.p.PackageManager Done initializing a zkClient instance...
   [junit4]   2> 1498473 INFO  (TEST-PackageManagerCLITest.testPackageManager-seed#[375F141CDBE18BCB]) [     ] o.a.s.p.RepositoryManager []
   [junit4]   1>  [32mAdded repository: fullstory [0m
   [junit4]   2> 1498612 INFO  (TEST-PackageManagerCLITest.testPackageManager-seed#[375F141CDBE18BCB]) [     ] o.a.s.u.PackageTool Finished: add-repo
   [junit4]   2> 1498612 INFO  (TEST-PackageManagerCLITest.testPackageManager-seed#[375F141CDBE18BCB]) [     ] o.a.s.u.PackageTool Solr url: https://127.0.0.1:46567/solr, solr base url: https://127.0.0.1:46567
   [junit4]   2> 1498623 INFO  (qtp949788834-27975) [n:127.0.0.1:46567_solr     ] o.a.s.s.HttpSolrCall [admin] webapp=null path=/admin/info/system params={wt=json} status=0 QTime=8
   [junit4]   2> 1498625 INFO  (qtp949788834-27974) [n:127.0.0.1:46567_solr     ] o.a.s.h.a.CollectionsHandler Invoked Collection Action :clusterstatus with params action=CLUSTERSTATUS&wt=json and sendToOCPQueue=true
   [junit4]   2> 1498625 INFO  (qtp949788834-27974) [n:127.0.0.1:46567_solr     ] o.a.s.s.HttpSolrCall [admin] webapp=null path=/admin/collections params={action=CLUSTERSTATUS&wt=json} status=0 QTime=0
   [junit4]   2> 1498626 INFO  (TEST-PackageManagerCLITest.testPackageManager-seed#[375F141CDBE18BCB]) [     ] o.a.s.u.PackageTool ZK: 127.0.0.1:41777/solr
   [junit4]   2> 1498627 INFO  (TEST-PackageManagerCLITest.testPackageManager-seed#[375F141CDBE18BCB]) [     ] o.a.s.c.c.ConnectionManager Waiting for client to connect to ZooKeeper
   [junit4]   2> 1498628 INFO  (zkConnectionManagerCallback-9067-thread-1) [     ] o.a.s.c.c.ConnectionManager zkClient has connected
   [junit4]   2> 1498628 INFO  (TEST-PackageManagerCLITest.testPackageManager-seed#[375F141CDBE18BCB]) [     ] o.a.s.c.c.ConnectionManager Client is connected to ZooKeeper
   [junit4]   2> 1498628 INFO  (TEST-PackageManagerCLITest.testPackageManager-seed#[375F141CDBE18BCB]) [     ] o.a.s.p.PackageManager Done initializing a zkClient instance...
   [junit4]   1>  [32mAvailable packages:
   [junit4]   1> ----- [0m
   [junit4]   1>  [32mquestion-answer           A natural language question answering plugin [0m
   [junit4]   1>  [32m  Version: 1.0.0 [0m
   [junit4]   1>  [32m  Version: 1.1.0 [0m
   [junit4]   2> 1498739 INFO  (TEST-PackageManagerCLITest.testPackageManager-seed#[375F141CDBE18BCB]) [     ] o.a.s.u.PackageTool Finished: list-available
   [junit4]   2> 1498740 INFO  (TEST-PackageManagerCLITest.testPackageManager-seed#[375F141CDBE18BCB]) [     ] o.a.s.u.PackageTool Solr url: https://127.0.0.1:46567/solr, solr base url: https://127.0.0.1:46567
   [junit4]   2> 1498748 INFO  (qtp949788834-27977) [n:127.0.0.1:46567_solr     ] o.a.s.s.HttpSolrCall [admin] webapp=null path=/admin/info/system params={wt=json} status=0 QTime=5
   [junit4]   2> 1498750 INFO  (qtp949788834-27973) [n:127.0.0.1:46567_solr     ] o.a.s.h.a.CollectionsHandler Invoked Collection Action :clusterstatus with params action=CLUSTERSTATUS&wt=json and sendToOCPQueue=true
   [junit4]   2> 1498750 INFO  (qtp949788834-27973) [n:127.0.0.1:46567_solr     ] o.a.s.s.HttpSolrCall [admin] webapp=null path=/admin/collections params={action=CLUSTERSTATUS&wt=json} status=0 QTime=0
   [junit4]   2> 1498750 INFO  (TEST-PackageManagerCLITest.testPackageManager-seed#[375F141CDBE18BCB]) [     ] o.a.s.u.PackageTool ZK: 127.0.0.1:41777/solr
   [junit4]   2> 1498752 INFO  (TEST-PackageManagerCLITest.testPackageManager-seed#[375F141CDBE18BCB]) [     ] o.a.s.c.c.ConnectionManager Waiting for client to connect to ZooKeeper
   [junit4]   2> 1498752 INFO  (zkConnectionManagerCallback-9069-thread-1) [     ] o.a.s.c.c.ConnectionManager zkClient has connected
   [junit4]   2> 1498752 INFO  (TEST-PackageManagerCLITest.testPackageManager-seed#[375F141CDBE18BCB]) [     ] o.a.s.c.c.ConnectionManager Client is connected to ZooKeeper
   [junit4]   2> 1498752 INFO  (TEST-PackageManagerCLITest.testPackageManager-seed#[375F141CDBE18BCB]) [     ] o.a.s.p.PackageManager Done initializing a zkClient instance...
   [junit4]   2> 1498782 INFO  (TEST-PackageManagerCLITest.testPackageManager-seed#[375F141CDBE18BCB]) [     ] o.a.s.p.PackageManager Getting packages from packages.json...
   [junit4]   2> 1498782 INFO  (TEST-PackageManagerCLITest.testPackageManager-seed#[375F141CDBE18BCB]) [     ] o.a.s.p.PackageManager Got packages: []
   [junit4]   1>  [32mPosting manifest... [0m
   [junit4]   2> 1498823 INFO  (qtp949788834-27973) [n:127.0.0.1:46567_solr     ] o.a.s.f.DistribPackageStore Missing file in package store: /package/question-answer/1.0.0/manifest.json
   [junit4]   2> 1498823 INFO  (qtp949788834-27973) [n:127.0.0.1:46567_solr     ] o.a.s.f.DistribPackageStore Unable to download file : /package/question-answer/1.0.0/manifest.json
   [junit4]   2> 1498828 INFO  (qtp949788834-27973) [n:127.0.0.1:46567_solr     ] o.a.s.f.DistribPackageStore persisted a file /package/question-answer/1.0.0/manifest.json and metadata. sizes 809 144
   [junit4]   2> 1498839 INFO  (qtp949788834-27973) [n:127.0.0.1:46567_solr     ] o.a.s.s.HttpSolrCall [admin] webapp=null path=/cluster/files/package/question-answer/1.0.0/manifest.json params={wt=javabin&version=2} status=0 QTime=23
   [junit4]   1>  [32mPosting artifacts... [0m
   [junit4]   2> 1498842 INFO  (qtp949788834-27976) [n:127.0.0.1:46567_solr     ] o.a.s.f.DistribPackageStore Missing file in package store: /package/question-answer/1.0.0/question-answer-request-handler-1.0.jar.tmp
   [junit4]   2> 1498842 INFO  (qtp949788834-27976) [n:127.0.0.1:46567_solr     ] o.a.s.f.DistribPackageStore Unable to download file : /package/question-answer/1.0.0/question-answer-request-handler-1.0.jar.tmp
   [junit4]   2> 1498847 INFO  (qtp949788834-27976) [n:127.0.0.1:46567_solr     ] o.a.s.f.DistribPackageStore persisted a file /package/question-answer/1.0.0/question-answer-request-handler-1.0.jar.tmp and metadata. sizes 5579 246
   [junit4]   2> 1498856 INFO  (qtp949788834-27976) [n:127.0.0.1:46567_solr     ] o.a.s.s.HttpSolrCall [admin] webapp=null path=/cluster/files/package/question-answer/1.0.0/question-answer-request-handler-1.0.jar.tmp params={sig=TTzgh5/usbyWg7oZ7lRwz4eQfh1FeXWvv4U85tsVthVz0MRDz9t7SmonDkegZ7OyqeoiQ4I207pifpVW%2BDRd9Q%3D%3D&wt=javabin&version=2} status=0 QTime=16
   [junit4]   1>  [32mExecuting Package API to register this package... [0m
   [junit4]   2> 1498865 INFO  (qtp949788834-27975) [n:127.0.0.1:46567_solr     ] o.a.s.p.PackageLoader /packages.json updated to version 0
   [junit4]   2> 1498865 INFO  (qtp949788834-27975) [n:127.0.0.1:46567_solr     ] o.a.s.p.PackageLoader A new package: question-answer introduced
   [junit4]   2> 1498866 INFO  (qtp949788834-27975) [n:127.0.0.1:46567_solr     ] o.a.s.p.PackageLoader A new version: 1.0.0 added for package: question-answer with artifacts [/package/question-answer/1.0.0/question-answer-request-handler-1.0.jar.tmp]
   [junit4]   2> 1498868 INFO  (qtp949788834-27975) [n:127.0.0.1:46567_solr     ] o.a.s.c.SolrResourceLoader [null] Added 1 libs to classloader, from paths: [/home/jenkins/jenkins-slave/workspace/Lucene-Solr-Tests-8.x/solr/build/solr-core/test/J2/temp/solr.cloud.PackageManagerCLITest_375F141CDBE18BCB-001/tempDir-001/node1/filestore/package/question-answer/1.0.0]
   [junit4]   2> 1498868 INFO  (qtp949788834-27975) [n:127.0.0.1:46567_solr     ] o.a.s.p.PackageLoader version: 1.0.0 is the new latest in package: question-answer
   [junit4]   2> 1498868 INFO  (qtp949788834-27975) [n:127.0.0.1:46567_solr     ] o.a.s.s.HttpSolrCall [admin] webapp=null path=/cluster/package params={wt=javabin&version=2} status=0 QTime=10
   [junit4]   1>  [32mResponse: {"responseHeader":{
   [junit4]   1>     "status":0,
   [junit4]   1>     "QTime":10}} [0m
   [junit4]   2> 1498869 INFO  (TEST-PackageManagerCLITest.testPackageManager-seed#[375F141CDBE18BCB]) [     ] o.a.s.p.PackageManager Getting packages from packages.json...
   [junit4]   2> 1498873 INFO  (qtp949788834-27973) [n:127.0.0.1:46567_solr     ] o.a.s.s.HttpSolrCall [admin] webapp=null path=/node/files/package/question-answer/1.0.0/manifest.json params={} status=0 QTime=0
   [junit4]   2> 1498878 INFO  (TEST-PackageManagerCLITest.testPackageManager-seed#[375F141CDBE18BCB]) [     ] o.a.s.p.PackageManager Got packages: [{
   [junit4]   2>   "name":"question-answer",
   [junit4]   2>   "version":"1.0.0"}]
   [junit4]   1>  [32m{
   [junit4]   1>   "path":"/api/collections/${collection}/config/requestHandler?componentName=${RH-HANDLER-PATH}&meta=true",
   [junit4]   1>   "method":"GET",
   [junit4]   1>   "condition":"$['config'].['requestHandler'].['${RH-HANDLER-PATH}'].['_packageinfo_'].['version']",
   [junit4]   1>   "expected":"${package-version}"} [0m
   [junit4]   1>  [32mVerifying version 1.0.0 on [], result: true [0m
   [junit4]   1>  [32morg.apache.solr.packagemanager.RepositoryManager@481ea4ae installed. [0m
   [junit4]   2> 1498880 INFO  (zkCallback-9051-thread-1) [     ] o.a.s.p.PackageLoader /packages.json updated to version 0
   [junit4]   2> 1498980 INFO  (TEST-PackageManagerCLITest.testPackageManager-seed#[375F141CDBE18BCB]) [     ] o.a.s.u.PackageTool Finished: install
   [junit4]   2> 1498980 INFO  (TEST-PackageManagerCLITest.testPackageManager-seed#[375F141CDBE18BCB]) [     ] o.a.s.u.PackageTool Solr url: https://127.0.0.1:46567/solr, solr base url: https://127.0.0.1:46567
   [junit4]   2> 1498992 INFO  (qtp949788834-27976) [n:127.0.0.1:46567_solr     ] o.a.s.s.HttpSolrCall [admin] webapp=null path=/admin/info/system params={wt=json} status=0 QTime=8
   [junit4]   2> 1498997 INFO  (qtp949788834-27977) [n:127.0.0.1:46567_solr     ] o.a.s.h.a.CollectionsHandler Invoked Collection Action :clusterstatus with params action=CLUSTERSTATUS&wt=json and sendToOCPQueue=true
   [junit4]   2> 1498997 INFO  (qtp949788834-27977) [n:127.0.0.1:46567_solr     ] o.a.s.s.HttpSolrCall [admin] webapp=null path=/admin/collections params={action=CLUSTERSTATUS&wt=json} status=0 QTime=0
   [junit4]   2> 1498998 INFO  (TEST-PackageManagerCLITest.testPackageManager-seed#[375F141CDBE18BCB]) [     ] o.a.s.u.PackageTool ZK: 127.0.0.1:41777/solr
   [junit4]   2> 1499001 INFO  (TEST-PackageManagerCLITest.testPackageManager-seed#[375F141CDBE18BCB]) [     ] o.a.s.c.c.ConnectionManager Waiting for client to connect to ZooKeeper
   [junit4]   2> 1499002 INFO  (zkConnectionManagerCallback-9071-thread-1) [     ] o.a.s.c.c.ConnectionManager zkClient has connected
   [junit4]   2> 1499002 INFO  (TEST-PackageManagerCLITest.testPackageManager-seed#[375F141CDBE18BCB]) [     ] o.a.s.c.c.ConnectionManager Client is connected to ZooKeeper
   [junit4]   2> 1499002 INFO  (TEST-PackageManagerCLITest.testPackageManager-seed#[375F141CDBE18BCB]) [     ] o.a.s.p.PackageManager Done initializing a zkClient instance...
   [junit4]   1>  [32mInstalled packages:
   [junit4]   1> ----- [0m
   [junit4]   2> 1499002 INFO  (TEST-PackageManagerCLITest.testPackageManager-seed#[375F141CDBE18BCB]) [     ] o.a.s.p.PackageManager Getting packages from packages.json...
   [junit4]   2> 1499006 INFO  (qtp949788834-27975) [n:127.0.0.1:46567_solr     ] o.a.s.s.HttpSolrCall [admin] webapp=null path=/node/files/package/question-answer/1.0.0/manifest.json params={} status=0 QTime=0
   [junit4]   2> 1499008 INFO  (TEST-PackageManagerCLITest.testPackageManager-seed#[375F141CDBE18BCB]) [     ] o.a.s.p.PackageManager Got packages: [{
   [junit4]   2>   "name":"question-answer",
   [junit4]   2>   "version":"1.0.0"}]
   [junit4]   1>  [32m{
   [junit4]   1>   "name":"question-answer",
   [junit4]   1>   "version":"1.0.0"} [0m
   [junit4]   2> 1499110 INFO  (TEST-PackageManagerCLITest.testPackageManager-seed#[375F141CDBE18BCB]) [     ] o.a.s.u.PackageTool Finished: list-installed
   [junit4]   2> 1499112 INFO  (qtp949788834-27974) [n:127.0.0.1:46567_solr     ] o.a.s.h.a.CollectionsHandler Invoked Collection Action :create with params collection.configName=conf1&name=abc&nrtReplicas=1&action=CREATE&numShards=1&wt=javabin&version=2 and sendToOCPQueue=true
   [junit4]   2> 1499114 INFO  (OverseerThreadFactory-8301-thread-1-processing-n:127.0.0.1:46567_solr) [n:127.0.0.1:46567_solr     ] o.a.s.c.a.c.CreateCollectionCmd Create collection abc
   [junit4]   2> 1499219 INFO  (OverseerStateUpdate-72729046034481157-127.0.0.1:46567_solr-n_0000000000) [n:127.0.0.1:46567_solr     ] o.a.s.c.o.SliceMutator createReplica() {
   [junit4]   2>   "operation":"ADDREPLICA",
   [junit4]   2>   "collection":"abc",
   [junit4]   2>   "shard":"shard1",
   [junit4]   2>   "core":"abc_shard1_replica_n1",
   [junit4]   2>   "state":"down",
   [junit4]   2>   "base_url":"https://127.0.0.1:46567/solr",
   [junit4]   2>   "type":"NRT",
   [junit4]   2>   "waitForFinalState":"false"}
   [junit4]   2> 1499422 INFO  (qtp949788834-27977) [n:127.0.0.1:46567_solr    x:abc_shard1_replica_n1 ] o.a.s.h.a.CoreAdminOperation core create command qt=/admin/cores&coreNodeName=core_node2&collection.configName=conf1&newCollection=true&name=abc_shard1_replica_n1&action=CREATE&numShards=1&collection=abc&shard=shard1&wt=javabin&version=2&replicaType=NRT
   [junit4]   2> 1499423 INFO  (qtp949788834-27977) [n:127.0.0.1:46567_solr    x:abc_shard1_replica_n1 ] o.a.s.c.TransientSolrCoreCacheDefault Allocating transient cache for 2147483647 transient cores
   [junit4]   2> 1500432 INFO  (qtp949788834-27977) [n:127.0.0.1:46567_solr c:abc s:shard1 r:core_node2 x:abc_shard1_replica_n1 ] o.a.s.c.SolrConfig Using Lucene MatchVersion: 8.4.0
   [junit4]   2> 1500440 INFO  (qtp949788834-27977) [n:127.0.0.1:46567_solr c:abc s:shard1 r:core_node2 x:abc_shard1_replica_n1 ] o.a.s.s.IndexSchema [abc_shard1_replica_n1] Schema name=minimal
   [junit4]   2> 1500457 INFO  (qtp949788834-27977) [n:127.0.0.1:46567_solr c:abc s:shard1 r:core_node2 x:abc_shard1_replica_n1 ] o.a.s.s.IndexSchema Loaded schema minimal/1.1 with uniqueid field id
   [junit4]   2> 1500457 INFO  (qtp949788834-27977) [n:127.0.0.1:46567_solr c:abc s:shard1 r:core_node2 x:abc_shard1_replica_n1 ] o.a.s.c.CoreContainer Creating SolrCore 'abc_shard1_replica_n1' using configuration from collection abc, trusted=true
   [junit4]   2> 1500457 INFO  (qtp949788834-27977) [n:127.0.0.1:46567_solr c:abc s:shard1 r:core_node2 x:abc_shard1_replica_n1 ] o.a.s.m.r.SolrJmxReporter JMX monitoring for 'solr_46567.solr.core.abc.shard1.replica_n1' (registry 'solr.core.abc.shard1.replica_n1') enabled at server: com.sun.jmx.mbeanserver.JmxMBeanServer@41b42145
   [junit4]   2> 1500457 INFO  (qtp949788834-27977) [n:127.0.0.1:46567_solr c:abc s:shard1 r:core_node2 x:abc_shard1_replica_n1 ] o.a.s.c.SolrCore [[abc_shard1_replica_n1] ] Opening new SolrCore at [/home/jenkins/jenkins-slave/workspace/Lucene-Solr-Tests-8.x/solr/build/solr-core/test/J2/temp/solr.cloud.PackageManagerCLITest_375F141CDBE18BCB-001/tempDir-001/node1/abc_shard1_replica_n1], dataDir=[/home/jenkins/jenkins-slave/workspace/Lucene-Solr-Tests-8.x/solr/build/solr-core/test/J2/temp/solr.cloud.PackageManagerCLITest_375F141CDBE18BCB-001/tempDir-001/node1/./abc_shard1_replica_n1/data/]
   [junit4]   2> 1500487 INFO  (qtp949788834-27977) [n:127.0.0.1:46567_solr c:abc s:shard1 r:core_node2 x:abc_shard1_replica_n1 ] o.a.s.u.UpdateHandler Using UpdateLog implementation: org.apache.solr.update.UpdateLog
   [junit4]   2> 1500487 INFO  (qtp949788834-27977) [n:127.0.0.1:46567_solr c:abc s:shard1 r:core_node2 x:abc_shard1_replica_n1 ] o.a.s.u.UpdateLog Initializing UpdateLog: dataDir=null defaultSyncLevel=FLUSH numRecordsToKeep=100 maxNumLogsToKeep=10 numVersionBuckets=65536
   [junit4]   2> 1500489 INFO  (qtp949788834-27977) [n:127.0.0.1:46567_solr c:abc s:shard1 r:core_node2 x:abc_shard1_replica_n1 ] o.a.s.u.CommitTracker Hard AutoCommit: disabled
   [junit4]   2> 1500489 INFO  (qtp949788834-27977) [n:127.0.0.1:46567_solr c:abc s:shard1 r:core_node2 x:abc_shard1_replica_n1 ] o.a.s.u.CommitTracker Soft AutoCommit: disabled
   [junit4]   2> 1500489 INFO  (qtp949788834-27977) [n:127.0.0.1:46567_solr c:abc s:shard1 r:core_node2 x:abc_shard1_replica_n1 ] o.a.s.s.SolrIndexSearcher Opening [Searcher@2ebec534[abc_shard1_replica_n1] main]
   [junit4]   2> 1500490 INFO  (qtp949788834-27977) [n:127.0.0.1:46567_solr c:abc s:shard1 r:core_node2 x:abc_shard1_replica_n1 ] o.a.s.r.ManagedResourceStorage Configured ZooKeeperStorageIO with znodeBase: /configs/conf1
   [junit4]   2> 1500491 INFO  (qtp949788834-27977) [n:127.0.0.1:46567_solr c:abc s:shard1 r:core_node2 x:abc_shard1_replica_n1 ] o.a.s.r.ManagedResourceStorage Loaded null at path _rest_managed.json using ZooKeeperStorageIO:path=/configs/conf1
   [junit4]   2> 1500491 INFO  (qtp949788834-27977) [n:127.0.0.1:46567_solr c:abc s:shard1 r:core_node2 x:abc_shard1_replica_n1 ] o.a.s.h.ReplicationHandler Commits will be reserved for 10000ms.
   [junit4]   2> 1500491 INFO  (qtp949788834-27977) [n:127.0.0.1:46567_solr c:abc s:shard1 r:core_node2 x:abc_shard1_replica_n1 ] o.a.s.u.UpdateLog Could not find max version in index or recent updates, using new clock 1650274026317152256
   [junit4]   2> 1500493 INFO  (searcherExecutor-8306-thread-1-processing-n:127.0.0.1:46567_solr x:abc_shard1_replica_n1 c:abc s:shard1 r:core_node2) [n:127.0.0.1:46567_solr c:abc s:shard1 r:core_node2 x:abc_shard1_replica_n1 ] o.a.s.c.SolrCore [abc_shard1_replica_n1] Registered new searcher Searcher@2ebec534[abc_shard1_replica_n1] main{ExitableDirectoryReader(UninvertingDirectoryReader())}
   [junit4]   2> 1500495 INFO  (qtp949788834-27977) [n:127.0.0.1:46567_solr c:abc s:shard1 r:core_node2 x:abc_shard1_replica_n1 ] o.a.s.c.ZkShardTerms Successful update of terms at /collections/abc/terms/shard1 to Terms{values={core_node2=0}, version=0}
   [junit4]   2> 1500495 INFO  (qtp949788834-27977) [n:127.0.0.1:46567_solr c:abc s:shard1 r:core_node2 x:abc_shard1_replica_n1 ] o.a.s.c.ShardLeaderElectionContextBase make sure parent is created /collections/abc/leaders/shard1
   [junit4]   2> 1500497 INFO  (qtp949788834-27977) [n:127.0.0.1:46567_solr c:abc s:shard1 r:core_node2 x:abc_shard1_replica_n1 ] o.a.s.c.ShardLeaderElectionContext Enough replicas found to continue.
   [junit4]   2> 1500497 INFO  (qtp949788834-27977) [n:127.0.0.1:46567_solr c:abc s:shard1 r:core_node2 x:abc_shard1_replica_n1 ] o.a.s.c.ShardLeaderElectionContext I may be the new leader - try and sync
   [junit4]   2> 1500497 INFO  (qtp949788834-27977) [n:127.0.0.1:46567_solr c:abc s:shard1 r:core_node2 x:abc_shard1_replica_n1 ] o.a.s.c.SyncStrategy Sync replicas to https://127.0.0.1:46567/solr/abc_shard1_replica_n1/
   [junit4]   2> 1500497 INFO  (qtp949788834-27977) [n:127.0.0.1:46567_solr c:abc s:shard1 r:core_node2 x:abc_shard1_replica_n1 ] o.a.s.c.SyncStrategy Sync Success - now sync replicas to me
   [junit4]   2> 1500497 INFO  (qtp949788834-27977) [n:127.0.0.1:46567_solr c:abc s:shard1 r:core_node2 x:abc_shard1_replica_n1 ] o.a.s.c.SyncStrategy https://127.0.0.1:46567/solr/abc_shard1_replica_n1/ has no replicas
   [junit4]   2> 1500497 INFO  (qtp949788834-27977) [n:127.0.0.1:46567_solr c:abc s:shard1 r:core_node2 x:abc_shard1_replica_n1 ] o.a.s.c.ShardLeaderElectionContextBase Creating leader registration node /collections/abc/leaders/shard1/leader after winning as /collections/abc/leader_elect/shard1/election/72729046034481157-core_node2-n_0000000000
   [junit4]   2> 1500498 INFO  (qtp949788834-27977) [n:127.0.0.1:46567_solr c:abc s:shard1 r:core_node2 x:abc_shard1_replica_n1 ] o.a.s.c.ShardLeaderElectionContext I am the new leader: https://127.0.0.1:46567/solr/abc_shard1_replica_n1/ shard1
   [junit4]   2> 1500600 INFO  (zkCallback-9051-thread-1) [     ] o.a.s.c.c.ZkStateReader A cluster state change: [WatchedEvent state:SyncConnected type:NodeDataChanged path:/collections/abc/state.json] for collection [abc] has occurred - updating... (live nodes size: [1])
   [junit4]   2> 1500600 INFO  (zkCallback-9051-thread-2) [     ] o.a.s.c.c.ZkStateReader A cluster state change: [WatchedEvent state:SyncConnected type:NodeDataChanged path:/collections/abc/state.json] for collection [abc] has occurred - updating... (live nodes size: [1])
   [junit4]   2> 1500600 INFO  (qtp949788834-27977) [n:127.0.0.1:46567_solr c:abc s:shard1 r:core_node2 x:abc_shard1_replica_n1 ] o.a.s.c.ZkController I am the leader, no recovery necessary
   [junit4]   2> 1500602 INFO  (qtp949788834-27977) [n:127.0.0.1:46567_solr c:abc s:shard1 r:core_node2 x:abc_shard1_replica_n1 ] o.a.s.s.HttpSolrCall [admin] webapp=null path=/admin/cores params={qt=/admin/cores&coreNodeName=core_node2&collection.configName=conf1&newCollection=true&name=abc_shard1_replica_n1&action=CREATE&numShards=1&collection=abc&shard=shard1&wt=javabin&version=2&replicaType=NRT} status=0 QTime=1179
   [junit4]   2> 1500604 INFO  (qtp949788834-27974) [n:127.0.0.1:46567_solr     ] o.a.s.h.a.CollectionsHandler Wait for new collection to be active for at most 45 seconds. Check all shard replicas
   [junit4]   2> 1500702 INFO  (zkCallback-9051-thread-3) [     ] o.a.s.c.c.ZkStateReader A cluster state change: [WatchedEvent state:SyncConnected type:NodeDataChanged path:/collections/abc/state.json] for collection [abc] has occurred - updating... (live nodes size: [1])
   [junit4]   2> 1500702 INFO  (zkCallback-9051-thread-1) [     ] o.a.s.c.c.ZkStateReader A cluster state change: [WatchedEvent state:SyncConnected type:NodeDataChanged path:/collections/abc/state.json] for collection [abc] has occurred - updating... (live nodes size: [1])
   [junit4]   2> 1500702 INFO  (zkCallback-9051-thread-2) [     ] o.a.s.c.c.ZkStateReader A cluster state change: [WatchedEvent state:SyncConnected type:NodeDataChanged path:/collections/abc/state.json] for collection [abc] has occurred - updating... (live nodes size: [1])
   [junit4]   2> 1500703 INFO  (qtp949788834-27974) [n:127.0.0.1:46567_solr     ] o.a.s.s.HttpSolrCall [admin] webapp=null path=/admin/collections params={collection.configName=conf1&name=abc&nrtReplicas=1&action=CREATE&numShards=1&wt=javabin&version=2} status=0 QTime=1590
   [junit4]   2> 1500704 INFO  (qtp949788834-27975) [n:127.0.0.1:46567_solr     ] o.a.s.h.a.CollectionsHandler Invoked Collection Action :create with params collection.configName=conf2&name=def&nrtReplicas=1&action=CREATE&numShards=1&wt=javabin&version=2 and sendToOCPQueue=true
   [junit4]   2> 1500706 INFO  (OverseerThreadFactory-8301-thread-2-processing-n:127.0.0.1:46567_solr) [n:127.0.0.1:46567_solr     ] o.a.s.c.a.c.CreateCollectionCmd Create collection def
   [junit4]   2> 1500706 INFO  (OverseerCollectionConfigSetProcessor-72729046034481157-127.0.0.1:46567_solr-n_0000000000) [n:127.0.0.1:46567_solr     ] o.a.s.c.OverseerTaskQueue Response ZK path: /overseer/collection-queue-work/qnr-0000000000 doesn't exist.  Requestor may have disconnected from ZooKeeper
   [junit4]   2> 1500913 INFO  (OverseerStateUpdate-72729046034481157-127.0.0.1:46567_solr-n_0000000000) [n:127.0.0.1:46567_solr     ] o.a.s.c.o.SliceMutator createReplica() {
   [junit4]   2>   "operation":"ADDREPLICA",
   [junit4]   2>   "collection":"def",
   [junit4]   2>   "shard":"shard1",
   [junit4]   2>   "core":"def_shard1_replica_n1",
   [junit4]   2>   "state":"down",
   [junit4]   2>   "base_url":"https://127.0.0.1:46567/solr",
   [junit4]   2>   "type":"NRT",
   [junit4]   2>   "waitForFinalState":"false"}
   [junit4]   2> 1501115 INFO  (qtp949788834-27973) [n:127.0.0.1:46567_solr    x:def_shard1_replica_n1 ] o.a.s.h.a.CoreAdminOperation core create command qt=/admin/cores&coreNodeName=core_node2&collection.configName=conf2&newCollection=true&name=def_shard1_replica_n1&action=CREATE&numShards=1&collection=def&shard=shard1&wt=javabin&version=2&replicaType=NRT
   [junit4]   2> 1502127 INFO  (qtp949788834-27973) [n:127.0.0.1:46567_solr c:def s:shard1 r:core_node2 x:def_shard1_replica_n1 ] o.a.s.c.SolrConfig Using Lucene MatchVersion: 8.4.0
   [junit4]   2> 1502136 INFO  (qtp949788834-27973) [n:127.0.0.1:46567_solr c:def s:shard1 r:core_node2 x:def_shard1_replica_n1 ] o.a.s.s.IndexSchema [def_shard1_replica_n1] Schema name=minimal
   [junit4]   2> 1502139 INFO  (qtp949788834-27973) [n:127.0.0.1:46567_solr c:def s:shard1 r:core_node2 x:def_shard1_replica_n1 ] o.a.s.s.IndexSchema Loaded schema minimal/1.1 with uniqueid field id
   [junit4]   2> 1502139 INFO  (qtp949788834-27973) [n:127.0.0.1:46567_solr c:def s:shard1 r:core_node2 x:def_shard1_replica_n1 ] o.a.s.c.CoreContainer Creating SolrCore 'def_shard1_replica_n1' using configuration from collection def, trusted=true
   [junit4]   2> 1502140 INFO  (qtp949788834-27973) [n:127.0.0.1:46567_solr c:def s:shard1 r:core_node2 x:def_shard1_replica_n1 ] o.a.s.m.r.SolrJmxReporter JMX monitoring for 'solr_46567.solr.core.def.shard1.replica_n1' (registry 'solr.core.def.shard1.replica_n1') enabled at server: com.sun.jmx.mbeanserver.JmxMBeanServer@41b42145
   [junit4]   2> 1502140 INFO  (qtp949788834-27973) [n:127.0.0.1:46567_solr c:def s:shard1 r:core_node2 x:def_shard1_replica_n1 ] o.a.s.c.SolrCore [[def_shard1_replica_n1] ] Opening new SolrCore at [/home/jenkins/jenkins-slave/workspace/Lucene-Solr-Tests-8.x/solr/build/solr-core/test/J2/temp/solr.cloud.PackageManagerCLITest_375F141CDBE18BCB-001/tempDir-001/node1/def_shard1_replica_n1], dataDir=[/home/jenkins/jenkins-slave/workspace/Lucene-Solr-Tests-8.x/solr/build/solr-core/test/J2/temp/solr.cloud.PackageManagerCLITest_375F141CDBE18BCB-001/tempDir-001/node1/./def_shard1_replica_n1/data/]
   [junit4]   2> 1502171 INFO  (qtp949788834-27973) [n:127.0.0.1:46567_solr c:def s:shard1 r:core_node2 x:def_shard1_replica_n1 ] o.a.s.u.UpdateHandler Using UpdateLog implementation: org.apache.solr.update.UpdateLog
   [junit4]   2> 1502171 INFO  (qtp949788834-27973) [n:127.0.0.1:46567_solr c:def s:shard1 r:core_node2 x:def_shard1_replica_n1 ] o.a.s.u.UpdateLog Initializing UpdateLog: dataDir=null defaultSyncLevel=FLUSH numRecordsToKeep=100 maxNumLogsToKeep=10 numVersionBuckets=65536
   [junit4]   2> 1502173 INFO  (qtp949788834-27973) [n:127.0.0.1:46567_solr c:def s:shard1 r:core_node2 x:def_shard1_replica_n1 ] o.a.s.u.CommitTracker Hard AutoCommit: disabled
   [junit4]   2> 1502173 INFO  (qtp949788834-27973) [n:127.0.0.1:46567_solr c:def s:shard1 r:core_node2 x:def_shard1_replica_n1 ] o.a.s.u.CommitTracker Soft AutoCommit: disabled
   [junit4]   2> 1502173 INFO  (qtp949788834-27973) [n:127.0.0.1:46567_solr c:def s:shard1 r:core_node2 x:def_shard1_replica_n1 ] o.a.s.s.SolrIndexSearcher Opening [Searcher@59f14d4[def_shard1_replica_n1] main]
   [junit4]   2> 1502174 INFO  (qtp949788834-27973) [n:127.0.0.1:46567_solr c:def s:shard1 r:core_node2 x:def_shard1_replica_n1 ] o.a.s.r.ManagedResourceStorage Configured ZooKeeperStorageIO with znodeBase: /configs/conf2
   [junit4]   2> 1502175 INFO  (qtp949788834-27973) [n:127.0.0.1:46567_solr c:def s:shard1 r:core_node2 x:def_shard1_replica_n1 ] o.a.s.r.ManagedResourceStorage Loaded null at path _rest_managed.json using ZooKeeperStorageIO:path=/configs/conf2
   [junit4]   2> 1502175 INFO  (qtp949788834-27973) [n:127.0.0.1:46567_solr c:def s:shard1 r:core_node2 x:def_shard1_replica_n1 ] o.a.s.h.ReplicationHandler Commits will be reserved for 10000ms.
   [junit4]   2> 1502175 INFO  (qtp949788834-27973) [n:127.0.0.1:46567_solr c:def s:shard1 r:core_node2 x:def_shard1_replica_n1 ] o.a.s.u.UpdateLog Could not find max version in index or recent updates, using new clock 1650274028082954240
   [junit4]   2> 1502177 INFO  (searcherExecutor-8311-thread-1-processing-n:127.0.0.1:46567_solr x:def_shard1_replica_n1 c:def s:shard1 r:core_node2) [n:127.0.0.1:46567_solr c:def s:shard1 r:core_node2 x:def_shard1_replica_n1 ] o.a.s.c.SolrCore [def_shard1_replica_n1] Registered new searcher Searcher@59f14d4[def_shard1_replica_n1] main{ExitableDirectoryReader(UninvertingDirectoryReader())}
   [junit4]   2> 1502179 INFO  (qtp949788834-27973) [n:127.0.0.1:46567_solr c:def s:shard1 r:core_node2 x:def_shard1_replica_n1 ] o.a.s.c.ZkShardTerms Successful update of terms at /collections/def/terms/shard1 to Terms{values={core_node2=0}, version=0}
   [junit4]   2> 1502179 INFO  (qtp949788834-27973) [n:127.0.0.1:46567_solr c:def s:shard1 r:core_node2 x:def_shard1_replica_n1 ] o.a.s.c.ShardLeaderElectionContextBase make sure parent is created /collections/def/leaders/shard1
   [junit4]   2> 1502181 INFO  (qtp949788834-27973) [n:127.0.0.1:46567_solr c:def s:shard1 r:core_node2 x:def_shard1_replica_n1 ] o.a.s.c.ShardLeaderElectionContext Enough replicas found to continue.
   [junit4]   2> 1502181 INFO  (qtp949788834-27973) [n:127.0.0.1:46567_solr c:def s:shard1 r:core_node2 x:def_shard1_replica_n1 ] o.a.s.c.ShardLeaderElectionContext I may be the new leader - try and sync
   [junit4]   2> 1502181 INFO  (qtp949788834-27973) [n:127.0.0.1:46567_solr c:def s:shard1 r:core_node2 x:def_shard1_replica_n1 ] o.a.s.c.SyncStrategy Sync replicas to https://127.0.0.1:46567/solr/def_shard1_replica_n1/
   [junit4]   2> 1502181 INFO  (qtp949788834-27973) [n:127.0.0.1:46567_solr c:def s:shard1 r:core_node2 x:def_shard1_replica_n1 ] o.a.s.c.SyncStrategy Sync Success - now sync replicas to me
   [junit4]   2> 1502181 INFO  (qtp949788834-27973) [n:127.0.0.1:46567_solr c:def s:shard1 r:core_node2 x:def_shard1_replica_n1 ] o.a.s.c.SyncStrategy https://127.0.0.1:46567/solr/def_shard1_replica_n1/ has no replicas
   [junit4]   2> 1502181 INFO  (qtp949788834-27973) [n:127.0.0.1:46567_solr c:def s:shard1 r:core_node2 x:def_shard1_replica_n1 ] o.a.s.c.ShardLeaderElectionContextBase Creating leader registration node /collections/def/leaders/shard1/leader after winning as /collections/def/leader_elect/shard1/election/72729046034481157-core_node2-n_0000000000
   [junit4]   2> 1502182 INFO  (qtp949788834-27973) [n:127.0.0.1:46567_solr c:def s:shard1 r:core_node2 x:def_shard1_replica_n1 ] o.a.s.c.ShardLeaderElectionContext I am the new leader: https://127.0.0.1:46567/solr/def_shard1_replica_n1/ shard1
   [junit4]   2> 1502284 INFO  (zkCallback-9051-thread-1) [     ] o.a.s.c.c.ZkStateReader A cluster state change: [WatchedEvent state:SyncConnected type:NodeDataChanged path:/collections/def/state.json] for collection [def] has occurred - updating... (live nodes size: [1])
   [junit4]   2> 1502284 INFO  (zkCallback-9051-thread-2) [     ] o.a.s.c.c.ZkStateReader A cluster state change: [WatchedEvent state:SyncConnected type:NodeDataChanged path:/collections/def/state.json] for collection [def] has occurred - updating... (live nodes size: [1])
   [junit4]   2> 1502284 INFO  (qtp949788834-27973) [n:127.0.0.1:46567_solr c:def s:shard1 r:core_node2 x:def_shard1_replica_n1 ] o.a.s.c.ZkController I am the leader, no recovery necessary
   [junit4]   2> 1502287 INFO  (qtp949788834-27973) [n:127.0.0.1:46567_solr c:def s:shard1 r:core_node2 x:def_shard1_replica_n1 ] o.a.s.s.HttpSolrCall [admin] webapp=null path=/admin/cores params={qt=/admin/cores&coreNodeName=core_node2&collection.configName=conf2&newCollection=true&name=def_shard1_replica_n1&action=CREATE&numShards=1&collection=def&shard=shard1&wt=javabin&version=2&replicaType=NRT} status=0 QTime=1172
   [junit4]   2> 1502288 INFO  (qtp949788834-27975) [n:127.0.0.1:46567_solr     ] o.a.s.h.a.CollectionsHandler Wait for new collection to be active for at most 45 seconds. Check all shard replicas
   [junit4]   2> 1502388 INFO  (zkCallback-9051-thread-1) [     ] o.a.s.c.c.ZkStateReader A cluster state change: [WatchedEvent state:SyncConnected type:NodeDataChanged path:/collections/def/state.json] for collection [def] has occurred - updating... (live nodes size: [1])
   [junit4]   2> 1502388 INFO  (zkCallback-9051-thread-2) [     ] o.a.s.c.c.ZkStateReader A cluster state change: [WatchedEvent state:SyncConnected type:NodeDataChanged path:/collections/def/state.json] for collection [def] has occurred - updating... (live nodes size: [1])
   [junit4]   2> 1502388 INFO  (zkCallback-9051-thread-3) [     ] o.a.s.c.c.ZkStateReader A cluster state change: [WatchedEvent state:SyncConnected type:NodeDataChanged path:/collections/def/state.json] for collection [def] has occurred - updating... (live nodes size: [1])
   [junit4]   2> 1502388 INFO  (qtp949788834-27975) [n:127.0.0.1:46567_solr     ] o.a.s.s.HttpSolrCall [admin] webapp=null path=/admin/collections params={collection.configName=conf2&name=def&nrtReplicas=1&action=CREATE&numShards=1&wt=javabin&version=2} status=0 QTime=1684
   [junit4]   2> 1502389 INFO  (TEST-PackageManagerCLITest.testPackageManager-seed#[375F141CDBE18BCB]) [     ] o.a.s.u.PackageTool Solr url: https://127.0.0.1:46567/solr, solr base url: https://127.0.0.1:46567
   [junit4]   2> 1502408 INFO  (qtp949788834-27974) [n:127.0.0.1:46567_solr     ] o.a.s.s.HttpSolrCall [admin] webapp=null path=/admin/info/system params={wt=json} status=0 QTime=8
   [junit4]   2> 1502410 INFO  (qtp949788834-27973) [n:127.0.0.1:46567_solr     ] o.a.s.h.a.CollectionsHandler Invoked Collection Action :clusterstatus with params action=CLUSTERSTATUS&wt=json and sendToOCPQueue=true
   [junit4]   2> 1502413 INFO  (qtp949788834-27973) [n:127.0.0.1:46567_solr     ] o.a.s.s.HttpSolrCall [admin] webapp=null path=/admin/collections params={action=CLUSTERSTATUS&wt=json} status=0 QTime=3
   [junit4]   2> 1502415 INFO  (TEST-PackageManagerCLITest.testPackageManager-seed#[375F141CDBE18BCB]) [     ] o.a.s.u.PackageTool ZK: 127.0.0.1:41777/solr
   [junit4]   2> 1502417 INFO  (TEST-PackageManagerCLITest.testPackageManager-seed#[375F141CDBE18BCB]) [     ] o.a.s.c.c.ConnectionManager Waiting for client to connect to ZooKeeper
   [junit4]   2> 1502418 INFO  (zkConnectionManagerCallback-9075-thread-1) [     ] o.a.s.c.c.ConnectionManager zkClient has connected
   [junit4]   2> 1502418 INFO  (TEST-PackageManagerCLITest.testPackageManager-seed#[375F141CDBE18BCB]) [     ] o.a.s.c.c.ConnectionManager Client is connected to ZooKeeper
   [junit4]   2> 1502418 INFO  (TEST-PackageManagerCLITest.testPackageManager-seed#[375F141CDBE18BCB]) [     ] o.a.s.p.PackageManager Done initializing a zkClient instance...
   [junit4]   1>  [32mCollections on which package question-answer was deployed: [0m
   [junit4]   2> 1502564 INFO  (TEST-PackageManagerCLITest.testPackageManager-seed#[375F141CDBE18BCB]) [     ] o.a.s.u.PackageTool Finished: list-deployed
   [junit4]   2> 1502564 INFO  (TEST-PackageManagerCLITest.testPackageManager-seed#[375F141CDBE18BCB]) [     ] o.a.s.u.PackageTool Solr url: https://127.0.0.1:46567/solr, solr base url: https://127.0.0.1:46567
   [junit4]   2> 1502579 INFO  (qtp949788834-27975) [n:127.0.0.1:46567_solr     ] o.a.s.s.HttpSolrCall [admin] webapp=null path=/admin/info/system params={wt=json} status=0 QTime=10
   [junit4]   2> 1502580 INFO  (qtp949788834-27976) [n:127.0.0.1:46567_solr     ] o.a.s.h.a.CollectionsHandler Invoked Collection Action :clusterstatus with params action=CLUSTERSTATUS&wt=json and sendToOCPQueue=true
   [junit4]   2> 1502582 INFO  (qtp949788834-27976) [n:127.0.0.1:46567_solr     ] o.a.s.s.HttpSolrCall [admin] webapp=null path=/admin/collections params={action=CLUSTERSTATUS&wt=json} status=0 QTime=1
   [junit4]   2> 1502582 INFO  (TEST-PackageManagerCLITest.testPackageManager-seed#[375F141CDBE18BCB]) [     ] o.a.s.u.PackageTool ZK: 127.0.0.1:41777/solr
   [junit4]   2> 1502584 INFO  (TEST-PackageManagerCLITest.testPackageManager-seed#[375F141CDBE18BCB]) [     ] o.a.s.c.c.ConnectionManager Waiting for client to connect to ZooKeeper
   [junit4]   2> 1502588 INFO  (zkConnectionManagerCallback-9077-thread-1) [     ] o.a.s.c.c.ConnectionManager zkClient has connected
   [junit4]   2> 1502589 INFO  (TEST-PackageManagerCLITest.testPackageManager-seed#[375F141CDBE18BCB]) [     ] o.a.s.c.c.ConnectionManager Client is connected to ZooKeeper
   [junit4]   2> 1502589 INFO  (TEST-PackageManagerCLITest.testPackageManager-seed#[375F141CDBE18BCB]) [     ] o.a.s.p.PackageManager Done initializing a zkClient instance...
   [junit4]   2> 1502589 INFO  (TEST-PackageManagerCLITest.testPackageManager-seed#[375F141CDBE18BCB]) [     ] o.a.s.p.PackageManager Getting packages from packages.json...
   [junit4]   2> 1502595 INFO  (qtp949788834-27976) [n:127.0.0.1:46567_solr     ] o.a.s.s.HttpSolrCall [admin] webapp=null path=/node/files/package/question-answer/1.0.0/manifest.json params={} status=0 QTime=0
   [junit4]   2> 1502597 INFO  (TEST-PackageManagerCLITest.testPackageManager-seed#[375F141CDBE18BCB]) [     ] o.a.s.p.PackageManager Got packages: [{
   [junit4]   2>   "name":"question-answer",
   [junit4]   2>   "version":"1.0.0"}]
   [junit4]   2> 1502617 INFO  (qtp949788834-27973) [n:127.0.0.1:46567_solr c:abc s:shard1 r:core_node2 x:abc_shard1_replica_n1 ] o.a.s.h.SolrConfigHandler Waiting up to 30 secs for 1 replicas to set the property params to be of version 0 for collection abc
   [junit4]   2> 1502617 INFO  (Thread-5054) [     ] o.a.s.c.SolrCore config update listener called for core abc_shard1_replica_n1
   [junit4]   2> 1502618 INFO  (Thread-5054) [     ] o.a.s.c.RequestParams conf resource params.json loaded . version : 0
   [junit4]   2> 1502618 INFO  (solrHandlerExecutor-8316-thread-1-processing-n:127.0.0.1:46567_solr x:abc_shard1_replica_n1 c:abc s:shard1 r:core_node2) [n:127.0.0.1:46567_solr c:abc s:shard1 r:core_node2 x:abc_shard1_replica_n1 ] o.a.s.h.SolrConfigHandler Time elapsed : 0 secs, maxWait 30
   [junit4]   2> 1502618 INFO  (Thread-5054) [     ] o.a.s.c.RequestParams request params refreshed to version 0
   [junit4]   2> 1502707 INFO  (OverseerCollectionConfigSetProcessor-72729046034481157-127.0.0.1:46567_solr-n_0000000000) [n:127.0.0.1:46567_solr     ] o.a.s.c.OverseerTaskQueue Response ZK path: /overseer/collection-queue-work/qnr-0000000002 doesn't exist.  Requestor may have disconnected from ZooKeeper
   [junit4]   2> 1502722 INFO  (qtp949788834-27977) [n:127.0.0.1:46567_solr c:abc s:shard1 r:core_node2 x:abc_shard1_replica_n1 ] o.a.s.h.SolrConfigHandler I already have the expected version 0 of params
   [junit4]   2> 1502722 INFO  (qtp949788834-27977) [n:127.0.0.1:46567_solr c:abc s:shard1 r:core_node2 x:abc_shard1_replica_n1 ] o.a.s.h.SolrConfigHandler isStale false , resourceloader org.apache.solr.cloud.ZkSolrResourceLoader
   [junit4]   2> 1502722 INFO  (qtp949788834-27977) [n:127.0.0.1:46567_solr c:abc s:shard1 r:core_node2 x:abc_shard1_replica_n1 ] o.a.s.c.S.Request [abc_shard1_replica_n1]  webapp=/solr path=/config/znodeVersion params={params=0&wt=javabin&version=2} status=0 QTime=0
   [junit4]   2> 1502723 INFO  (qtp949788834-27973) [n:127.0.0.1:46567_solr c:abc s:shard1 r:core_node2 x:abc_shard1_replica_n1 ] o.a.s.h.SolrConfigHandler Took 106.0ms to set the property params to be of version 0 for collection abc
   [junit4]   2> 1502725 INFO  (qtp949788834-27977) [n:127.0.0.1:46567_solr c:abc s:shard1 r:core_node2 x:abc_shard1_replica_n1 ] o.a.s.c.ZkController Persisted config data to node /configs/conf1/params.json
   [junit4]   2> 1502725 INFO  (qtp949788834-27977) [n:127.0.0.1:46567_solr c:abc s:shard1 r:core_node2 x:abc_shard1_replica_n1 ] o.a.s.h.SolrConfigHandler Waiting up to 30 secs for 1 replicas to set the property params to be of version 1 for collection abc
   [junit4]   2> 1502725 INFO  (Thread-5055) [     ] o.a.s.c.SolrCore config update listener called for core abc_shard1_replica_n1
   [junit4]   2> 1502726 INFO  (solrHandlerExecutor-8317-thread-1-processing-n:127.0.0.1:46567_solr x:abc_shard1_replica_n1 c:abc s:shard1 r:core_node2) [n:127.0.0.1:46567_solr c:abc s:shard1 r:core_node2 x:abc_shard1_replica_n1 ] o.a.s.h.SolrConfigHandler Time elapsed : 0 secs, maxWait 30
   [junit4]   2> 1502726 INFO  (Thread-5055) [     ] o.a.s.c.RequestParams conf resource params.json loaded . version : 1
   [junit4]   2> 1502726 INFO  (Thread-5055) [     ] o.a.s.c.RequestParams request params refreshed to version 1
   [junit4]   2> 1502829 INFO  (qtp949788834-27976) [n:127.0.0.1:46567_solr c:abc s:shard1 r:core_node2 x:abc_shard1_replica_n1 ] o.a.s.h.SolrConfigHandler I already have the expected version 1 of params
   [junit4]   2> 1502829 INFO  (qtp949788834-27976) [n:127.0.0.1:46567_solr c:abc s:shard1 r:core_node2 x:abc_shard1_replica_n1 ] o.a.s.h.SolrConfigHandler isStale false , resourceloader org.apache.solr.cloud.ZkSolrResourceLoader
   [junit4]   2> 1502829 INFO  (qtp949788834-27976) [n:127.0.0.1:46567_solr c:abc s:shard1 r:core_node2 x:abc_shard1_replica_n1 ] o.a.s.c.S.Request [abc_shard1_replica_n1]  webapp=/solr path=/config/znodeVersion params={params=1&wt=javabin&version=2} status=0 QTime=0
   [junit4]   2> 1502829 INFO  (qtp949788834-27977) [n:127.0.0.1:46567_solr c:abc s:shard1 r:core_node2 x:abc_shard1_replica_n1 ] o.a.s.h.SolrConfigHandler Took 104.0ms to set the property params to be of version 1 for collection abc
   [junit4]   1>  [32mExecuting {"add-requesthandler":{"name":"/mypath2","class":"question-answer:fullstory.QARequestHandler"}} for path:/api/collections/abc/config [0m
   [junit4]   1> Putting patterns into the list from the init()
   [junit4]   2> 1502843 INFO  (qtp949788834-27976) [n:127.0.0.1:46567_solr c:abc s:shard1 r:core_node2 x:abc_shard1_replica_n1 ] o.a.s.h.SolrConfigHandler Waiting up to 30 secs for 1 replicas to set the property overlay to be of version 0 for collection abc
   [junit4]   2> 1502843 INFO  (Thread-5056) [     ] o.a.s.c.SolrCore config update listener called for core abc_shard1_replica_n1
   [junit4]   2> 1502844 INFO  (solrHandlerExecutor-8318-thread-1-processing-n:127.0.0.1:46567_solr x:abc_shard1_replica_n1 c:abc s:shard1 r:core_node2) [n:127.0.0.1:46567_solr c:abc s:shard1 r:core_node2 x:abc_shard1_replica_n1 ] o.a.s.h.SolrConfigHandler Time elapsed : 0 secs, maxWait 30
   [junit4]   2> 1502845 INFO  (Thread-5056) [     ] o.a.s.c.SolrCore core reload abc_shard1_replica_n1
   [junit4]   2> 1502855 INFO  (Thread-5056) [     ] o.a.s.c.RequestParams conf resource params.json loaded . version : 1
   [junit4]   2> 1502855 INFO  (Thread-5056) [     ] o.a.s.c.RequestParams request params refreshed to version 1
   [junit4]   2> 1502855 INFO  (Thread-5056) [     ] o.a.s.c.SolrConfig Using Lucene MatchVersion: 8.4.0
   [junit4]   2> 1502865 INFO  (Thread-5056) [     ] o.a.s.s.IndexSchema [abc_shard1_replica_n1] Schema name=minimal
   [junit4]   2> 1502868 INFO  (Thread-5056) [     ] o.a.s.s.IndexSchema Loaded schema minimal/1.1 with uniqueid field id
   [junit4]   2> 1502868 INFO  (Thread-5056) [     ] o.a.s.c.CoreContainer Reloading SolrCore 'abc_shard1_replica_n1' using configuration from collection abc
   [junit4]   2> 1502905 INFO  (Thread-5056) [n:127.0.0.1:46567_solr c:abc s:shard1 r:core_node2 x:abc_shard1_replica_n1 ] o.a.s.m.r.SolrJmxReporter JMX monitoring for 'solr_46567.solr.core.abc.shard1.replica_n1' (reg