Re: [JENKINS] Lucene-Solr-master-Linux (64bit/jdk-12.0.1) - Build # 24938 - Still Unstable!

classic Classic list List threaded Threaded
1 message Options
Reply | Threaded
Open this post in threaded view
|

Re: [JENKINS] Lucene-Solr-master-Linux (64bit/jdk-12.0.1) - Build # 24938 - Still Unstable!

Tomás Fernández Löbbe
This is because of SOLR-13866. I pushed a fix

On Wed, Oct 23, 2019 at 5:05 PM Policeman Jenkins Server <[hidden email]> wrote:
Build: https://jenkins.thetaphi.de/job/Lucene-Solr-master-Linux/24938/
Java: 64bit/jdk-12.0.1 -XX:-UseCompressedOops -XX:+UseParallelGC

6 tests failed.
FAILED:  org.apache.solr.cloud.TestTlogReplica.testAddDocs

Error Message:


Stack Trace:
java.lang.NullPointerException
        at __randomizedtesting.SeedInfo.seed([921D47C5DD583140:72965CC33E16C3AD]:0)
        at org.apache.solr.cloud.TestTlogReplica.testAddDocs(TestTlogReplica.java:251)
        at java.base/jdk.internal.reflect.NativeMethodAccessorImpl.invoke0(Native Method)
        at java.base/jdk.internal.reflect.NativeMethodAccessorImpl.invoke(NativeMethodAccessorImpl.java:62)
        at java.base/jdk.internal.reflect.DelegatingMethodAccessorImpl.invoke(DelegatingMethodAccessorImpl.java:43)
        at java.base/java.lang.reflect.Method.invoke(Method.java:567)
        at com.carrotsearch.randomizedtesting.RandomizedRunner.invoke(RandomizedRunner.java:1750)
        at com.carrotsearch.randomizedtesting.RandomizedRunner$8.evaluate(RandomizedRunner.java:938)
        at com.carrotsearch.randomizedtesting.RandomizedRunner$9.evaluate(RandomizedRunner.java:974)
        at com.carrotsearch.randomizedtesting.RandomizedRunner$10.evaluate(RandomizedRunner.java:988)
        at com.carrotsearch.randomizedtesting.rules.SystemPropertiesRestoreRule$1.evaluate(SystemPropertiesRestoreRule.java:57)
        at org.apache.lucene.util.TestRuleSetupTeardownChained$1.evaluate(TestRuleSetupTeardownChained.java:49)
        at org.apache.lucene.util.AbstractBeforeAfterRule$1.evaluate(AbstractBeforeAfterRule.java:45)
        at org.apache.lucene.util.TestRuleThreadAndTestName$1.evaluate(TestRuleThreadAndTestName.java:48)
        at org.apache.lucene.util.TestRuleIgnoreAfterMaxFailures$1.evaluate(TestRuleIgnoreAfterMaxFailures.java:64)
        at org.apache.lucene.util.TestRuleMarkFailure$1.evaluate(TestRuleMarkFailure.java:47)
        at com.carrotsearch.randomizedtesting.rules.StatementAdapter.evaluate(StatementAdapter.java:36)
        at com.carrotsearch.randomizedtesting.ThreadLeakControl$StatementRunner.run(ThreadLeakControl.java:368)
        at com.carrotsearch.randomizedtesting.ThreadLeakControl.forkTimeoutingTask(ThreadLeakControl.java:817)
        at com.carrotsearch.randomizedtesting.ThreadLeakControl$3.evaluate(ThreadLeakControl.java:468)
        at com.carrotsearch.randomizedtesting.RandomizedRunner.runSingleTest(RandomizedRunner.java:947)
        at com.carrotsearch.randomizedtesting.RandomizedRunner$5.evaluate(RandomizedRunner.java:832)
        at com.carrotsearch.randomizedtesting.RandomizedRunner$6.evaluate(RandomizedRunner.java:883)
        at com.carrotsearch.randomizedtesting.RandomizedRunner$7.evaluate(RandomizedRunner.java:894)
        at com.carrotsearch.randomizedtesting.rules.StatementAdapter.evaluate(StatementAdapter.java:36)
        at com.carrotsearch.randomizedtesting.rules.SystemPropertiesRestoreRule$1.evaluate(SystemPropertiesRestoreRule.java:57)
        at org.apache.lucene.util.AbstractBeforeAfterRule$1.evaluate(AbstractBeforeAfterRule.java:45)
        at com.carrotsearch.randomizedtesting.rules.StatementAdapter.evaluate(StatementAdapter.java:36)
        at org.apache.lucene.util.TestRuleStoreClassName$1.evaluate(TestRuleStoreClassName.java:41)
        at com.carrotsearch.randomizedtesting.rules.NoShadowingOrOverridesOnMethodsRule$1.evaluate(NoShadowingOrOverridesOnMethodsRule.java:40)
        at com.carrotsearch.randomizedtesting.rules.NoShadowingOrOverridesOnMethodsRule$1.evaluate(NoShadowingOrOverridesOnMethodsRule.java:40)
        at com.carrotsearch.randomizedtesting.rules.StatementAdapter.evaluate(StatementAdapter.java:36)
        at com.carrotsearch.randomizedtesting.rules.StatementAdapter.evaluate(StatementAdapter.java:36)
        at org.apache.lucene.util.TestRuleAssertionsRequired$1.evaluate(TestRuleAssertionsRequired.java:53)
        at org.apache.lucene.util.TestRuleMarkFailure$1.evaluate(TestRuleMarkFailure.java:47)
        at org.apache.lucene.util.TestRuleIgnoreAfterMaxFailures$1.evaluate(TestRuleIgnoreAfterMaxFailures.java:64)
        at org.apache.lucene.util.TestRuleIgnoreTestSuites$1.evaluate(TestRuleIgnoreTestSuites.java:54)
        at com.carrotsearch.randomizedtesting.rules.StatementAdapter.evaluate(StatementAdapter.java:36)
        at com.carrotsearch.randomizedtesting.ThreadLeakControl$StatementRunner.run(ThreadLeakControl.java:368)
        at java.base/java.lang.Thread.run(Thread.java:835)


FAILED:  org.apache.solr.cloud.TestTlogReplica.testAddDocs

Error Message:


Stack Trace:
java.lang.NullPointerException
        at __randomizedtesting.SeedInfo.seed([921D47C5DD583140:72965CC33E16C3AD]:0)
        at org.apache.solr.cloud.TestTlogReplica.testAddDocs(TestTlogReplica.java:251)
        at java.base/jdk.internal.reflect.NativeMethodAccessorImpl.invoke0(Native Method)
        at java.base/jdk.internal.reflect.NativeMethodAccessorImpl.invoke(NativeMethodAccessorImpl.java:62)
        at java.base/jdk.internal.reflect.DelegatingMethodAccessorImpl.invoke(DelegatingMethodAccessorImpl.java:43)
        at java.base/java.lang.reflect.Method.invoke(Method.java:567)
        at com.carrotsearch.randomizedtesting.RandomizedRunner.invoke(RandomizedRunner.java:1750)
        at com.carrotsearch.randomizedtesting.RandomizedRunner$8.evaluate(RandomizedRunner.java:938)
        at com.carrotsearch.randomizedtesting.RandomizedRunner$9.evaluate(RandomizedRunner.java:974)
        at com.carrotsearch.randomizedtesting.RandomizedRunner$10.evaluate(RandomizedRunner.java:988)
        at com.carrotsearch.randomizedtesting.rules.SystemPropertiesRestoreRule$1.evaluate(SystemPropertiesRestoreRule.java:57)
        at org.apache.lucene.util.TestRuleSetupTeardownChained$1.evaluate(TestRuleSetupTeardownChained.java:49)
        at org.apache.lucene.util.AbstractBeforeAfterRule$1.evaluate(AbstractBeforeAfterRule.java:45)
        at org.apache.lucene.util.TestRuleThreadAndTestName$1.evaluate(TestRuleThreadAndTestName.java:48)
        at org.apache.lucene.util.TestRuleIgnoreAfterMaxFailures$1.evaluate(TestRuleIgnoreAfterMaxFailures.java:64)
        at org.apache.lucene.util.TestRuleMarkFailure$1.evaluate(TestRuleMarkFailure.java:47)
        at com.carrotsearch.randomizedtesting.rules.StatementAdapter.evaluate(StatementAdapter.java:36)
        at com.carrotsearch.randomizedtesting.ThreadLeakControl$StatementRunner.run(ThreadLeakControl.java:368)
        at com.carrotsearch.randomizedtesting.ThreadLeakControl.forkTimeoutingTask(ThreadLeakControl.java:817)
        at com.carrotsearch.randomizedtesting.ThreadLeakControl$3.evaluate(ThreadLeakControl.java:468)
        at com.carrotsearch.randomizedtesting.RandomizedRunner.runSingleTest(RandomizedRunner.java:947)
        at com.carrotsearch.randomizedtesting.RandomizedRunner$5.evaluate(RandomizedRunner.java:832)
        at com.carrotsearch.randomizedtesting.RandomizedRunner$6.evaluate(RandomizedRunner.java:883)
        at com.carrotsearch.randomizedtesting.RandomizedRunner$7.evaluate(RandomizedRunner.java:894)
        at com.carrotsearch.randomizedtesting.rules.StatementAdapter.evaluate(StatementAdapter.java:36)
        at com.carrotsearch.randomizedtesting.rules.SystemPropertiesRestoreRule$1.evaluate(SystemPropertiesRestoreRule.java:57)
        at org.apache.lucene.util.AbstractBeforeAfterRule$1.evaluate(AbstractBeforeAfterRule.java:45)
        at com.carrotsearch.randomizedtesting.rules.StatementAdapter.evaluate(StatementAdapter.java:36)
        at org.apache.lucene.util.TestRuleStoreClassName$1.evaluate(TestRuleStoreClassName.java:41)
        at com.carrotsearch.randomizedtesting.rules.NoShadowingOrOverridesOnMethodsRule$1.evaluate(NoShadowingOrOverridesOnMethodsRule.java:40)
        at com.carrotsearch.randomizedtesting.rules.NoShadowingOrOverridesOnMethodsRule$1.evaluate(NoShadowingOrOverridesOnMethodsRule.java:40)
        at com.carrotsearch.randomizedtesting.rules.StatementAdapter.evaluate(StatementAdapter.java:36)
        at com.carrotsearch.randomizedtesting.rules.StatementAdapter.evaluate(StatementAdapter.java:36)
        at org.apache.lucene.util.TestRuleAssertionsRequired$1.evaluate(TestRuleAssertionsRequired.java:53)
        at org.apache.lucene.util.TestRuleMarkFailure$1.evaluate(TestRuleMarkFailure.java:47)
        at org.apache.lucene.util.TestRuleIgnoreAfterMaxFailures$1.evaluate(TestRuleIgnoreAfterMaxFailures.java:64)
        at org.apache.lucene.util.TestRuleIgnoreTestSuites$1.evaluate(TestRuleIgnoreTestSuites.java:54)
        at com.carrotsearch.randomizedtesting.rules.StatementAdapter.evaluate(StatementAdapter.java:36)
        at com.carrotsearch.randomizedtesting.ThreadLeakControl$StatementRunner.run(ThreadLeakControl.java:368)
        at java.base/java.lang.Thread.run(Thread.java:835)


FAILED:  org.apache.solr.cloud.TestTlogReplica.testAddDocs

Error Message:


Stack Trace:
java.lang.NullPointerException
        at __randomizedtesting.SeedInfo.seed([921D47C5DD583140:72965CC33E16C3AD]:0)
        at org.apache.solr.cloud.TestTlogReplica.testAddDocs(TestTlogReplica.java:251)
        at java.base/jdk.internal.reflect.NativeMethodAccessorImpl.invoke0(Native Method)
        at java.base/jdk.internal.reflect.NativeMethodAccessorImpl.invoke(NativeMethodAccessorImpl.java:62)
        at java.base/jdk.internal.reflect.DelegatingMethodAccessorImpl.invoke(DelegatingMethodAccessorImpl.java:43)
        at java.base/java.lang.reflect.Method.invoke(Method.java:567)
        at com.carrotsearch.randomizedtesting.RandomizedRunner.invoke(RandomizedRunner.java:1750)
        at com.carrotsearch.randomizedtesting.RandomizedRunner$8.evaluate(RandomizedRunner.java:938)
        at com.carrotsearch.randomizedtesting.RandomizedRunner$9.evaluate(RandomizedRunner.java:974)
        at com.carrotsearch.randomizedtesting.RandomizedRunner$10.evaluate(RandomizedRunner.java:988)
        at com.carrotsearch.randomizedtesting.rules.SystemPropertiesRestoreRule$1.evaluate(SystemPropertiesRestoreRule.java:57)
        at org.apache.lucene.util.TestRuleSetupTeardownChained$1.evaluate(TestRuleSetupTeardownChained.java:49)
        at org.apache.lucene.util.AbstractBeforeAfterRule$1.evaluate(AbstractBeforeAfterRule.java:45)
        at org.apache.lucene.util.TestRuleThreadAndTestName$1.evaluate(TestRuleThreadAndTestName.java:48)
        at org.apache.lucene.util.TestRuleIgnoreAfterMaxFailures$1.evaluate(TestRuleIgnoreAfterMaxFailures.java:64)
        at org.apache.lucene.util.TestRuleMarkFailure$1.evaluate(TestRuleMarkFailure.java:47)
        at com.carrotsearch.randomizedtesting.rules.StatementAdapter.evaluate(StatementAdapter.java:36)
        at com.carrotsearch.randomizedtesting.ThreadLeakControl$StatementRunner.run(ThreadLeakControl.java:368)
        at com.carrotsearch.randomizedtesting.ThreadLeakControl.forkTimeoutingTask(ThreadLeakControl.java:817)
        at com.carrotsearch.randomizedtesting.ThreadLeakControl$3.evaluate(ThreadLeakControl.java:468)
        at com.carrotsearch.randomizedtesting.RandomizedRunner.runSingleTest(RandomizedRunner.java:947)
        at com.carrotsearch.randomizedtesting.RandomizedRunner$5.evaluate(RandomizedRunner.java:832)
        at com.carrotsearch.randomizedtesting.RandomizedRunner$6.evaluate(RandomizedRunner.java:883)
        at com.carrotsearch.randomizedtesting.RandomizedRunner$7.evaluate(RandomizedRunner.java:894)
        at com.carrotsearch.randomizedtesting.rules.StatementAdapter.evaluate(StatementAdapter.java:36)
        at com.carrotsearch.randomizedtesting.rules.SystemPropertiesRestoreRule$1.evaluate(SystemPropertiesRestoreRule.java:57)
        at org.apache.lucene.util.AbstractBeforeAfterRule$1.evaluate(AbstractBeforeAfterRule.java:45)
        at com.carrotsearch.randomizedtesting.rules.StatementAdapter.evaluate(StatementAdapter.java:36)
        at org.apache.lucene.util.TestRuleStoreClassName$1.evaluate(TestRuleStoreClassName.java:41)
        at com.carrotsearch.randomizedtesting.rules.NoShadowingOrOverridesOnMethodsRule$1.evaluate(NoShadowingOrOverridesOnMethodsRule.java:40)
        at com.carrotsearch.randomizedtesting.rules.NoShadowingOrOverridesOnMethodsRule$1.evaluate(NoShadowingOrOverridesOnMethodsRule.java:40)
        at com.carrotsearch.randomizedtesting.rules.StatementAdapter.evaluate(StatementAdapter.java:36)
        at com.carrotsearch.randomizedtesting.rules.StatementAdapter.evaluate(StatementAdapter.java:36)
        at org.apache.lucene.util.TestRuleAssertionsRequired$1.evaluate(TestRuleAssertionsRequired.java:53)
        at org.apache.lucene.util.TestRuleMarkFailure$1.evaluate(TestRuleMarkFailure.java:47)
        at org.apache.lucene.util.TestRuleIgnoreAfterMaxFailures$1.evaluate(TestRuleIgnoreAfterMaxFailures.java:64)
        at org.apache.lucene.util.TestRuleIgnoreTestSuites$1.evaluate(TestRuleIgnoreTestSuites.java:54)
        at com.carrotsearch.randomizedtesting.rules.StatementAdapter.evaluate(StatementAdapter.java:36)
        at com.carrotsearch.randomizedtesting.ThreadLeakControl$StatementRunner.run(ThreadLeakControl.java:368)
        at java.base/java.lang.Thread.run(Thread.java:835)


FAILED:  org.apache.solr.cloud.TestTlogReplica.testAddDocs

Error Message:


Stack Trace:
java.lang.NullPointerException
        at __randomizedtesting.SeedInfo.seed([921D47C5DD583140:72965CC33E16C3AD]:0)
        at org.apache.solr.cloud.TestTlogReplica.testAddDocs(TestTlogReplica.java:251)
        at java.base/jdk.internal.reflect.NativeMethodAccessorImpl.invoke0(Native Method)
        at java.base/jdk.internal.reflect.NativeMethodAccessorImpl.invoke(NativeMethodAccessorImpl.java:62)
        at java.base/jdk.internal.reflect.DelegatingMethodAccessorImpl.invoke(DelegatingMethodAccessorImpl.java:43)
        at java.base/java.lang.reflect.Method.invoke(Method.java:567)
        at com.carrotsearch.randomizedtesting.RandomizedRunner.invoke(RandomizedRunner.java:1750)
        at com.carrotsearch.randomizedtesting.RandomizedRunner$8.evaluate(RandomizedRunner.java:938)
        at com.carrotsearch.randomizedtesting.RandomizedRunner$9.evaluate(RandomizedRunner.java:974)
        at com.carrotsearch.randomizedtesting.RandomizedRunner$10.evaluate(RandomizedRunner.java:988)
        at com.carrotsearch.randomizedtesting.rules.SystemPropertiesRestoreRule$1.evaluate(SystemPropertiesRestoreRule.java:57)
        at org.apache.lucene.util.TestRuleSetupTeardownChained$1.evaluate(TestRuleSetupTeardownChained.java:49)
        at org.apache.lucene.util.AbstractBeforeAfterRule$1.evaluate(AbstractBeforeAfterRule.java:45)
        at org.apache.lucene.util.TestRuleThreadAndTestName$1.evaluate(TestRuleThreadAndTestName.java:48)
        at org.apache.lucene.util.TestRuleIgnoreAfterMaxFailures$1.evaluate(TestRuleIgnoreAfterMaxFailures.java:64)
        at org.apache.lucene.util.TestRuleMarkFailure$1.evaluate(TestRuleMarkFailure.java:47)
        at com.carrotsearch.randomizedtesting.rules.StatementAdapter.evaluate(StatementAdapter.java:36)
        at com.carrotsearch.randomizedtesting.ThreadLeakControl$StatementRunner.run(ThreadLeakControl.java:368)
        at com.carrotsearch.randomizedtesting.ThreadLeakControl.forkTimeoutingTask(ThreadLeakControl.java:817)
        at com.carrotsearch.randomizedtesting.ThreadLeakControl$3.evaluate(ThreadLeakControl.java:468)
        at com.carrotsearch.randomizedtesting.RandomizedRunner.runSingleTest(RandomizedRunner.java:947)
        at com.carrotsearch.randomizedtesting.RandomizedRunner$5.evaluate(RandomizedRunner.java:832)
        at com.carrotsearch.randomizedtesting.RandomizedRunner$6.evaluate(RandomizedRunner.java:883)
        at com.carrotsearch.randomizedtesting.RandomizedRunner$7.evaluate(RandomizedRunner.java:894)
        at com.carrotsearch.randomizedtesting.rules.StatementAdapter.evaluate(StatementAdapter.java:36)
        at com.carrotsearch.randomizedtesting.rules.SystemPropertiesRestoreRule$1.evaluate(SystemPropertiesRestoreRule.java:57)
        at org.apache.lucene.util.AbstractBeforeAfterRule$1.evaluate(AbstractBeforeAfterRule.java:45)
        at com.carrotsearch.randomizedtesting.rules.StatementAdapter.evaluate(StatementAdapter.java:36)
        at org.apache.lucene.util.TestRuleStoreClassName$1.evaluate(TestRuleStoreClassName.java:41)
        at com.carrotsearch.randomizedtesting.rules.NoShadowingOrOverridesOnMethodsRule$1.evaluate(NoShadowingOrOverridesOnMethodsRule.java:40)
        at com.carrotsearch.randomizedtesting.rules.NoShadowingOrOverridesOnMethodsRule$1.evaluate(NoShadowingOrOverridesOnMethodsRule.java:40)
        at com.carrotsearch.randomizedtesting.rules.StatementAdapter.evaluate(StatementAdapter.java:36)
        at com.carrotsearch.randomizedtesting.rules.StatementAdapter.evaluate(StatementAdapter.java:36)
        at org.apache.lucene.util.TestRuleAssertionsRequired$1.evaluate(TestRuleAssertionsRequired.java:53)
        at org.apache.lucene.util.TestRuleMarkFailure$1.evaluate(TestRuleMarkFailure.java:47)
        at org.apache.lucene.util.TestRuleIgnoreAfterMaxFailures$1.evaluate(TestRuleIgnoreAfterMaxFailures.java:64)
        at org.apache.lucene.util.TestRuleIgnoreTestSuites$1.evaluate(TestRuleIgnoreTestSuites.java:54)
        at com.carrotsearch.randomizedtesting.rules.StatementAdapter.evaluate(StatementAdapter.java:36)
        at com.carrotsearch.randomizedtesting.ThreadLeakControl$StatementRunner.run(ThreadLeakControl.java:368)
        at java.base/java.lang.Thread.run(Thread.java:835)


FAILED:  org.apache.solr.cloud.TestTlogReplica.testAddDocs

Error Message:


Stack Trace:
java.lang.NullPointerException
        at __randomizedtesting.SeedInfo.seed([921D47C5DD583140:72965CC33E16C3AD]:0)
        at org.apache.solr.cloud.TestTlogReplica.testAddDocs(TestTlogReplica.java:251)
        at java.base/jdk.internal.reflect.NativeMethodAccessorImpl.invoke0(Native Method)
        at java.base/jdk.internal.reflect.NativeMethodAccessorImpl.invoke(NativeMethodAccessorImpl.java:62)
        at java.base/jdk.internal.reflect.DelegatingMethodAccessorImpl.invoke(DelegatingMethodAccessorImpl.java:43)
        at java.base/java.lang.reflect.Method.invoke(Method.java:567)
        at com.carrotsearch.randomizedtesting.RandomizedRunner.invoke(RandomizedRunner.java:1750)
        at com.carrotsearch.randomizedtesting.RandomizedRunner$8.evaluate(RandomizedRunner.java:938)
        at com.carrotsearch.randomizedtesting.RandomizedRunner$9.evaluate(RandomizedRunner.java:974)
        at com.carrotsearch.randomizedtesting.RandomizedRunner$10.evaluate(RandomizedRunner.java:988)
        at com.carrotsearch.randomizedtesting.rules.SystemPropertiesRestoreRule$1.evaluate(SystemPropertiesRestoreRule.java:57)
        at org.apache.lucene.util.TestRuleSetupTeardownChained$1.evaluate(TestRuleSetupTeardownChained.java:49)
        at org.apache.lucene.util.AbstractBeforeAfterRule$1.evaluate(AbstractBeforeAfterRule.java:45)
        at org.apache.lucene.util.TestRuleThreadAndTestName$1.evaluate(TestRuleThreadAndTestName.java:48)
        at org.apache.lucene.util.TestRuleIgnoreAfterMaxFailures$1.evaluate(TestRuleIgnoreAfterMaxFailures.java:64)
        at org.apache.lucene.util.TestRuleMarkFailure$1.evaluate(TestRuleMarkFailure.java:47)
        at com.carrotsearch.randomizedtesting.rules.StatementAdapter.evaluate(StatementAdapter.java:36)
        at com.carrotsearch.randomizedtesting.ThreadLeakControl$StatementRunner.run(ThreadLeakControl.java:368)
        at com.carrotsearch.randomizedtesting.ThreadLeakControl.forkTimeoutingTask(ThreadLeakControl.java:817)
        at com.carrotsearch.randomizedtesting.ThreadLeakControl$3.evaluate(ThreadLeakControl.java:468)
        at com.carrotsearch.randomizedtesting.RandomizedRunner.runSingleTest(RandomizedRunner.java:947)
        at com.carrotsearch.randomizedtesting.RandomizedRunner$5.evaluate(RandomizedRunner.java:832)
        at com.carrotsearch.randomizedtesting.RandomizedRunner$6.evaluate(RandomizedRunner.java:883)
        at com.carrotsearch.randomizedtesting.RandomizedRunner$7.evaluate(RandomizedRunner.java:894)
        at com.carrotsearch.randomizedtesting.rules.StatementAdapter.evaluate(StatementAdapter.java:36)
        at com.carrotsearch.randomizedtesting.rules.SystemPropertiesRestoreRule$1.evaluate(SystemPropertiesRestoreRule.java:57)
        at org.apache.lucene.util.AbstractBeforeAfterRule$1.evaluate(AbstractBeforeAfterRule.java:45)
        at com.carrotsearch.randomizedtesting.rules.StatementAdapter.evaluate(StatementAdapter.java:36)
        at org.apache.lucene.util.TestRuleStoreClassName$1.evaluate(TestRuleStoreClassName.java:41)
        at com.carrotsearch.randomizedtesting.rules.NoShadowingOrOverridesOnMethodsRule$1.evaluate(NoShadowingOrOverridesOnMethodsRule.java:40)
        at com.carrotsearch.randomizedtesting.rules.NoShadowingOrOverridesOnMethodsRule$1.evaluate(NoShadowingOrOverridesOnMethodsRule.java:40)
        at com.carrotsearch.randomizedtesting.rules.StatementAdapter.evaluate(StatementAdapter.java:36)
        at com.carrotsearch.randomizedtesting.rules.StatementAdapter.evaluate(StatementAdapter.java:36)
        at org.apache.lucene.util.TestRuleAssertionsRequired$1.evaluate(TestRuleAssertionsRequired.java:53)
        at org.apache.lucene.util.TestRuleMarkFailure$1.evaluate(TestRuleMarkFailure.java:47)
        at org.apache.lucene.util.TestRuleIgnoreAfterMaxFailures$1.evaluate(TestRuleIgnoreAfterMaxFailures.java:64)
        at org.apache.lucene.util.TestRuleIgnoreTestSuites$1.evaluate(TestRuleIgnoreTestSuites.java:54)
        at com.carrotsearch.randomizedtesting.rules.StatementAdapter.evaluate(StatementAdapter.java:36)
        at com.carrotsearch.randomizedtesting.ThreadLeakControl$StatementRunner.run(ThreadLeakControl.java:368)
        at java.base/java.lang.Thread.run(Thread.java:835)


FAILED:  org.apache.solr.cloud.TestTlogReplica.testAddDocs

Error Message:
Error from server at https://127.0.0.1:46197/solr: Underlying core creation failed while creating collection: tlog_replica_test_add_docs

Stack Trace:
org.apache.solr.client.solrj.impl.HttpSolrClient$RemoteSolrException: Error from server at https://127.0.0.1:46197/solr: Underlying core creation failed while creating collection: tlog_replica_test_add_docs
        at __randomizedtesting.SeedInfo.seed([921D47C5DD583140:72965CC33E16C3AD]:0)
        at org.apache.solr.client.solrj.impl.HttpSolrClient.executeMethod(HttpSolrClient.java:665)
        at org.apache.solr.client.solrj.impl.HttpSolrClient.request(HttpSolrClient.java:265)
        at org.apache.solr.client.solrj.impl.HttpSolrClient.request(HttpSolrClient.java:248)
        at org.apache.solr.client.solrj.impl.LBSolrClient.doRequest(LBSolrClient.java:368)
        at org.apache.solr.client.solrj.impl.LBSolrClient.request(LBSolrClient.java:296)
        at org.apache.solr.client.solrj.impl.BaseCloudSolrClient.sendRequest(BaseCloudSolrClient.java:1127)
        at org.apache.solr.client.solrj.impl.BaseCloudSolrClient.requestWithRetryOnStaleState(BaseCloudSolrClient.java:896)
        at org.apache.solr.client.solrj.impl.BaseCloudSolrClient.request(BaseCloudSolrClient.java:828)
        at org.apache.solr.client.solrj.SolrRequest.process(SolrRequest.java:207)
        at org.apache.solr.client.solrj.SolrRequest.process(SolrRequest.java:224)
        at org.apache.solr.cloud.TestTlogReplica.createAndWaitForCollection(TestTlogReplica.java:753)
        at org.apache.solr.cloud.TestTlogReplica.testAddDocs(TestTlogReplica.java:226)
        at java.base/jdk.internal.reflect.NativeMethodAccessorImpl.invoke0(Native Method)
        at java.base/jdk.internal.reflect.NativeMethodAccessorImpl.invoke(NativeMethodAccessorImpl.java:62)
        at java.base/jdk.internal.reflect.DelegatingMethodAccessorImpl.invoke(DelegatingMethodAccessorImpl.java:43)
        at java.base/java.lang.reflect.Method.invoke(Method.java:567)
        at com.carrotsearch.randomizedtesting.RandomizedRunner.invoke(RandomizedRunner.java:1750)
        at com.carrotsearch.randomizedtesting.RandomizedRunner$8.evaluate(RandomizedRunner.java:938)
        at com.carrotsearch.randomizedtesting.RandomizedRunner$9.evaluate(RandomizedRunner.java:974)
        at com.carrotsearch.randomizedtesting.RandomizedRunner$10.evaluate(RandomizedRunner.java:988)
        at com.carrotsearch.randomizedtesting.rules.SystemPropertiesRestoreRule$1.evaluate(SystemPropertiesRestoreRule.java:57)
        at org.apache.lucene.util.TestRuleSetupTeardownChained$1.evaluate(TestRuleSetupTeardownChained.java:49)
        at org.apache.lucene.util.AbstractBeforeAfterRule$1.evaluate(AbstractBeforeAfterRule.java:45)
        at org.apache.lucene.util.TestRuleThreadAndTestName$1.evaluate(TestRuleThreadAndTestName.java:48)
        at org.apache.lucene.util.TestRuleIgnoreAfterMaxFailures$1.evaluate(TestRuleIgnoreAfterMaxFailures.java:64)
        at org.apache.lucene.util.TestRuleMarkFailure$1.evaluate(TestRuleMarkFailure.java:47)
        at com.carrotsearch.randomizedtesting.rules.StatementAdapter.evaluate(StatementAdapter.java:36)
        at com.carrotsearch.randomizedtesting.ThreadLeakControl$StatementRunner.run(ThreadLeakControl.java:368)
        at com.carrotsearch.randomizedtesting.ThreadLeakControl.forkTimeoutingTask(ThreadLeakControl.java:817)
        at com.carrotsearch.randomizedtesting.ThreadLeakControl$3.evaluate(ThreadLeakControl.java:468)
        at com.carrotsearch.randomizedtesting.RandomizedRunner.runSingleTest(RandomizedRunner.java:947)
        at com.carrotsearch.randomizedtesting.RandomizedRunner$5.evaluate(RandomizedRunner.java:832)
        at com.carrotsearch.randomizedtesting.RandomizedRunner$6.evaluate(RandomizedRunner.java:883)
        at com.carrotsearch.randomizedtesting.RandomizedRunner$7.evaluate(RandomizedRunner.java:894)
        at com.carrotsearch.randomizedtesting.rules.StatementAdapter.evaluate(StatementAdapter.java:36)
        at com.carrotsearch.randomizedtesting.rules.SystemPropertiesRestoreRule$1.evaluate(SystemPropertiesRestoreRule.java:57)
        at org.apache.lucene.util.AbstractBeforeAfterRule$1.evaluate(AbstractBeforeAfterRule.java:45)
        at com.carrotsearch.randomizedtesting.rules.StatementAdapter.evaluate(StatementAdapter.java:36)
        at org.apache.lucene.util.TestRuleStoreClassName$1.evaluate(TestRuleStoreClassName.java:41)
        at com.carrotsearch.randomizedtesting.rules.NoShadowingOrOverridesOnMethodsRule$1.evaluate(NoShadowingOrOverridesOnMethodsRule.java:40)
        at com.carrotsearch.randomizedtesting.rules.NoShadowingOrOverridesOnMethodsRule$1.evaluate(NoShadowingOrOverridesOnMethodsRule.java:40)
        at com.carrotsearch.randomizedtesting.rules.StatementAdapter.evaluate(StatementAdapter.java:36)
        at com.carrotsearch.randomizedtesting.rules.StatementAdapter.evaluate(StatementAdapter.java:36)
        at org.apache.lucene.util.TestRuleAssertionsRequired$1.evaluate(TestRuleAssertionsRequired.java:53)
        at org.apache.lucene.util.TestRuleMarkFailure$1.evaluate(TestRuleMarkFailure.java:47)
        at org.apache.lucene.util.TestRuleIgnoreAfterMaxFailures$1.evaluate(TestRuleIgnoreAfterMaxFailures.java:64)
        at org.apache.lucene.util.TestRuleIgnoreTestSuites$1.evaluate(TestRuleIgnoreTestSuites.java:54)
        at com.carrotsearch.randomizedtesting.rules.StatementAdapter.evaluate(StatementAdapter.java:36)
        at com.carrotsearch.randomizedtesting.ThreadLeakControl$StatementRunner.run(ThreadLeakControl.java:368)
        at java.base/java.lang.Thread.run(Thread.java:835)




Build Log:
[...truncated 13913 lines...]
   [junit4] Suite: org.apache.solr.cloud.TestTlogReplica
   [junit4]   2> 906215 INFO  (SUITE-TestTlogReplica-seed#[921D47C5DD583140]-worker) [     ] o.a.s.SolrTestCaseJ4 Created dataDir: /home/jenkins/workspace/Lucene-Solr-master-Linux/solr/build/solr-core/test/J2/temp/solr.cloud.TestTlogReplica_921D47C5DD583140-001/data-dir-151-001
   [junit4]   2> 906215 WARN  (SUITE-TestTlogReplica-seed#[921D47C5DD583140]-worker) [     ] o.a.s.SolrTestCaseJ4 startTrackingSearchers: numOpens=6 numCloses=6
   [junit4]   2> 906215 INFO  (SUITE-TestTlogReplica-seed#[921D47C5DD583140]-worker) [     ] o.a.s.SolrTestCaseJ4 Using TrieFields (NUMERIC_POINTS_SYSPROP=false) w/NUMERIC_DOCVALUES_SYSPROP=false
   [junit4]   2> 906215 INFO  (SUITE-TestTlogReplica-seed#[921D47C5DD583140]-worker) [     ] o.a.s.SolrTestCaseJ4 Randomized ssl (true) and clientAuth (true) via: @org.apache.solr.util.RandomizeSSL(reason="", ssl=0.0/0.0, value=0.0/0.0, clientAuth=0.0/0.0)
   [junit4]   2> 906216 INFO  (SUITE-TestTlogReplica-seed#[921D47C5DD583140]-worker) [     ] o.a.s.SolrTestCaseJ4 SecureRandom sanity checks: test.solr.allowed.securerandom=null & java.security.egd=file:/dev/./urandom
   [junit4]   2> 906216 INFO  (SUITE-TestTlogReplica-seed#[921D47C5DD583140]-worker) [     ] o.a.s.c.MiniSolrCloudCluster Starting cluster of 2 servers in /home/jenkins/workspace/Lucene-Solr-master-Linux/solr/build/solr-core/test/J2/temp/solr.cloud.TestTlogReplica_921D47C5DD583140-001/tempDir-001
   [junit4]   2> 906217 INFO  (SUITE-TestTlogReplica-seed#[921D47C5DD583140]-worker) [     ] o.a.s.c.ZkTestServer STARTING ZK TEST SERVER
   [junit4]   2> 906217 INFO  (ZkTestServer Run Thread) [     ] o.a.s.c.ZkTestServer client port:0.0.0.0/0.0.0.0:0
   [junit4]   2> 906217 INFO  (ZkTestServer Run Thread) [     ] o.a.s.c.ZkTestServer Starting server
   [junit4]   2> 906317 INFO  (SUITE-TestTlogReplica-seed#[921D47C5DD583140]-worker) [     ] o.a.s.c.ZkTestServer start zk server on port:38159
   [junit4]   2> 906317 INFO  (SUITE-TestTlogReplica-seed#[921D47C5DD583140]-worker) [     ] o.a.s.c.ZkTestServer waitForServerUp: 127.0.0.1:38159
   [junit4]   2> 906317 INFO  (SUITE-TestTlogReplica-seed#[921D47C5DD583140]-worker) [     ] o.a.s.c.ZkTestServer parse host and port list: 127.0.0.1:38159
   [junit4]   2> 906317 INFO  (SUITE-TestTlogReplica-seed#[921D47C5DD583140]-worker) [     ] o.a.s.c.ZkTestServer connecting to 127.0.0.1 38159
   [junit4]   2> 906319 INFO  (SUITE-TestTlogReplica-seed#[921D47C5DD583140]-worker) [     ] o.a.s.c.c.ConnectionManager Waiting for client to connect to ZooKeeper
   [junit4]   2> 906320 INFO  (zkConnectionManagerCallback-5315-thread-1) [     ] o.a.s.c.c.ConnectionManager zkClient has connected
   [junit4]   2> 906320 INFO  (SUITE-TestTlogReplica-seed#[921D47C5DD583140]-worker) [     ] o.a.s.c.c.ConnectionManager Client is connected to ZooKeeper
   [junit4]   2> 906321 INFO  (SUITE-TestTlogReplica-seed#[921D47C5DD583140]-worker) [     ] o.a.s.c.c.ConnectionManager Waiting for client to connect to ZooKeeper
   [junit4]   2> 906322 INFO  (zkConnectionManagerCallback-5317-thread-1) [     ] o.a.s.c.c.ConnectionManager zkClient has connected
   [junit4]   2> 906322 INFO  (SUITE-TestTlogReplica-seed#[921D47C5DD583140]-worker) [     ] o.a.s.c.c.ConnectionManager Client is connected to ZooKeeper
   [junit4]   2> 906323 INFO  (SUITE-TestTlogReplica-seed#[921D47C5DD583140]-worker) [     ] o.a.s.c.c.ConnectionManager Waiting for client to connect to ZooKeeper
   [junit4]   2> 906324 INFO  (zkConnectionManagerCallback-5319-thread-1) [     ] o.a.s.c.c.ConnectionManager zkClient has connected
   [junit4]   2> 906324 INFO  (SUITE-TestTlogReplica-seed#[921D47C5DD583140]-worker) [     ] o.a.s.c.c.ConnectionManager Client is connected to ZooKeeper
   [junit4]   2> 906428 WARN  (jetty-launcher-5320-thread-1) [     ] o.e.j.s.AbstractConnector Ignoring deprecated socket close linger time
   [junit4]   2> 906428 WARN  (jetty-launcher-5320-thread-2) [     ] o.e.j.s.AbstractConnector Ignoring deprecated socket close linger time
   [junit4]   2> 906428 INFO  (jetty-launcher-5320-thread-2) [     ] o.a.s.c.s.e.JettySolrRunner Start Jetty (configured port=0, binding port=0)
   [junit4]   2> 906428 INFO  (jetty-launcher-5320-thread-1) [     ] o.a.s.c.s.e.JettySolrRunner Start Jetty (configured port=0, binding port=0)
   [junit4]   2> 906428 INFO  (jetty-launcher-5320-thread-2) [     ] o.a.s.c.s.e.JettySolrRunner Trying to start Jetty on port 0 try number 1 ...
   [junit4]   2> 906428 INFO  (jetty-launcher-5320-thread-1) [     ] o.a.s.c.s.e.JettySolrRunner Trying to start Jetty on port 0 try number 1 ...
   [junit4]   2> 906428 INFO  (jetty-launcher-5320-thread-2) [     ] o.e.j.s.Server jetty-9.4.19.v20190610; built: 2019-06-10T16:30:51.723Z; git: afcf563148970e98786327af5e07c261fda175d3; jvm 12.0.1+12
   [junit4]   2> 906428 INFO  (jetty-launcher-5320-thread-1) [     ] o.e.j.s.Server jetty-9.4.19.v20190610; built: 2019-06-10T16:30:51.723Z; git: afcf563148970e98786327af5e07c261fda175d3; jvm 12.0.1+12
   [junit4]   2> 906429 INFO  (jetty-launcher-5320-thread-2) [     ] o.e.j.s.session DefaultSessionIdManager workerName=node0
   [junit4]   2> 906429 INFO  (jetty-launcher-5320-thread-2) [     ] o.e.j.s.session No SessionScavenger set, using defaults
   [junit4]   2> 906429 INFO  (jetty-launcher-5320-thread-2) [     ] o.e.j.s.session node0 Scavenging every 660000ms
   [junit4]   2> 906429 INFO  (jetty-launcher-5320-thread-1) [     ] o.e.j.s.session DefaultSessionIdManager workerName=node0
   [junit4]   2> 906429 INFO  (jetty-launcher-5320-thread-1) [     ] o.e.j.s.session No SessionScavenger set, using defaults
   [junit4]   2> 906430 INFO  (jetty-launcher-5320-thread-1) [     ] o.e.j.s.session node0 Scavenging every 600000ms
   [junit4]   2> 906430 INFO  (jetty-launcher-5320-thread-2) [     ] o.e.j.s.h.ContextHandler Started o.e.j.s.ServletContextHandler@7db5597d{/solr,null,AVAILABLE}
   [junit4]   2> 906430 INFO  (jetty-launcher-5320-thread-1) [     ] o.e.j.s.h.ContextHandler Started o.e.j.s.ServletContextHandler@42168c02{/solr,null,AVAILABLE}
   [junit4]   2> 906430 INFO  (jetty-launcher-5320-thread-2) [     ] o.e.j.s.AbstractConnector Started ServerConnector@6d3a3c1d{ssl,[ssl, alpn, http/1.1, h2]}{127.0.0.1:46197}
   [junit4]   2> 906430 INFO  (jetty-launcher-5320-thread-2) [     ] o.e.j.s.Server Started @906465ms
   [junit4]   2> 906430 INFO  (jetty-launcher-5320-thread-2) [     ] o.a.s.c.s.e.JettySolrRunner Jetty properties: {hostContext=/solr, hostPort=46197}
   [junit4]   2> 906430 INFO  (jetty-launcher-5320-thread-1) [     ] o.e.j.s.AbstractConnector Started ServerConnector@678c1c6b{ssl,[ssl, alpn, http/1.1, h2]}{127.0.0.1:44231}
   [junit4]   2> 906430 INFO  (jetty-launcher-5320-thread-1) [     ] o.e.j.s.Server Started @906465ms
   [junit4]   2> 906430 INFO  (jetty-launcher-5320-thread-1) [     ] o.a.s.c.s.e.JettySolrRunner Jetty properties: {hostContext=/solr, hostPort=44231}
   [junit4]   2> 906430 ERROR (jetty-launcher-5320-thread-2) [     ] o.a.s.u.StartupLoggingUtils Missing Java Option solr.log.dir. Logging may be missing or incomplete.
   [junit4]   2> 906430 INFO  (jetty-launcher-5320-thread-2) [     ] o.a.s.s.SolrDispatchFilter Using logger factory org.apache.logging.slf4j.Log4jLoggerFactory
   [junit4]   2> 906430 ERROR (jetty-launcher-5320-thread-1) [     ] o.a.s.u.StartupLoggingUtils Missing Java Option solr.log.dir. Logging may be missing or incomplete.
   [junit4]   2> 906430 INFO  (jetty-launcher-5320-thread-1) [     ] o.a.s.s.SolrDispatchFilter Using logger factory org.apache.logging.slf4j.Log4jLoggerFactory
   [junit4]   2> 906431 INFO  (jetty-launcher-5320-thread-1) [     ] o.a.s.s.SolrDispatchFilter  ___      _       Welcome to Apache Solr™ version 9.0.0
   [junit4]   2> 906431 INFO  (jetty-launcher-5320-thread-2) [     ] o.a.s.s.SolrDispatchFilter  ___      _       Welcome to Apache Solr™ version 9.0.0
   [junit4]   2> 906431 INFO  (jetty-launcher-5320-thread-2) [     ] o.a.s.s.SolrDispatchFilter / __| ___| |_ _   Starting in cloud mode on port null
   [junit4]   2> 906431 INFO  (jetty-launcher-5320-thread-1) [     ] o.a.s.s.SolrDispatchFilter / __| ___| |_ _   Starting in cloud mode on port null
   [junit4]   2> 906431 INFO  (jetty-launcher-5320-thread-1) [     ] o.a.s.s.SolrDispatchFilter \__ \/ _ \ | '_|  Install dir: null
   [junit4]   2> 906431 INFO  (jetty-launcher-5320-thread-2) [     ] o.a.s.s.SolrDispatchFilter \__ \/ _ \ | '_|  Install dir: null
   [junit4]   2> 906431 INFO  (jetty-launcher-5320-thread-2) [     ] o.a.s.s.SolrDispatchFilter |___/\___/_|_|    Start time: 2019-10-23T23:18:58.656049Z
   [junit4]   2> 906431 INFO  (jetty-launcher-5320-thread-1) [     ] o.a.s.s.SolrDispatchFilter |___/\___/_|_|    Start time: 2019-10-23T23:18:58.656049Z
   [junit4]   2> 906431 INFO  (jetty-launcher-5320-thread-2) [     ] o.a.s.c.c.ConnectionManager Waiting for client to connect to ZooKeeper
   [junit4]   2> 906433 INFO  (jetty-launcher-5320-thread-1) [     ] o.a.s.c.c.ConnectionManager Waiting for client to connect to ZooKeeper
   [junit4]   2> 906437 INFO  (zkConnectionManagerCallback-5323-thread-1) [     ] o.a.s.c.c.ConnectionManager zkClient has connected
   [junit4]   2> 906437 INFO  (jetty-launcher-5320-thread-2) [     ] o.a.s.c.c.ConnectionManager Client is connected to ZooKeeper
   [junit4]   2> 906438 INFO  (zkConnectionManagerCallback-5324-thread-1) [     ] o.a.s.c.c.ConnectionManager zkClient has connected
   [junit4]   2> 906438 INFO  (jetty-launcher-5320-thread-1) [     ] o.a.s.c.c.ConnectionManager Client is connected to ZooKeeper
   [junit4]   2> 906438 INFO  (jetty-launcher-5320-thread-2) [     ] o.a.s.s.SolrDispatchFilter solr.xml found in ZooKeeper. Loading...
   [junit4]   2> 906438 INFO  (jetty-launcher-5320-thread-1) [     ] o.a.s.s.SolrDispatchFilter solr.xml found in ZooKeeper. Loading...
   [junit4]   2> 906599 INFO  (jetty-launcher-5320-thread-2) [     ] o.a.s.h.c.HttpShardHandlerFactory Host whitelist initialized: WhitelistHostChecker [whitelistHosts=null, whitelistHostCheckingEnabled=true]
   [junit4]   2> 906600 WARN  (jetty-launcher-5320-thread-2) [     ] o.e.j.u.s.S.config Trusting all certificates configured for Client@3cd457a0[provider=null,keyStore=null,trustStore=null]
   [junit4]   2> 906600 WARN  (jetty-launcher-5320-thread-2) [     ] o.e.j.u.s.S.config No Client EndPointIdentificationAlgorithm configured for Client@3cd457a0[provider=null,keyStore=null,trustStore=null]
   [junit4]   2> 906602 WARN  (jetty-launcher-5320-thread-2) [     ] o.e.j.u.s.S.config Trusting all certificates configured for Client@2e87936a[provider=null,keyStore=null,trustStore=null]
   [junit4]   2> 906603 WARN  (jetty-launcher-5320-thread-2) [     ] o.e.j.u.s.S.config No Client EndPointIdentificationAlgorithm configured for Client@2e87936a[provider=null,keyStore=null,trustStore=null]
   [junit4]   2> 906603 INFO  (jetty-launcher-5320-thread-2) [     ] o.a.s.c.ZkContainer Zookeeper client=127.0.0.1:38159/solr
   [junit4]   2> 906604 INFO  (jetty-launcher-5320-thread-2) [     ] o.a.s.c.c.ConnectionManager Waiting for client to connect to ZooKeeper
   [junit4]   2> 906604 INFO  (zkConnectionManagerCallback-5331-thread-1) [     ] o.a.s.c.c.ConnectionManager zkClient has connected
   [junit4]   2> 906604 INFO  (jetty-launcher-5320-thread-2) [     ] o.a.s.c.c.ConnectionManager Client is connected to ZooKeeper
   [junit4]   2> 906715 INFO  (jetty-launcher-5320-thread-1) [     ] o.a.s.h.c.HttpShardHandlerFactory Host whitelist initialized: WhitelistHostChecker [whitelistHosts=null, whitelistHostCheckingEnabled=true]
   [junit4]   2> 906716 WARN  (jetty-launcher-5320-thread-1) [     ] o.e.j.u.s.S.config Trusting all certificates configured for Client@31cb6377[provider=null,keyStore=null,trustStore=null]
   [junit4]   2> 906716 WARN  (jetty-launcher-5320-thread-1) [     ] o.e.j.u.s.S.config No Client EndPointIdentificationAlgorithm configured for Client@31cb6377[provider=null,keyStore=null,trustStore=null]
   [junit4]   2> 906718 WARN  (jetty-launcher-5320-thread-1) [     ] o.e.j.u.s.S.config Trusting all certificates configured for Client@2ac52a6a[provider=null,keyStore=null,trustStore=null]
   [junit4]   2> 906718 WARN  (jetty-launcher-5320-thread-1) [     ] o.e.j.u.s.S.config No Client EndPointIdentificationAlgorithm configured for Client@2ac52a6a[provider=null,keyStore=null,trustStore=null]
   [junit4]   2> 906719 INFO  (jetty-launcher-5320-thread-1) [     ] o.a.s.c.ZkContainer Zookeeper client=127.0.0.1:38159/solr
   [junit4]   2> 906720 INFO  (jetty-launcher-5320-thread-1) [     ] o.a.s.c.c.ConnectionManager Waiting for client to connect to ZooKeeper
   [junit4]   2> 906721 INFO  (zkConnectionManagerCallback-5338-thread-1) [     ] o.a.s.c.c.ConnectionManager zkClient has connected
   [junit4]   2> 906721 INFO  (jetty-launcher-5320-thread-1) [     ] o.a.s.c.c.ConnectionManager Client is connected to ZooKeeper
   [junit4]   2> 906742 INFO  (jetty-launcher-5320-thread-2) [n:127.0.0.1:46197_solr     ] o.a.s.c.c.ConnectionManager Waiting for client to connect to ZooKeeper
   [junit4]   2> 906743 INFO  (zkConnectionManagerCallback-5340-thread-1) [     ] o.a.s.c.c.ConnectionManager zkClient has connected
   [junit4]   2> 906743 INFO  (jetty-launcher-5320-thread-2) [n:127.0.0.1:46197_solr     ] o.a.s.c.c.ConnectionManager Client is connected to ZooKeeper
   [junit4]   2> 906786 INFO  (jetty-launcher-5320-thread-2) [n:127.0.0.1:46197_solr     ] o.a.s.c.OverseerElectionContext I am going to be the leader 127.0.0.1:46197_solr
   [junit4]   2> 906786 INFO  (jetty-launcher-5320-thread-2) [n:127.0.0.1:46197_solr     ] o.a.s.c.Overseer Overseer (id=72359720253652999-127.0.0.1:46197_solr-n_0000000000) starting
   [junit4]   2> 906788 INFO  (OverseerStateUpdate-72359720253652999-127.0.0.1:46197_solr-n_0000000000) [n:127.0.0.1:46197_solr     ] o.a.s.c.Overseer Starting to work on the main queue : 127.0.0.1:46197_solr
   [junit4]   2> 906789 INFO  (jetty-launcher-5320-thread-2) [n:127.0.0.1:46197_solr     ] o.a.s.c.ZkController Register node as live in ZooKeeper:/live_nodes/127.0.0.1:46197_solr
   [junit4]   2> 906789 INFO  (zkCallback-5339-thread-1) [     ] o.a.s.c.c.ZkStateReader Updated live nodes from ZooKeeper... (0) -> (1)
   [junit4]   2> 906798 INFO  (jetty-launcher-5320-thread-2) [n:127.0.0.1:46197_solr     ] o.a.s.h.a.MetricsHistoryHandler No .system collection, keeping metrics history in memory.
   [junit4]   2> 906815 INFO  (jetty-launcher-5320-thread-2) [n:127.0.0.1:46197_solr     ] o.a.s.m.r.SolrJmxReporter JMX monitoring for 'solr_46197.solr.node' (registry 'solr.node') enabled at server: com.sun.jmx.mbeanserver.JmxMBeanServer@2cf47394
   [junit4]   2> 906821 INFO  (jetty-launcher-5320-thread-2) [n:127.0.0.1:46197_solr     ] o.a.s.m.r.SolrJmxReporter JMX monitoring for 'solr_46197.solr.jvm' (registry 'solr.jvm') enabled at server: com.sun.jmx.mbeanserver.JmxMBeanServer@2cf47394
   [junit4]   2> 906821 INFO  (jetty-launcher-5320-thread-2) [n:127.0.0.1:46197_solr     ] o.a.s.m.r.SolrJmxReporter JMX monitoring for 'solr_46197.solr.jetty' (registry 'solr.jetty') enabled at server: com.sun.jmx.mbeanserver.JmxMBeanServer@2cf47394
   [junit4]   2> 906823 INFO  (jetty-launcher-5320-thread-2) [n:127.0.0.1:46197_solr     ] o.a.s.c.CorePropertiesLocator Found 0 core definitions underneath /home/jenkins/workspace/Lucene-Solr-master-Linux/solr/build/solr-core/test/J2/temp/solr.cloud.TestTlogReplica_921D47C5DD583140-001/tempDir-001/node2/.
   [junit4]   2> 906842 INFO  (jetty-launcher-5320-thread-1) [n:127.0.0.1:44231_solr     ] o.a.s.c.c.ConnectionManager Waiting for client to connect to ZooKeeper
   [junit4]   2> 906843 INFO  (zkConnectionManagerCallback-5346-thread-1) [     ] o.a.s.c.c.ConnectionManager zkClient has connected
   [junit4]   2> 906843 INFO  (jetty-launcher-5320-thread-1) [n:127.0.0.1:44231_solr     ] o.a.s.c.c.ConnectionManager Client is connected to ZooKeeper
   [junit4]   2> 906847 INFO  (jetty-launcher-5320-thread-1) [n:127.0.0.1:44231_solr     ] o.a.s.c.c.ZkStateReader Updated live nodes from ZooKeeper... (0) -> (1)
   [junit4]   2> 906849 INFO  (jetty-launcher-5320-thread-1) [n:127.0.0.1:44231_solr     ] o.a.s.c.ZkController Publish node=127.0.0.1:44231_solr as DOWN
   [junit4]   2> 906849 INFO  (jetty-launcher-5320-thread-1) [n:127.0.0.1:44231_solr     ] o.a.s.c.TransientSolrCoreCacheDefault Allocating transient cache for 2147483647 transient cores
   [junit4]   2> 906849 INFO  (jetty-launcher-5320-thread-1) [n:127.0.0.1:44231_solr     ] o.a.s.c.ZkController Register node as live in ZooKeeper:/live_nodes/127.0.0.1:44231_solr
   [junit4]   2> 906850 INFO  (zkCallback-5339-thread-1) [     ] o.a.s.c.c.ZkStateReader Updated live nodes from ZooKeeper... (1) -> (2)
   [junit4]   2> 906850 INFO  (zkCallback-5345-thread-1) [     ] o.a.s.c.c.ZkStateReader Updated live nodes from ZooKeeper... (1) -> (2)
   [junit4]   2> 906857 INFO  (jetty-launcher-5320-thread-1) [n:127.0.0.1:44231_solr     ] o.a.s.h.a.MetricsHistoryHandler No .system collection, keeping metrics history in memory.
   [junit4]   2> 906868 INFO  (jetty-launcher-5320-thread-1) [n:127.0.0.1:44231_solr     ] o.a.s.m.r.SolrJmxReporter JMX monitoring for 'solr_44231.solr.node' (registry 'solr.node') enabled at server: com.sun.jmx.mbeanserver.JmxMBeanServer@2cf47394
   [junit4]   2> 906874 INFO  (jetty-launcher-5320-thread-1) [n:127.0.0.1:44231_solr     ] o.a.s.m.r.SolrJmxReporter JMX monitoring for 'solr_44231.solr.jvm' (registry 'solr.jvm') enabled at server: com.sun.jmx.mbeanserver.JmxMBeanServer@2cf47394
   [junit4]   2> 906874 INFO  (jetty-launcher-5320-thread-1) [n:127.0.0.1:44231_solr     ] o.a.s.m.r.SolrJmxReporter JMX monitoring for 'solr_44231.solr.jetty' (registry 'solr.jetty') enabled at server: com.sun.jmx.mbeanserver.JmxMBeanServer@2cf47394
   [junit4]   2> 906875 INFO  (jetty-launcher-5320-thread-1) [n:127.0.0.1:44231_solr     ] o.a.s.c.CorePropertiesLocator Found 0 core definitions underneath /home/jenkins/workspace/Lucene-Solr-master-Linux/solr/build/solr-core/test/J2/temp/solr.cloud.TestTlogReplica_921D47C5DD583140-001/tempDir-001/node1/.
   [junit4]   2> 906891 INFO  (SUITE-TestTlogReplica-seed#[921D47C5DD583140]-worker) [     ] o.a.s.c.MiniSolrCloudCluster waitForAllNodes: numServers=2
   [junit4]   2> 906891 INFO  (SUITE-TestTlogReplica-seed#[921D47C5DD583140]-worker) [     ] o.a.s.c.c.ConnectionManager Waiting for client to connect to ZooKeeper
   [junit4]   2> 906892 INFO  (zkConnectionManagerCallback-5355-thread-1) [     ] o.a.s.c.c.ConnectionManager zkClient has connected
   [junit4]   2> 906892 INFO  (SUITE-TestTlogReplica-seed#[921D47C5DD583140]-worker) [     ] o.a.s.c.c.ConnectionManager Client is connected to ZooKeeper
   [junit4]   2> 906894 INFO  (SUITE-TestTlogReplica-seed#[921D47C5DD583140]-worker) [     ] o.a.s.c.c.ZkStateReader Updated live nodes from ZooKeeper... (0) -> (2)
   [junit4]   2> 906895 INFO  (SUITE-TestTlogReplica-seed#[921D47C5DD583140]-worker) [     ] o.a.s.c.s.i.ZkClientClusterStateProvider Cluster at 127.0.0.1:38159/solr ready
   [junit4]   2> 906896 INFO  (SUITE-TestTlogReplica-seed#[921D47C5DD583140]-worker) [     ] o.a.s.c.TestTlogReplica Using legacyCloud?: false
   [junit4]   2> 906906 INFO  (qtp583060494-17514) [n:127.0.0.1:46197_solr     ] o.a.s.h.a.CollectionsHandler Invoked Collection Action :clusterprop with params val=false&name=legacyCloud&action=CLUSTERPROP&wt=javabin&version=2 and sendToOCPQueue=true
   [junit4]   2> 906907 INFO  (qtp583060494-17514) [n:127.0.0.1:46197_solr     ] o.a.s.s.HttpSolrCall [admin] webapp=null path=/admin/collections params={val=false&name=legacyCloud&action=CLUSTERPROP&wt=javabin&version=2} status=0 QTime=1
   [junit4]   2> 906920 INFO  (TEST-TestTlogReplica.testKillLeader-seed#[921D47C5DD583140]) [     ] o.a.s.SolrTestCaseJ4 ###Starting testKillLeader
   [junit4]   2> 906922 INFO  (qtp583060494-17512) [n:127.0.0.1:46197_solr     ] o.a.s.h.a.CollectionsHandler Invoked Collection Action :create with params pullReplicas=0&collection.configName=conf&maxShardsPerNode=100&name=tlog_replica_test_kill_leader&nrtReplicas=0&action=CREATE&numShards=1&tlogReplicas=2&wt=javabin&version=2 and sendToOCPQueue=true
   [junit4]   2> 906923 INFO  (OverseerThreadFactory-5244-thread-1-processing-n:127.0.0.1:46197_solr) [n:127.0.0.1:46197_solr     ] o.a.s.c.a.c.CreateCollectionCmd Create collection tlog_replica_test_kill_leader
   [junit4]   2> 907026 INFO  (OverseerStateUpdate-72359720253652999-127.0.0.1:46197_solr-n_0000000000) [n:127.0.0.1:46197_solr     ] o.a.s.c.o.SliceMutator createReplica() {
   [junit4]   2>   "operation":"ADDREPLICA",
   [junit4]   2>   "collection":"tlog_replica_test_kill_leader",
   [junit4]   2>   "shard":"shard1",
   [junit4]   2>   "core":"tlog_replica_test_kill_leader_shard1_replica_t1",
   [junit4]   2>   "state":"down",
   [junit4]   2>   "base_url":"https://127.0.0.1:46197/solr",
   [junit4]   2>   "type":"TLOG",
   [junit4]   2>   "waitForFinalState":"false"}
   [junit4]   2> 907027 INFO  (OverseerStateUpdate-72359720253652999-127.0.0.1:46197_solr-n_0000000000) [n:127.0.0.1:46197_solr     ] o.a.s.c.o.SliceMutator createReplica() {
   [junit4]   2>   "operation":"ADDREPLICA",
   [junit4]   2>   "collection":"tlog_replica_test_kill_leader",
   [junit4]   2>   "shard":"shard1",
   [junit4]   2>   "core":"tlog_replica_test_kill_leader_shard1_replica_t2",
   [junit4]   2>   "state":"down",
   [junit4]   2>   "base_url":"https://127.0.0.1:44231/solr",
   [junit4]   2>   "type":"TLOG",
   [junit4]   2>   "waitForFinalState":"false"}
   [junit4]   2> 907236 INFO  (qtp583060494-17516) [n:127.0.0.1:46197_solr    x:tlog_replica_test_kill_leader_shard1_replica_t1 ] o.a.s.h.a.CoreAdminOperation core create command qt=/admin/cores&coreNodeName=core_node3&collection.configName=conf&newCollection=true&name=tlog_replica_test_kill_leader_shard1_replica_t1&action=CREATE&numShards=1&collection=tlog_replica_test_kill_leader&shard=shard1&wt=javabin&version=2&replicaType=TLOG
   [junit4]   2> 907237 INFO  (qtp583060494-17516) [n:127.0.0.1:46197_solr    x:tlog_replica_test_kill_leader_shard1_replica_t1 ] o.a.s.c.TransientSolrCoreCacheDefault Allocating transient cache for 2147483647 transient cores
   [junit4]   2> 907240 INFO  (qtp678886702-17515) [n:127.0.0.1:44231_solr    x:tlog_replica_test_kill_leader_shard1_replica_t2 ] o.a.s.h.a.CoreAdminOperation core create command qt=/admin/cores&coreNodeName=core_node4&collection.configName=conf&newCollection=true&name=tlog_replica_test_kill_leader_shard1_replica_t2&action=CREATE&numShards=1&collection=tlog_replica_test_kill_leader&shard=shard1&wt=javabin&version=2&replicaType=TLOG
   [junit4]   2> 908242 INFO  (qtp583060494-17516) [n:127.0.0.1:46197_solr c:tlog_replica_test_kill_leader s:shard1 r:core_node3 x:tlog_replica_test_kill_leader_shard1_replica_t1 ] o.a.s.c.SolrConfig Using Lucene MatchVersion: 9.0.0
   [junit4]   2> 908247 INFO  (qtp678886702-17515) [n:127.0.0.1:44231_solr c:tlog_replica_test_kill_leader s:shard1 r:core_node4 x:tlog_replica_test_kill_leader_shard1_replica_t2 ] o.a.s.c.SolrConfig Using Lucene MatchVersion: 9.0.0
   [junit4]   2> 908247 INFO  (qtp583060494-17516) [n:127.0.0.1:46197_solr c:tlog_replica_test_kill_leader s:shard1 r:core_node3 x:tlog_replica_test_kill_leader_shard1_replica_t1 ] o.a.s.s.IndexSchema [tlog_replica_test_kill_leader_shard1_replica_t1] Schema name=minimal
   [junit4]   2> 908256 INFO  (qtp583060494-17516) [n:127.0.0.1:46197_solr c:tlog_replica_test_kill_leader s:shard1 r:core_node3 x:tlog_replica_test_kill_leader_shard1_replica_t1 ] o.a.s.s.IndexSchema Loaded schema minimal/1.1 with uniqueid field id
   [junit4]   2> 908256 INFO  (qtp583060494-17516) [n:127.0.0.1:46197_solr c:tlog_replica_test_kill_leader s:shard1 r:core_node3 x:tlog_replica_test_kill_leader_shard1_replica_t1 ] o.a.s.c.CoreContainer Creating SolrCore 'tlog_replica_test_kill_leader_shard1_replica_t1' using configuration from collection tlog_replica_test_kill_leader, trusted=true
   [junit4]   2> 908256 INFO  (qtp583060494-17516) [n:127.0.0.1:46197_solr c:tlog_replica_test_kill_leader s:shard1 r:core_node3 x:tlog_replica_test_kill_leader_shard1_replica_t1 ] o.a.s.m.r.SolrJmxReporter JMX monitoring for 'solr_46197.solr.core.tlog_replica_test_kill_leader.shard1.replica_t1' (registry 'solr.core.tlog_replica_test_kill_leader.shard1.replica_t1') enabled at server: com.sun.jmx.mbeanserver.JmxMBeanServer@2cf47394
   [junit4]   2> 908256 INFO  (qtp583060494-17516) [n:127.0.0.1:46197_solr c:tlog_replica_test_kill_leader s:shard1 r:core_node3 x:tlog_replica_test_kill_leader_shard1_replica_t1 ] o.a.s.c.SolrCore [[tlog_replica_test_kill_leader_shard1_replica_t1] ] Opening new SolrCore at [/home/jenkins/workspace/Lucene-Solr-master-Linux/solr/build/solr-core/test/J2/temp/solr.cloud.TestTlogReplica_921D47C5DD583140-001/tempDir-001/node2/tlog_replica_test_kill_leader_shard1_replica_t1], dataDir=[/home/jenkins/workspace/Lucene-Solr-master-Linux/solr/build/solr-core/test/J2/temp/solr.cloud.TestTlogReplica_921D47C5DD583140-001/tempDir-001/node2/./tlog_replica_test_kill_leader_shard1_replica_t1/data/]
   [junit4]   2> 908258 INFO  (qtp678886702-17515) [n:127.0.0.1:44231_solr c:tlog_replica_test_kill_leader s:shard1 r:core_node4 x:tlog_replica_test_kill_leader_shard1_replica_t2 ] o.a.s.s.IndexSchema [tlog_replica_test_kill_leader_shard1_replica_t2] Schema name=minimal
   [junit4]   2> 908260 INFO  (qtp678886702-17515) [n:127.0.0.1:44231_solr c:tlog_replica_test_kill_leader s:shard1 r:core_node4 x:tlog_replica_test_kill_leader_shard1_replica_t2 ] o.a.s.s.IndexSchema Loaded schema minimal/1.1 with uniqueid field id
   [junit4]   2> 908260 INFO  (qtp678886702-17515) [n:127.0.0.1:44231_solr c:tlog_replica_test_kill_leader s:shard1 r:core_node4 x:tlog_replica_test_kill_leader_shard1_replica_t2 ] o.a.s.c.CoreContainer Creating SolrCore 'tlog_replica_test_kill_leader_shard1_replica_t2' using configuration from collection tlog_replica_test_kill_leader, trusted=true
   [junit4]   2> 908260 INFO  (qtp678886702-17515) [n:127.0.0.1:44231_solr c:tlog_replica_test_kill_leader s:shard1 r:core_node4 x:tlog_replica_test_kill_leader_shard1_replica_t2 ] o.a.s.m.r.SolrJmxReporter JMX monitoring for 'solr_44231.solr.core.tlog_replica_test_kill_leader.shard1.replica_t2' (registry 'solr.core.tlog_replica_test_kill_leader.shard1.replica_t2') enabled at server: com.sun.jmx.mbeanserver.JmxMBeanServer@2cf47394
   [junit4]   2> 908260 INFO  (qtp678886702-17515) [n:127.0.0.1:44231_solr c:tlog_replica_test_kill_leader s:shard1 r:core_node4 x:tlog_replica_test_kill_leader_shard1_replica_t2 ] o.a.s.c.SolrCore [[tlog_replica_test_kill_leader_shard1_replica_t2] ] Opening new SolrCore at [/home/jenkins/workspace/Lucene-Solr-master-Linux/solr/build/solr-core/test/J2/temp/solr.cloud.TestTlogReplica_921D47C5DD583140-001/tempDir-001/node1/tlog_replica_test_kill_leader_shard1_replica_t2], dataDir=[/home/jenkins/workspace/Lucene-Solr-master-Linux/solr/build/solr-core/test/J2/temp/solr.cloud.TestTlogReplica_921D47C5DD583140-001/tempDir-001/node1/./tlog_replica_test_kill_leader_shard1_replica_t2/data/]
   [junit4]   2> 908304 INFO  (qtp583060494-17516) [n:127.0.0.1:46197_solr c:tlog_replica_test_kill_leader s:shard1 r:core_node3 x:tlog_replica_test_kill_leader_shard1_replica_t1 ] o.a.s.u.UpdateHandler Using UpdateLog implementation: org.apache.solr.update.UpdateLog
   [junit4]   2> 908304 INFO  (qtp583060494-17516) [n:127.0.0.1:46197_solr c:tlog_replica_test_kill_leader s:shard1 r:core_node3 x:tlog_replica_test_kill_leader_shard1_replica_t1 ] o.a.s.u.UpdateLog Initializing UpdateLog: dataDir=null defaultSyncLevel=FLUSH numRecordsToKeep=100 maxNumLogsToKeep=10 numVersionBuckets=65536
   [junit4]   2> 908310 INFO  (qtp583060494-17516) [n:127.0.0.1:46197_solr c:tlog_replica_test_kill_leader s:shard1 r:core_node3 x:tlog_replica_test_kill_leader_shard1_replica_t1 ] o.a.s.u.CommitTracker Hard AutoCommit: disabled
   [junit4]   2> 908310 INFO  (qtp583060494-17516) [n:127.0.0.1:46197_solr c:tlog_replica_test_kill_leader s:shard1 r:core_node3 x:tlog_replica_test_kill_leader_shard1_replica_t1 ] o.a.s.u.CommitTracker Soft AutoCommit: disabled
   [junit4]   2> 908311 INFO  (qtp583060494-17516) [n:127.0.0.1:46197_solr c:tlog_replica_test_kill_leader s:shard1 r:core_node3 x:tlog_replica_test_kill_leader_shard1_replica_t1 ] o.a.s.s.SolrIndexSearcher Opening [Searcher@4b44d6b9[tlog_replica_test_kill_leader_shard1_replica_t1] main]
   [junit4]   2> 908312 INFO  (qtp678886702-17515) [n:127.0.0.1:44231_solr c:tlog_replica_test_kill_leader s:shard1 r:core_node4 x:tlog_replica_test_kill_leader_shard1_replica_t2 ] o.a.s.u.UpdateHandler Using UpdateLog implementation: org.apache.solr.update.UpdateLog
   [junit4]   2> 908312 INFO  (qtp678886702-17515) [n:127.0.0.1:44231_solr c:tlog_replica_test_kill_leader s:shard1 r:core_node4 x:tlog_replica_test_kill_leader_shard1_replica_t2 ] o.a.s.u.UpdateLog Initializing UpdateLog: dataDir=null defaultSyncLevel=FLUSH numRecordsToKeep=100 maxNumLogsToKeep=10 numVersionBuckets=65536
   [junit4]   2> 908313 INFO  (qtp583060494-17516) [n:127.0.0.1:46197_solr c:tlog_replica_test_kill_leader s:shard1 r:core_node3 x:tlog_replica_test_kill_leader_shard1_replica_t1 ] o.a.s.r.ManagedResourceStorage Configured ZooKeeperStorageIO with znodeBase: /configs/conf
   [junit4]   2> 908313 INFO  (qtp583060494-17516) [n:127.0.0.1:46197_solr c:tlog_replica_test_kill_leader s:shard1 r:core_node3 x:tlog_replica_test_kill_leader_shard1_replica_t1 ] o.a.s.r.ManagedResourceStorage Loaded null at path _rest_managed.json using ZooKeeperStorageIO:path=/configs/conf
   [junit4]   2> 908313 INFO  (qtp678886702-17515) [n:127.0.0.1:44231_solr c:tlog_replica_test_kill_leader s:shard1 r:core_node4 x:tlog_replica_test_kill_leader_shard1_replica_t2 ] o.a.s.u.CommitTracker Hard AutoCommit: disabled
   [junit4]   2> 908313 INFO  (qtp678886702-17515) [n:127.0.0.1:44231_solr c:tlog_replica_test_kill_leader s:shard1 r:core_node4 x:tlog_replica_test_kill_leader_shard1_replica_t2 ] o.a.s.u.CommitTracker Soft AutoCommit: disabled
   [junit4]   2> 908313 INFO  (qtp583060494-17516) [n:127.0.0.1:46197_solr c:tlog_replica_test_kill_leader s:shard1 r:core_node3 x:tlog_replica_test_kill_leader_shard1_replica_t1 ] o.a.s.h.ReplicationHandler Commits will be reserved for 10000ms.
   [junit4]   2> 908313 INFO  (qtp583060494-17516) [n:127.0.0.1:46197_solr c:tlog_replica_test_kill_leader s:shard1 r:core_node3 x:tlog_replica_test_kill_leader_shard1_replica_t1 ] o.a.s.u.UpdateLog Could not find max version in index or recent updates, using new clock 1648228030782373888
   [junit4]   2> 908314 INFO  (qtp678886702-17515) [n:127.0.0.1:44231_solr c:tlog_replica_test_kill_leader s:shard1 r:core_node4 x:tlog_replica_test_kill_leader_shard1_replica_t2 ] o.a.s.s.SolrIndexSearcher Opening [Searcher@639b9a2a[tlog_replica_test_kill_leader_shard1_replica_t2] main]
   [junit4]   2> 908315 INFO  (qtp678886702-17515) [n:127.0.0.1:44231_solr c:tlog_replica_test_kill_leader s:shard1 r:core_node4 x:tlog_replica_test_kill_leader_shard1_replica_t2 ] o.a.s.r.ManagedResourceStorage Configured ZooKeeperStorageIO with znodeBase: /configs/conf
   [junit4]   2> 908315 INFO  (qtp678886702-17515) [n:127.0.0.1:44231_solr c:tlog_replica_test_kill_leader s:shard1 r:core_node4 x:tlog_replica_test_kill_leader_shard1_replica_t2 ] o.a.s.r.ManagedResourceStorage Loaded null at path _rest_managed.json using ZooKeeperStorageIO:path=/configs/conf
   [junit4]   2> 908315 INFO  (qtp678886702-17515) [n:127.0.0.1:44231_solr c:tlog_replica_test_kill_leader s:shard1 r:core_node4 x:tlog_replica_test_kill_leader_shard1_replica_t2 ] o.a.s.h.ReplicationHandler Commits will be reserved for 10000ms.
   [junit4]   2> 908315 INFO  (qtp678886702-17515) [n:127.0.0.1:44231_solr c:tlog_replica_test_kill_leader s:shard1 r:core_node4 x:tlog_replica_test_kill_leader_shard1_replica_t2 ] o.a.s.u.UpdateLog Could not find max version in index or recent updates, using new clock 1648228030784471040
   [junit4]   2> 908315 INFO  (searcherExecutor-5253-thread-1-processing-n:127.0.0.1:46197_solr x:tlog_replica_test_kill_leader_shard1_replica_t1 c:tlog_replica_test_kill_leader s:shard1 r:core_node3) [n:127.0.0.1:46197_solr c:tlog_replica_test_kill_leader s:shard1 r:core_node3 x:tlog_replica_test_kill_leader_shard1_replica_t1 ] o.a.s.c.SolrCore [tlog_replica_test_kill_leader_shard1_replica_t1] Registered new searcher Searcher@4b44d6b9[tlog_replica_test_kill_leader_shard1_replica_t1] main{ExitableDirectoryReader(UninvertingDirectoryReader())}
   [junit4]   2> 908316 INFO  (qtp583060494-17516) [n:127.0.0.1:46197_solr c:tlog_replica_test_kill_leader s:shard1 r:core_node3 x:tlog_replica_test_kill_leader_shard1_replica_t1 ] o.a.s.c.ZkShardTerms Successful update of terms at /collections/tlog_replica_test_kill_leader/terms/shard1 to Terms{values={core_node3=0}, version=0}
   [junit4]   2> 908316 INFO  (qtp583060494-17516) [n:127.0.0.1:46197_solr c:tlog_replica_test_kill_leader s:shard1 r:core_node3 x:tlog_replica_test_kill_leader_shard1_replica_t1 ] o.a.s.c.ShardLeaderElectionContextBase make sure parent is created /collections/tlog_replica_test_kill_leader/leaders/shard1
   [junit4]   2> 908317 INFO  (searcherExecutor-5254-thread-1-processing-n:127.0.0.1:44231_solr x:tlog_replica_test_kill_leader_shard1_replica_t2 c:tlog_replica_test_kill_leader s:shard1 r:core_node4) [n:127.0.0.1:44231_solr c:tlog_replica_test_kill_leader s:shard1 r:core_node4 x:tlog_replica_test_kill_leader_shard1_replica_t2 ] o.a.s.c.SolrCore [tlog_replica_test_kill_leader_shard1_replica_t2] Registered new searcher Searcher@639b9a2a[tlog_replica_test_kill_leader_shard1_replica_t2] main{ExitableDirectoryReader(UninvertingDirectoryReader())}
   [junit4]   2> 908318 INFO  (qtp678886702-17515) [n:127.0.0.1:44231_solr c:tlog_replica_test_kill_leader s:shard1 r:core_node4 x:tlog_replica_test_kill_leader_shard1_replica_t2 ] o.a.s.c.ZkShardTerms Successful update of terms at /collections/tlog_replica_test_kill_leader/terms/shard1 to Terms{values={core_node3=0, core_node4=0}, version=1}
   [junit4]   2> 908318 INFO  (qtp678886702-17515) [n:127.0.0.1:44231_solr c:tlog_replica_test_kill_leader s:shard1 r:core_node4 x:tlog_replica_test_kill_leader_shard1_replica_t2 ] o.a.s.c.ShardLeaderElectionContextBase make sure parent is created /collections/tlog_replica_test_kill_leader/leaders/shard1
   [junit4]   2> 908319 INFO  (qtp583060494-17516) [n:127.0.0.1:46197_solr c:tlog_replica_test_kill_leader s:shard1 r:core_node3 x:tlog_replica_test_kill_leader_shard1_replica_t1 ] o.a.s.c.ShardLeaderElectionContext Waiting until we see more replicas up for shard shard1: total=2 found=1 timeoutin=9999ms
   [junit4]   2> 908820 INFO  (qtp583060494-17516) [n:127.0.0.1:46197_solr c:tlog_replica_test_kill_leader s:shard1 r:core_node3 x:tlog_replica_test_kill_leader_shard1_replica_t1 ] o.a.s.c.ShardLeaderElectionContext Enough replicas found to continue.
   [junit4]   2> 908820 INFO  (qtp583060494-17516) [n:127.0.0.1:46197_solr c:tlog_replica_test_kill_leader s:shard1 r:core_node3 x:tlog_replica_test_kill_leader_shard1_replica_t1 ] o.a.s.c.ShardLeaderElectionContext I may be the new leader - try and sync
   [junit4]   2> 908820 INFO  (qtp583060494-17516) [n:127.0.0.1:46197_solr c:tlog_replica_test_kill_leader s:shard1 r:core_node3 x:tlog_replica_test_kill_leader_shard1_replica_t1 ] o.a.s.c.SyncStrategy Sync replicas to https://127.0.0.1:46197/solr/tlog_replica_test_kill_leader_shard1_replica_t1/
   [junit4]   2> 908820 INFO  (qtp583060494-17516) [n:127.0.0.1:46197_solr c:tlog_replica_test_kill_leader s:shard1 r:core_node3 x:tlog_replica_test_kill_leader_shard1_replica_t1 ] o.a.s.u.PeerSync PeerSync: core=tlog_replica_test_kill_leader_shard1_replica_t1 url=https://127.0.0.1:46197/solr START replicas=[https://127.0.0.1:44231/solr/tlog_replica_test_kill_leader_shard1_replica_t2/] nUpdates=100
   [junit4]   2> 908821 INFO  (qtp583060494-17516) [n:127.0.0.1:46197_solr c:tlog_replica_test_kill_leader s:shard1 r:core_node3 x:tlog_replica_test_kill_leader_shard1_replica_t1 ] o.a.s.u.PeerSync PeerSync: core=tlog_replica_test_kill_leader_shard1_replica_t1 url=https://127.0.0.1:46197/solr DONE.  We have no versions.  sync failed.
   [junit4]   2> 908827 INFO  (qtp678886702-17513) [n:127.0.0.1:44231_solr c:tlog_replica_test_kill_leader s:shard1 r:core_node4 x:tlog_replica_test_kill_leader_shard1_replica_t2 ] o.a.s.c.S.Request [tlog_replica_test_kill_leader_shard1_replica_t2]  webapp=/solr path=/get params={distrib=false&qt=/get&fingerprint=false&getVersions=100&wt=javabin&version=2} status=0 QTime=0
   [junit4]   2> 908828 INFO  (qtp583060494-17516) [n:127.0.0.1:46197_solr c:tlog_replica_test_kill_leader s:shard1 r:core_node3 x:tlog_replica_test_kill_leader_shard1_replica_t1 ] o.a.s.c.SyncStrategy Leader's attempt to sync with shard failed, moving to the next candidate
   [junit4]   2> 908828 INFO  (qtp583060494-17516) [n:127.0.0.1:46197_solr c:tlog_replica_test_kill_leader s:shard1 r:core_node3 x:tlog_replica_test_kill_leader_shard1_replica_t1 ] o.a.s.c.ShardLeaderElectionContext We failed sync, but we have no versions - we can't sync in that case - we were active before, so become leader anyway
   [junit4]   2> 908828 INFO  (qtp583060494-17516) [n:127.0.0.1:46197_solr c:tlog_replica_test_kill_leader s:shard1 r:core_node3 x:tlog_replica_test_kill_leader_shard1_replica_t1 ] o.a.s.c.ZkController tlog_replica_test_kill_leader_shard1_replica_t1 stopping background replication from leader
   [junit4]   2> 908828 INFO  (qtp583060494-17516) [n:127.0.0.1:46197_solr c:tlog_replica_test_kill_leader s:shard1 r:core_node3 x:tlog_replica_test_kill_leader_shard1_replica_t1 ] o.a.s.c.ShardLeaderElectionContextBase Creating leader registration node /collections/tlog_replica_test_kill_leader/leaders/shard1/leader after winning as /collections/tlog_replica_test_kill_leader/leader_elect/shard1/election/72359720253652999-core_node3-n_0000000000
   [junit4]   2> 908829 INFO  (qtp583060494-17516) [n:127.0.0.1:46197_solr c:tlog_replica_test_kill_leader s:shard1 r:core_node3 x:tlog_replica_test_kill_leader_shard1_replica_t1 ] o.a.s.c.ShardLeaderElectionContext I am the new leader: https://127.0.0.1:46197/solr/tlog_replica_test_kill_leader_shard1_replica_t1/ shard1
   [junit4]   2> 908930 INFO  (zkCallback-5339-thread-1) [     ] o.a.s.c.c.ZkStateReader A cluster state change: [WatchedEvent state:SyncConnected type:NodeDataChanged path:/collections/tlog_replica_test_kill_leader/state.json] for collection [tlog_replica_test_kill_leader] has occurred - updating... (live nodes size: [2])
   [junit4]   2> 908931 INFO  (qtp583060494-17516) [n:127.0.0.1:46197_solr c:tlog_replica_test_kill_leader s:shard1 r:core_node3 x:tlog_replica_test_kill_leader_shard1_replica_t1 ] o.a.s.c.ZkController I am the leader, no recovery necessary
   [junit4]   2> 908932 INFO  (qtp583060494-17516) [n:127.0.0.1:46197_solr c:tlog_replica_test_kill_leader s:shard1 r:core_node3 x:tlog_replica_test_kill_leader_shard1_replica_t1 ] o.a.s.s.HttpSolrCall [admin] webapp=null path=/admin/cores params={qt=/admin/cores&coreNodeName=core_node3&collection.configName=conf&newCollection=true&name=tlog_replica_test_kill_leader_shard1_replica_t1&action=CREATE&numShards=1&collection=tlog_replica_test_kill_leader&shard=shard1&wt=javabin&version=2&replicaType=TLOG} status=0 QTime=1695
   [junit4]   2> 909032 INFO  (zkCallback-5339-thread-1) [     ] o.a.s.c.c.ZkStateReader A cluster state change: [WatchedEvent state:SyncConnected type:NodeDataChanged path:/collections/tlog_replica_test_kill_leader/state.json] for collection [tlog_replica_test_kill_leader] has occurred - updating... (live nodes size: [2])
   [junit4]   2> 909032 INFO  (zkCallback-5339-thread-2) [     ] o.a.s.c.c.ZkStateReader A cluster state change: [WatchedEvent state:SyncConnected type:NodeDataChanged path:/collections/tlog_replica_test_kill_leader/state.json] for collection [tlog_replica_test_kill_leader] has occurred - updating... (live nodes size: [2])
   [junit4]   2> 909321 INFO  (qtp678886702-17515) [n:127.0.0.1:44231_solr c:tlog_replica_test_kill_leader s:shard1 r:core_node4 x:tlog_replica_test_kill_leader_shard1_replica_t2 ] o.a.s.c.ZkController tlog_replica_test_kill_leader_shard1_replica_t2 starting background replication from leader
   [junit4]   2> 909321 INFO  (qtp678886702-17515) [n:127.0.0.1:44231_solr c:tlog_replica_test_kill_leader s:shard1 r:core_node4 x:tlog_replica_test_kill_leader_shard1_replica_t2 ] o.a.s.c.ReplicateFromLeader Will start replication from leader with poll interval: 00:00:01
   [junit4]   2> 909323 INFO  (qtp678886702-17515) [n:127.0.0.1:44231_solr c:tlog_replica_test_kill_leader s:shard1 r:core_node4 x:tlog_replica_test_kill_leader_shard1_replica_t2 ] o.a.s.h.ReplicationHandler Poll scheduled at an interval of 1000ms
   [junit4]   2> 909323 INFO  (qtp678886702-17515) [n:127.0.0.1:44231_solr c:tlog_replica_test_kill_leader s:shard1 r:core_node4 x:tlog_replica_test_kill_leader_shard1_replica_t2 ] o.a.s.h.ReplicationHandler Commits will be reserved for 10000ms.
   [junit4]   2> 909324 INFO  (qtp678886702-17515) [n:127.0.0.1:44231_solr c:tlog_replica_test_kill_leader s:shard1 r:core_node4 x:tlog_replica_test_kill_leader_shard1_replica_t2 ] o.a.s.s.HttpSolrCall [admin] webapp=null path=/admin/cores params={qt=/admin/cores&coreNodeName=core_node4&collection.configName=conf&newCollection=true&name=tlog_replica_test_kill_leader_shard1_replica_t2&action=CREATE&numShards=1&collection=tlog_replica_test_kill_leader&shard=shard1&wt=javabin&version=2&replicaType=TLOG} status=0 QTime=2083
   [junit4]   2> 909325 INFO  (qtp583060494-17512) [n:127.0.0.1:46197_solr     ] o.a.s.h.a.CollectionsHandler Wait for new collection to be active for at most 45 seconds. Check all shard replicas
   [junit4]   2> 909424 INFO  (zkCallback-5339-thread-2) [     ] o.a.s.c.c.ZkStateReader A cluster state change: [WatchedEvent state:SyncConnected type:NodeDataChanged path:/collections/tlog_replica_test_kill_leader/state.json] for collection [tlog_replica_test_kill_leader] has occurred - updating... (live nodes size: [2])
   [junit4]   2> 909424 INFO  (zkCallback-5339-thread-3) [     ] o.a.s.c.c.ZkStateReader A cluster state change: [WatchedEvent state:SyncConnected type:NodeDataChanged path:/collections/tlog_replica_test_kill_leader/state.json] for collection [tlog_replica_test_kill_leader] has occurred - updating... (live nodes size: [2])
   [junit4]   2> 909424 INFO  (zkCallback-5345-thread-1) [     ] o.a.s.c.c.ZkStateReader A cluster state change: [WatchedEvent state:SyncConnected type:NodeDataChanged path:/collections/tlog_replica_test_kill_leader/state.json] for collection [tlog_replica_test_kill_leader] has occurred - updating... (live nodes size: [2])
   [junit4]   2> 909425 INFO  (zkCallback-5345-thread-2) [     ] o.a.s.c.c.ZkStateReader A cluster state change: [WatchedEvent state:SyncConnected type:NodeDataChanged path:/collections/tlog_replica_test_kill_leader/state.json] for collection [tlog_replica_test_kill_leader] has occurred - updating... (live nodes size: [2])
   [junit4]   2> 909425 INFO  (qtp583060494-17512) [n:127.0.0.1:46197_solr     ] o.a.s.s.HttpSolrCall [admin] webapp=null path=/admin/collections params={pullReplicas=0&collection.configName=conf&maxShardsPerNode=100&name=tlog_replica_test_kill_leader&nrtReplicas=0&action=CREATE&numShards=1&tlogReplicas=2&wt=javabin&version=2} status=0 QTime=2503
   [junit4]   2> 909425 INFO  (TEST-TestTlogReplica.testKillLeader-seed#[921D47C5DD583140]) [     ] o.a.s.c.SolrCloudTestCase waitForState (tlog_replica_test_kill_leader): Expected collection to be created with 1 shards and  2 replicas
   [junit4]   2> 909426 INFO  (TEST-TestTlogReplica.testKillLeader-seed#[921D47C5DD583140]) [     ] o.a.s.c.SolrCloudTestCase active replica count: 2 expected replica count: 2
   [junit4]   2> 909426 INFO  (watches-5352-thread-1) [     ] o.a.s.c.SolrCloudTestCase active replica count: 2 expected replica count: 2
   [junit4]   2> 909426 INFO  (TEST-TestTlogReplica.testKillLeader-seed#[921D47C5DD583140]) [     ] o.a.s.c.SolrCloudTestCase active replica count: 2 expected replica count: 2
   [junit4]   2> 909426 INFO  (TEST-TestTlogReplica.testKillLeader-seed#[921D47C5DD583140]) [     ] o.a.s.c.SolrCloudTestCase active replica count: 2 expected replica count: 2
   [junit4]   2> 909429 INFO  (qtp583060494-17514) [n:127.0.0.1:46197_solr c:tlog_replica_test_kill_leader s:shard1 r:core_node3 x:tlog_replica_test_kill_leader_shard1_replica_t1 ] o.a.s.c.ZkShardTerms Successful update of terms at /collections/tlog_replica_test_kill_leader/terms/shard1 to Terms{values={core_node3=1, core_node4=1}, version=2}
   [junit4]   2> 909445 INFO  (qtp678886702-17515) [n:127.0.0.1:44231_solr c:tlog_replica_test_kill_leader s:shard1 r:core_node4 x:tlog_replica_test_kill_leader_shard1_replica_t2 ] o.a.s.u.p.LogUpdateProcessorFactory [tlog_replica_test_kill_leader_shard1_replica_t2]  webapp=/solr path=/update params={update.distrib=FROMLEADER&distrib.from=https://127.0.0.1:46197/solr/tlog_replica_test_kill_leader_shard1_replica_t1/&wt=javabin&version=2}{add=[1 (1648228031951536128)]} 0 1
   [junit4]   2> 909446 INFO  (qtp583060494-17514) [n:127.0.0.1:46197_solr c:tlog_replica_test_kill_leader s:shard1 r:core_node3 x:tlog_replica_test_kill_leader_shard1_replica_t1 ] o.a.s.u.p.LogUpdateProcessorFactory [tlog_replica_test_kill_leader_shard1_replica_t1]  webapp=/solr path=/update params={wt=javabin&version=2}{add=[1 (1648228031951536128)]} 0 18
   [junit4]   2> 909447 INFO  (qtp583060494-17516) [n:127.0.0.1:46197_solr c:tlog_replica_test_kill_leader s:shard1 r:core_node3 x:tlog_replica_test_kill_leader_shard1_replica_t1 ] o.a.s.u.DirectUpdateHandler2 start commit{_version_=1648228031971459072,optimize=false,openSearcher=true,waitSearcher=true,expungeDeletes=false,softCommit=false,prepareCommit=false}
   [junit4]   2> 909447 INFO  (qtp583060494-17516) [n:127.0.0.1:46197_solr c:tlog_replica_test_kill_leader s:shard1 r:core_node3 x:tlog_replica_test_kill_leader_shard1_replica_t1 ] o.a.s.u.SolrIndexWriter Calling setCommitData with IW:org.apache.solr.update.SolrIndexWriter@667c74b2 commitCommandVersion:1648228031971459072
   [junit4]   2> 909448 INFO  (qtp678886702-17517) [n:127.0.0.1:44231_solr c:tlog_replica_test_kill_leader s:shard1 r:core_node4 x:tlog_replica_test_kill_leader_shard1_replica_t2 ] o.a.s.u.p.LogUpdateProcessorFactory [tlog_replica_test_kill_leader_shard1_replica_t2]  webapp=/solr path=/update params={update.distrib=FROMLEADER&waitSearc