Re: [JENKINS] Lucene-Solr-master-Linux (64bit/jdk-12.0.1) - Build # 24968 - Still Unstable!

classic Classic list List threaded Threaded
1 message Options
Reply | Threaded
Open this post in threaded view
|

Re: [JENKINS] Lucene-Solr-master-Linux (64bit/jdk-12.0.1) - Build # 24968 - Still Unstable!

Tomás Fernández Löbbe
I'm taking a look

On Fri, Nov 1, 2019 at 2:11 PM Policeman Jenkins Server <[hidden email]> wrote:
Build: https://jenkins.thetaphi.de/job/Lucene-Solr-master-Linux/24968/
Java: 64bit/jdk-12.0.1 -XX:+UseCompressedOops -XX:+UseSerialGC

4 tests failed.
FAILED:  org.apache.solr.util.SolrPluginUtilsTest.testMinShouldMatchBadQueries

Error Message:
Expected exception SolrException but no exception was thrown

Stack Trace:
junit.framework.AssertionFailedError: Expected exception SolrException but no exception was thrown
        at __randomizedtesting.SeedInfo.seed([4499A23AA97C3A70:8A456290D744B57E]:0)
        at org.apache.lucene.util.LuceneTestCase.expectThrows(LuceneTestCase.java:2729)
        at org.apache.lucene.util.LuceneTestCase.expectThrows(LuceneTestCase.java:2719)
        at org.apache.solr.util.SolrPluginUtilsTest.testMinShouldMatchBadQueries(SolrPluginUtilsTest.java:344)
        at java.base/jdk.internal.reflect.NativeMethodAccessorImpl.invoke0(Native Method)
        at java.base/jdk.internal.reflect.NativeMethodAccessorImpl.invoke(NativeMethodAccessorImpl.java:62)
        at java.base/jdk.internal.reflect.DelegatingMethodAccessorImpl.invoke(DelegatingMethodAccessorImpl.java:43)
        at java.base/java.lang.reflect.Method.invoke(Method.java:567)
        at com.carrotsearch.randomizedtesting.RandomizedRunner.invoke(RandomizedRunner.java:1750)
        at com.carrotsearch.randomizedtesting.RandomizedRunner$8.evaluate(RandomizedRunner.java:938)
        at com.carrotsearch.randomizedtesting.RandomizedRunner$9.evaluate(RandomizedRunner.java:974)
        at com.carrotsearch.randomizedtesting.RandomizedRunner$10.evaluate(RandomizedRunner.java:988)
        at com.carrotsearch.randomizedtesting.rules.SystemPropertiesRestoreRule$1.evaluate(SystemPropertiesRestoreRule.java:57)
        at org.apache.lucene.util.TestRuleSetupTeardownChained$1.evaluate(TestRuleSetupTeardownChained.java:49)
        at org.apache.lucene.util.AbstractBeforeAfterRule$1.evaluate(AbstractBeforeAfterRule.java:45)
        at org.apache.lucene.util.TestRuleThreadAndTestName$1.evaluate(TestRuleThreadAndTestName.java:48)
        at org.apache.lucene.util.TestRuleIgnoreAfterMaxFailures$1.evaluate(TestRuleIgnoreAfterMaxFailures.java:64)
        at org.apache.lucene.util.TestRuleMarkFailure$1.evaluate(TestRuleMarkFailure.java:47)
        at com.carrotsearch.randomizedtesting.rules.StatementAdapter.evaluate(StatementAdapter.java:36)
        at com.carrotsearch.randomizedtesting.ThreadLeakControl$StatementRunner.run(ThreadLeakControl.java:368)
        at com.carrotsearch.randomizedtesting.ThreadLeakControl.forkTimeoutingTask(ThreadLeakControl.java:817)
        at com.carrotsearch.randomizedtesting.ThreadLeakControl$3.evaluate(ThreadLeakControl.java:468)
        at com.carrotsearch.randomizedtesting.RandomizedRunner.runSingleTest(RandomizedRunner.java:947)
        at com.carrotsearch.randomizedtesting.RandomizedRunner$5.evaluate(RandomizedRunner.java:832)
        at com.carrotsearch.randomizedtesting.RandomizedRunner$6.evaluate(RandomizedRunner.java:883)
        at com.carrotsearch.randomizedtesting.RandomizedRunner$7.evaluate(RandomizedRunner.java:894)
        at com.carrotsearch.randomizedtesting.rules.StatementAdapter.evaluate(StatementAdapter.java:36)
        at com.carrotsearch.randomizedtesting.rules.SystemPropertiesRestoreRule$1.evaluate(SystemPropertiesRestoreRule.java:57)
        at org.apache.lucene.util.AbstractBeforeAfterRule$1.evaluate(AbstractBeforeAfterRule.java:45)
        at com.carrotsearch.randomizedtesting.rules.StatementAdapter.evaluate(StatementAdapter.java:36)
        at org.apache.lucene.util.TestRuleStoreClassName$1.evaluate(TestRuleStoreClassName.java:41)
        at com.carrotsearch.randomizedtesting.rules.NoShadowingOrOverridesOnMethodsRule$1.evaluate(NoShadowingOrOverridesOnMethodsRule.java:40)
        at com.carrotsearch.randomizedtesting.rules.NoShadowingOrOverridesOnMethodsRule$1.evaluate(NoShadowingOrOverridesOnMethodsRule.java:40)
        at com.carrotsearch.randomizedtesting.rules.StatementAdapter.evaluate(StatementAdapter.java:36)
        at com.carrotsearch.randomizedtesting.rules.StatementAdapter.evaluate(StatementAdapter.java:36)
        at org.apache.lucene.util.TestRuleAssertionsRequired$1.evaluate(TestRuleAssertionsRequired.java:53)
        at org.apache.lucene.util.TestRuleMarkFailure$1.evaluate(TestRuleMarkFailure.java:47)
        at org.apache.lucene.util.TestRuleIgnoreAfterMaxFailures$1.evaluate(TestRuleIgnoreAfterMaxFailures.java:64)
        at org.apache.lucene.util.TestRuleIgnoreTestSuites$1.evaluate(TestRuleIgnoreTestSuites.java:54)
        at com.carrotsearch.randomizedtesting.rules.StatementAdapter.evaluate(StatementAdapter.java:36)
        at com.carrotsearch.randomizedtesting.ThreadLeakControl$StatementRunner.run(ThreadLeakControl.java:368)
        at java.base/java.lang.Thread.run(Thread.java:835)


FAILED:  org.apache.solr.util.SolrPluginUtilsTest.testMinShouldMatchBadQueries

Error Message:
Expected exception SolrException but no exception was thrown

Stack Trace:
junit.framework.AssertionFailedError: Expected exception SolrException but no exception was thrown
        at __randomizedtesting.SeedInfo.seed([4499A23AA97C3A70:8A456290D744B57E]:0)
        at org.apache.lucene.util.LuceneTestCase.expectThrows(LuceneTestCase.java:2729)
        at org.apache.lucene.util.LuceneTestCase.expectThrows(LuceneTestCase.java:2719)
        at org.apache.solr.util.SolrPluginUtilsTest.testMinShouldMatchBadQueries(SolrPluginUtilsTest.java:344)
        at java.base/jdk.internal.reflect.NativeMethodAccessorImpl.invoke0(Native Method)
        at java.base/jdk.internal.reflect.NativeMethodAccessorImpl.invoke(NativeMethodAccessorImpl.java:62)
        at java.base/jdk.internal.reflect.DelegatingMethodAccessorImpl.invoke(DelegatingMethodAccessorImpl.java:43)
        at java.base/java.lang.reflect.Method.invoke(Method.java:567)
        at com.carrotsearch.randomizedtesting.RandomizedRunner.invoke(RandomizedRunner.java:1750)
        at com.carrotsearch.randomizedtesting.RandomizedRunner$8.evaluate(RandomizedRunner.java:938)
        at com.carrotsearch.randomizedtesting.RandomizedRunner$9.evaluate(RandomizedRunner.java:974)
        at com.carrotsearch.randomizedtesting.RandomizedRunner$10.evaluate(RandomizedRunner.java:988)
        at com.carrotsearch.randomizedtesting.rules.SystemPropertiesRestoreRule$1.evaluate(SystemPropertiesRestoreRule.java:57)
        at org.apache.lucene.util.TestRuleSetupTeardownChained$1.evaluate(TestRuleSetupTeardownChained.java:49)
        at org.apache.lucene.util.AbstractBeforeAfterRule$1.evaluate(AbstractBeforeAfterRule.java:45)
        at org.apache.lucene.util.TestRuleThreadAndTestName$1.evaluate(TestRuleThreadAndTestName.java:48)
        at org.apache.lucene.util.TestRuleIgnoreAfterMaxFailures$1.evaluate(TestRuleIgnoreAfterMaxFailures.java:64)
        at org.apache.lucene.util.TestRuleMarkFailure$1.evaluate(TestRuleMarkFailure.java:47)
        at com.carrotsearch.randomizedtesting.rules.StatementAdapter.evaluate(StatementAdapter.java:36)
        at com.carrotsearch.randomizedtesting.ThreadLeakControl$StatementRunner.run(ThreadLeakControl.java:368)
        at com.carrotsearch.randomizedtesting.ThreadLeakControl.forkTimeoutingTask(ThreadLeakControl.java:817)
        at com.carrotsearch.randomizedtesting.ThreadLeakControl$3.evaluate(ThreadLeakControl.java:468)
        at com.carrotsearch.randomizedtesting.RandomizedRunner.runSingleTest(RandomizedRunner.java:947)
        at com.carrotsearch.randomizedtesting.RandomizedRunner$5.evaluate(RandomizedRunner.java:832)
        at com.carrotsearch.randomizedtesting.RandomizedRunner$6.evaluate(RandomizedRunner.java:883)
        at com.carrotsearch.randomizedtesting.RandomizedRunner$7.evaluate(RandomizedRunner.java:894)
        at com.carrotsearch.randomizedtesting.rules.StatementAdapter.evaluate(StatementAdapter.java:36)
        at com.carrotsearch.randomizedtesting.rules.SystemPropertiesRestoreRule$1.evaluate(SystemPropertiesRestoreRule.java:57)
        at org.apache.lucene.util.AbstractBeforeAfterRule$1.evaluate(AbstractBeforeAfterRule.java:45)
        at com.carrotsearch.randomizedtesting.rules.StatementAdapter.evaluate(StatementAdapter.java:36)
        at org.apache.lucene.util.TestRuleStoreClassName$1.evaluate(TestRuleStoreClassName.java:41)
        at com.carrotsearch.randomizedtesting.rules.NoShadowingOrOverridesOnMethodsRule$1.evaluate(NoShadowingOrOverridesOnMethodsRule.java:40)
        at com.carrotsearch.randomizedtesting.rules.NoShadowingOrOverridesOnMethodsRule$1.evaluate(NoShadowingOrOverridesOnMethodsRule.java:40)
        at com.carrotsearch.randomizedtesting.rules.StatementAdapter.evaluate(StatementAdapter.java:36)
        at com.carrotsearch.randomizedtesting.rules.StatementAdapter.evaluate(StatementAdapter.java:36)
        at org.apache.lucene.util.TestRuleAssertionsRequired$1.evaluate(TestRuleAssertionsRequired.java:53)
        at org.apache.lucene.util.TestRuleMarkFailure$1.evaluate(TestRuleMarkFailure.java:47)
        at org.apache.lucene.util.TestRuleIgnoreAfterMaxFailures$1.evaluate(TestRuleIgnoreAfterMaxFailures.java:64)
        at org.apache.lucene.util.TestRuleIgnoreTestSuites$1.evaluate(TestRuleIgnoreTestSuites.java:54)
        at com.carrotsearch.randomizedtesting.rules.StatementAdapter.evaluate(StatementAdapter.java:36)
        at com.carrotsearch.randomizedtesting.ThreadLeakControl$StatementRunner.run(ThreadLeakControl.java:368)
        at java.base/java.lang.Thread.run(Thread.java:835)


FAILED:  org.apache.solr.util.SolrPluginUtilsTest.testMinShouldMatchBadQueries

Error Message:
Expected exception SolrException but no exception was thrown

Stack Trace:
junit.framework.AssertionFailedError: Expected exception SolrException but no exception was thrown
        at __randomizedtesting.SeedInfo.seed([4499A23AA97C3A70:8A456290D744B57E]:0)
        at org.apache.lucene.util.LuceneTestCase.expectThrows(LuceneTestCase.java:2729)
        at org.apache.lucene.util.LuceneTestCase.expectThrows(LuceneTestCase.java:2719)
        at org.apache.solr.util.SolrPluginUtilsTest.testMinShouldMatchBadQueries(SolrPluginUtilsTest.java:344)
        at java.base/jdk.internal.reflect.NativeMethodAccessorImpl.invoke0(Native Method)
        at java.base/jdk.internal.reflect.NativeMethodAccessorImpl.invoke(NativeMethodAccessorImpl.java:62)
        at java.base/jdk.internal.reflect.DelegatingMethodAccessorImpl.invoke(DelegatingMethodAccessorImpl.java:43)
        at java.base/java.lang.reflect.Method.invoke(Method.java:567)
        at com.carrotsearch.randomizedtesting.RandomizedRunner.invoke(RandomizedRunner.java:1750)
        at com.carrotsearch.randomizedtesting.RandomizedRunner$8.evaluate(RandomizedRunner.java:938)
        at com.carrotsearch.randomizedtesting.RandomizedRunner$9.evaluate(RandomizedRunner.java:974)
        at com.carrotsearch.randomizedtesting.RandomizedRunner$10.evaluate(RandomizedRunner.java:988)
        at com.carrotsearch.randomizedtesting.rules.SystemPropertiesRestoreRule$1.evaluate(SystemPropertiesRestoreRule.java:57)
        at org.apache.lucene.util.TestRuleSetupTeardownChained$1.evaluate(TestRuleSetupTeardownChained.java:49)
        at org.apache.lucene.util.AbstractBeforeAfterRule$1.evaluate(AbstractBeforeAfterRule.java:45)
        at org.apache.lucene.util.TestRuleThreadAndTestName$1.evaluate(TestRuleThreadAndTestName.java:48)
        at org.apache.lucene.util.TestRuleIgnoreAfterMaxFailures$1.evaluate(TestRuleIgnoreAfterMaxFailures.java:64)
        at org.apache.lucene.util.TestRuleMarkFailure$1.evaluate(TestRuleMarkFailure.java:47)
        at com.carrotsearch.randomizedtesting.rules.StatementAdapter.evaluate(StatementAdapter.java:36)
        at com.carrotsearch.randomizedtesting.ThreadLeakControl$StatementRunner.run(ThreadLeakControl.java:368)
        at com.carrotsearch.randomizedtesting.ThreadLeakControl.forkTimeoutingTask(ThreadLeakControl.java:817)
        at com.carrotsearch.randomizedtesting.ThreadLeakControl$3.evaluate(ThreadLeakControl.java:468)
        at com.carrotsearch.randomizedtesting.RandomizedRunner.runSingleTest(RandomizedRunner.java:947)
        at com.carrotsearch.randomizedtesting.RandomizedRunner$5.evaluate(RandomizedRunner.java:832)
        at com.carrotsearch.randomizedtesting.RandomizedRunner$6.evaluate(RandomizedRunner.java:883)
        at com.carrotsearch.randomizedtesting.RandomizedRunner$7.evaluate(RandomizedRunner.java:894)
        at com.carrotsearch.randomizedtesting.rules.StatementAdapter.evaluate(StatementAdapter.java:36)
        at com.carrotsearch.randomizedtesting.rules.SystemPropertiesRestoreRule$1.evaluate(SystemPropertiesRestoreRule.java:57)
        at org.apache.lucene.util.AbstractBeforeAfterRule$1.evaluate(AbstractBeforeAfterRule.java:45)
        at com.carrotsearch.randomizedtesting.rules.StatementAdapter.evaluate(StatementAdapter.java:36)
        at org.apache.lucene.util.TestRuleStoreClassName$1.evaluate(TestRuleStoreClassName.java:41)
        at com.carrotsearch.randomizedtesting.rules.NoShadowingOrOverridesOnMethodsRule$1.evaluate(NoShadowingOrOverridesOnMethodsRule.java:40)
        at com.carrotsearch.randomizedtesting.rules.NoShadowingOrOverridesOnMethodsRule$1.evaluate(NoShadowingOrOverridesOnMethodsRule.java:40)
        at com.carrotsearch.randomizedtesting.rules.StatementAdapter.evaluate(StatementAdapter.java:36)
        at com.carrotsearch.randomizedtesting.rules.StatementAdapter.evaluate(StatementAdapter.java:36)
        at org.apache.lucene.util.TestRuleAssertionsRequired$1.evaluate(TestRuleAssertionsRequired.java:53)
        at org.apache.lucene.util.TestRuleMarkFailure$1.evaluate(TestRuleMarkFailure.java:47)
        at org.apache.lucene.util.TestRuleIgnoreAfterMaxFailures$1.evaluate(TestRuleIgnoreAfterMaxFailures.java:64)
        at org.apache.lucene.util.TestRuleIgnoreTestSuites$1.evaluate(TestRuleIgnoreTestSuites.java:54)
        at com.carrotsearch.randomizedtesting.rules.StatementAdapter.evaluate(StatementAdapter.java:36)
        at com.carrotsearch.randomizedtesting.ThreadLeakControl$StatementRunner.run(ThreadLeakControl.java:368)
        at java.base/java.lang.Thread.run(Thread.java:835)


FAILED:  org.apache.solr.util.SolrPluginUtilsTest.testMinShouldMatchBadQueries

Error Message:
Expected exception SolrException but no exception was thrown

Stack Trace:
junit.framework.AssertionFailedError: Expected exception SolrException but no exception was thrown
        at __randomizedtesting.SeedInfo.seed([4499A23AA97C3A70:8A456290D744B57E]:0)
        at org.apache.lucene.util.LuceneTestCase.expectThrows(LuceneTestCase.java:2729)
        at org.apache.lucene.util.LuceneTestCase.expectThrows(LuceneTestCase.java:2719)
        at org.apache.solr.util.SolrPluginUtilsTest.testMinShouldMatchBadQueries(SolrPluginUtilsTest.java:344)
        at java.base/jdk.internal.reflect.NativeMethodAccessorImpl.invoke0(Native Method)
        at java.base/jdk.internal.reflect.NativeMethodAccessorImpl.invoke(NativeMethodAccessorImpl.java:62)
        at java.base/jdk.internal.reflect.DelegatingMethodAccessorImpl.invoke(DelegatingMethodAccessorImpl.java:43)
        at java.base/java.lang.reflect.Method.invoke(Method.java:567)
        at com.carrotsearch.randomizedtesting.RandomizedRunner.invoke(RandomizedRunner.java:1750)
        at com.carrotsearch.randomizedtesting.RandomizedRunner$8.evaluate(RandomizedRunner.java:938)
        at com.carrotsearch.randomizedtesting.RandomizedRunner$9.evaluate(RandomizedRunner.java:974)
        at com.carrotsearch.randomizedtesting.RandomizedRunner$10.evaluate(RandomizedRunner.java:988)
        at com.carrotsearch.randomizedtesting.rules.SystemPropertiesRestoreRule$1.evaluate(SystemPropertiesRestoreRule.java:57)
        at org.apache.lucene.util.TestRuleSetupTeardownChained$1.evaluate(TestRuleSetupTeardownChained.java:49)
        at org.apache.lucene.util.AbstractBeforeAfterRule$1.evaluate(AbstractBeforeAfterRule.java:45)
        at org.apache.lucene.util.TestRuleThreadAndTestName$1.evaluate(TestRuleThreadAndTestName.java:48)
        at org.apache.lucene.util.TestRuleIgnoreAfterMaxFailures$1.evaluate(TestRuleIgnoreAfterMaxFailures.java:64)
        at org.apache.lucene.util.TestRuleMarkFailure$1.evaluate(TestRuleMarkFailure.java:47)
        at com.carrotsearch.randomizedtesting.rules.StatementAdapter.evaluate(StatementAdapter.java:36)
        at com.carrotsearch.randomizedtesting.ThreadLeakControl$StatementRunner.run(ThreadLeakControl.java:368)
        at com.carrotsearch.randomizedtesting.ThreadLeakControl.forkTimeoutingTask(ThreadLeakControl.java:817)
        at com.carrotsearch.randomizedtesting.ThreadLeakControl$3.evaluate(ThreadLeakControl.java:468)
        at com.carrotsearch.randomizedtesting.RandomizedRunner.runSingleTest(RandomizedRunner.java:947)
        at com.carrotsearch.randomizedtesting.RandomizedRunner$5.evaluate(RandomizedRunner.java:832)
        at com.carrotsearch.randomizedtesting.RandomizedRunner$6.evaluate(RandomizedRunner.java:883)
        at com.carrotsearch.randomizedtesting.RandomizedRunner$7.evaluate(RandomizedRunner.java:894)
        at com.carrotsearch.randomizedtesting.rules.StatementAdapter.evaluate(StatementAdapter.java:36)
        at com.carrotsearch.randomizedtesting.rules.SystemPropertiesRestoreRule$1.evaluate(SystemPropertiesRestoreRule.java:57)
        at org.apache.lucene.util.AbstractBeforeAfterRule$1.evaluate(AbstractBeforeAfterRule.java:45)
        at com.carrotsearch.randomizedtesting.rules.StatementAdapter.evaluate(StatementAdapter.java:36)
        at org.apache.lucene.util.TestRuleStoreClassName$1.evaluate(TestRuleStoreClassName.java:41)
        at com.carrotsearch.randomizedtesting.rules.NoShadowingOrOverridesOnMethodsRule$1.evaluate(NoShadowingOrOverridesOnMethodsRule.java:40)
        at com.carrotsearch.randomizedtesting.rules.NoShadowingOrOverridesOnMethodsRule$1.evaluate(NoShadowingOrOverridesOnMethodsRule.java:40)
        at com.carrotsearch.randomizedtesting.rules.StatementAdapter.evaluate(StatementAdapter.java:36)
        at com.carrotsearch.randomizedtesting.rules.StatementAdapter.evaluate(StatementAdapter.java:36)
        at org.apache.lucene.util.TestRuleAssertionsRequired$1.evaluate(TestRuleAssertionsRequired.java:53)
        at org.apache.lucene.util.TestRuleMarkFailure$1.evaluate(TestRuleMarkFailure.java:47)
        at org.apache.lucene.util.TestRuleIgnoreAfterMaxFailures$1.evaluate(TestRuleIgnoreAfterMaxFailures.java:64)
        at org.apache.lucene.util.TestRuleIgnoreTestSuites$1.evaluate(TestRuleIgnoreTestSuites.java:54)
        at com.carrotsearch.randomizedtesting.rules.StatementAdapter.evaluate(StatementAdapter.java:36)
        at com.carrotsearch.randomizedtesting.ThreadLeakControl$StatementRunner.run(ThreadLeakControl.java:368)
        at java.base/java.lang.Thread.run(Thread.java:835)




Build Log:
[...truncated 14228 lines...]
   [junit4] Suite: org.apache.solr.util.SolrPluginUtilsTest
   [junit4]   2> 1070978 INFO  (SUITE-SolrPluginUtilsTest-seed#[4499A23AA97C3A70]-worker) [     ] o.a.s.SolrTestCaseJ4 SecureRandom sanity checks: test.solr.allowed.securerandom=null & java.security.egd=file:/dev/./urandom
   [junit4]   2> 1070978 INFO  (SUITE-SolrPluginUtilsTest-seed#[4499A23AA97C3A70]-worker) [     ] o.a.s.SolrTestCaseJ4 Created dataDir: /home/jenkins/workspace/Lucene-Solr-master-Linux/solr/build/solr-core/test/J2/temp/solr.util.SolrPluginUtilsTest_4499A23AA97C3A70-001/data-dir-125-001
   [junit4]   2> 1070978 INFO  (SUITE-SolrPluginUtilsTest-seed#[4499A23AA97C3A70]-worker) [     ] o.a.s.SolrTestCaseJ4 Using PointFields (NUMERIC_POINTS_SYSPROP=true) w/NUMERIC_DOCVALUES_SYSPROP=true
   [junit4]   2> 1070979 INFO  (SUITE-SolrPluginUtilsTest-seed#[4499A23AA97C3A70]-worker) [     ] o.a.s.SolrTestCaseJ4 Randomized ssl (false) and clientAuth (false) via: @org.apache.solr.util.RandomizeSSL(reason="", value=0.0/0.0, ssl=0.0/0.0, clientAuth=0.0/0.0)
   [junit4]   2> 1070979 INFO  (SUITE-SolrPluginUtilsTest-seed#[4499A23AA97C3A70]-worker) [     ] o.a.s.SolrTestCaseJ4 ####initCore
   [junit4]   2> 1070979 INFO  (SUITE-SolrPluginUtilsTest-seed#[4499A23AA97C3A70]-worker) [     ] o.a.s.c.SolrResourceLoader [null] Added 2 libs to classloader, from paths: [/home/jenkins/workspace/Lucene-Solr-master-Linux/solr/core/src/test-files/solr/collection1/lib, /home/jenkins/workspace/Lucene-Solr-master-Linux/solr/core/src/test-files/solr/collection1/lib/classes]
   [junit4]   2> 1070988 INFO  (SUITE-SolrPluginUtilsTest-seed#[4499A23AA97C3A70]-worker) [     ] o.a.s.c.SolrConfig Using Lucene MatchVersion: 9.0.0
   [junit4]   2> 1071009 INFO  (SUITE-SolrPluginUtilsTest-seed#[4499A23AA97C3A70]-worker) [     ] o.a.s.s.IndexSchema [null] Schema name=test
   [junit4]   2> 1071061 INFO  (SUITE-SolrPluginUtilsTest-seed#[4499A23AA97C3A70]-worker) [     ] o.a.s.s.IndexSchema Loaded schema test/1.0 with uniqueid field id
   [junit4]   2> 1071163 WARN  (SUITE-SolrPluginUtilsTest-seed#[4499A23AA97C3A70]-worker) [     ] o.a.s.f.DistribPackageStore Unable to create [/home/jenkins/workspace/Lucene-Solr-master-Linux/solr/core/src/test-files/solr/filestore] directory in SOLR_HOME [/home/jenkins/workspace/Lucene-Solr-master-Linux/solr/core/src/test-files/solr].  Features requiring this directory may fail.
   [junit4]   2>           => java.security.AccessControlException: access denied ("java.io.FilePermission" "/home/jenkins/workspace/Lucene-Solr-master-Linux/solr/core/src/test-files/solr/filestore" "write")
   [junit4]   2>        at java.base/java.security.AccessControlContext.checkPermission(AccessControlContext.java:472)
   [junit4]   2> java.security.AccessControlException: access denied ("java.io.FilePermission" "/home/jenkins/workspace/Lucene-Solr-master-Linux/solr/core/src/test-files/solr/filestore" "write")
   [junit4]   2>        at java.security.AccessControlContext.checkPermission(AccessControlContext.java:472) ~[?:?]
   [junit4]   2>        at java.security.AccessController.checkPermission(AccessController.java:1042) ~[?:?]
   [junit4]   2>        at java.lang.SecurityManager.checkPermission(SecurityManager.java:408) ~[?:?]
   [junit4]   2>        at java.lang.SecurityManager.checkWrite(SecurityManager.java:838) ~[?:?]
   [junit4]   2>        at java.io.File.mkdir(File.java:1323) ~[?:?]
   [junit4]   2>        at java.io.File.mkdirs(File.java:1355) ~[?:?]
   [junit4]   2>        at org.apache.solr.filestore.DistribPackageStore.ensurePackageStoreDir(DistribPackageStore.java:465) ~[java/:?]
   [junit4]   2>        at org.apache.solr.filestore.DistribPackageStore.<init>(DistribPackageStore.java:65) ~[java/:?]
   [junit4]   2>        at org.apache.solr.filestore.PackageStoreAPI.<init>(PackageStoreAPI.java:77) ~[java/:?]
   [junit4]   2>        at org.apache.solr.core.CoreContainer.load(CoreContainer.java:618) ~[java/:?]
   [junit4]   2>        at org.apache.solr.util.TestHarness.<init>(TestHarness.java:180) ~[java/:?]
   [junit4]   2>        at org.apache.solr.util.TestHarness.<init>(TestHarness.java:143) ~[java/:?]
   [junit4]   2>        at org.apache.solr.util.TestHarness.<init>(TestHarness.java:149) ~[java/:?]
   [junit4]   2>        at org.apache.solr.util.TestHarness.<init>(TestHarness.java:112) ~[java/:?]
   [junit4]   2>        at org.apache.solr.SolrTestCaseJ4.createCore(SolrTestCaseJ4.java:797) ~[java/:?]
   [junit4]   2>        at org.apache.solr.SolrTestCaseJ4.initCore(SolrTestCaseJ4.java:787) ~[java/:?]
   [junit4]   2>        at org.apache.solr.SolrTestCaseJ4.initCore(SolrTestCaseJ4.java:648) ~[java/:?]
   [junit4]   2>        at org.apache.solr.SolrTestCaseJ4.initCore(SolrTestCaseJ4.java:637) ~[java/:?]
   [junit4]   2>        at org.apache.solr.util.SolrPluginUtilsTest.beforeClass(SolrPluginUtilsTest.java:50) ~[test/:?]
   [junit4]   2>        at jdk.internal.reflect.NativeMethodAccessorImpl.invoke0(Native Method) ~[?:?]
   [junit4]   2>        at jdk.internal.reflect.NativeMethodAccessorImpl.invoke(NativeMethodAccessorImpl.java:62) ~[?:?]
   [junit4]   2>        at jdk.internal.reflect.DelegatingMethodAccessorImpl.invoke(DelegatingMethodAccessorImpl.java:43) ~[?:?]
   [junit4]   2>        at java.lang.reflect.Method.invoke(Method.java:567) ~[?:?]
   [junit4]   2>        at com.carrotsearch.randomizedtesting.RandomizedRunner.invoke(RandomizedRunner.java:1750) ~[randomizedtesting-runner-2.7.2.jar:?]
   [junit4]   2>        at com.carrotsearch.randomizedtesting.RandomizedRunner$6.evaluate(RandomizedRunner.java:878) ~[randomizedtesting-runner-2.7.2.jar:?]
   [junit4]   2>        at com.carrotsearch.randomizedtesting.RandomizedRunner$7.evaluate(RandomizedRunner.java:894) ~[randomizedtesting-runner-2.7.2.jar:?]
   [junit4]   2>        at com.carrotsearch.randomizedtesting.rules.StatementAdapter.evaluate(StatementAdapter.java:36) ~[randomizedtesting-runner-2.7.2.jar:?]
   [junit4]   2>        at com.carrotsearch.randomizedtesting.rules.SystemPropertiesRestoreRule$1.evaluate(SystemPropertiesRestoreRule.java:57) ~[randomizedtesting-runner-2.7.2.jar:?]
   [junit4]   2>        at org.apache.lucene.util.AbstractBeforeAfterRule$1.evaluate(AbstractBeforeAfterRule.java:45) ~[java/:?]
   [junit4]   2>        at com.carrotsearch.randomizedtesting.rules.StatementAdapter.evaluate(StatementAdapter.java:36) ~[randomizedtesting-runner-2.7.2.jar:?]
   [junit4]   2>        at org.apache.lucene.util.TestRuleStoreClassName$1.evaluate(TestRuleStoreClassName.java:41) ~[java/:?]
   [junit4]   2>        at com.carrotsearch.randomizedtesting.rules.NoShadowingOrOverridesOnMethodsRule$1.evaluate(NoShadowingOrOverridesOnMethodsRule.java:40) ~[randomizedtesting-runner-2.7.2.jar:?]
   [junit4]   2>        at com.carrotsearch.randomizedtesting.rules.NoShadowingOrOverridesOnMethodsRule$1.evaluate(NoShadowingOrOverridesOnMethodsRule.java:40) ~[randomizedtesting-runner-2.7.2.jar:?]
   [junit4]   2>        at com.carrotsearch.randomizedtesting.rules.StatementAdapter.evaluate(StatementAdapter.java:36) ~[randomizedtesting-runner-2.7.2.jar:?]
   [junit4]   2>        at com.carrotsearch.randomizedtesting.rules.StatementAdapter.evaluate(StatementAdapter.java:36) ~[randomizedtesting-runner-2.7.2.jar:?]
   [junit4]   2>        at org.apache.lucene.util.TestRuleAssertionsRequired$1.evaluate(TestRuleAssertionsRequired.java:53) ~[java/:?]
   [junit4]   2>        at org.apache.lucene.util.TestRuleMarkFailure$1.evaluate(TestRuleMarkFailure.java:47) ~[java/:?]
   [junit4]   2>        at org.apache.lucene.util.TestRuleIgnoreAfterMaxFailures$1.evaluate(TestRuleIgnoreAfterMaxFailures.java:64) ~[java/:?]
   [junit4]   2>        at org.apache.lucene.util.TestRuleIgnoreTestSuites$1.evaluate(TestRuleIgnoreTestSuites.java:54) ~[java/:?]
   [junit4]   2>        at com.carrotsearch.randomizedtesting.rules.StatementAdapter.evaluate(StatementAdapter.java:36) ~[randomizedtesting-runner-2.7.2.jar:?]
   [junit4]   2>        at com.carrotsearch.randomizedtesting.ThreadLeakControl$StatementRunner.run(ThreadLeakControl.java:368) ~[randomizedtesting-runner-2.7.2.jar:?]
   [junit4]   2>        at java.lang.Thread.run(Thread.java:835) [?:?]
   [junit4]   2> 1071163 INFO  (SUITE-SolrPluginUtilsTest-seed#[4499A23AA97C3A70]-worker) [     ] o.a.s.h.c.HttpShardHandlerFactory Host whitelist initialized: WhitelistHostChecker [whitelistHosts=null, whitelistHostCheckingEnabled=true]
   [junit4]   2> 1071164 WARN  (SUITE-SolrPluginUtilsTest-seed#[4499A23AA97C3A70]-worker) [     ] o.e.j.u.s.S.config Trusting all certificates configured for Client@2fb4cd79[provider=null,keyStore=null,trustStore=null]
   [junit4]   2> 1071164 WARN  (SUITE-SolrPluginUtilsTest-seed#[4499A23AA97C3A70]-worker) [     ] o.e.j.u.s.S.config No Client EndPointIdentificationAlgorithm configured for Client@2fb4cd79[provider=null,keyStore=null,trustStore=null]
   [junit4]   2> 1071167 WARN  (SUITE-SolrPluginUtilsTest-seed#[4499A23AA97C3A70]-worker) [     ] o.e.j.u.s.S.config Trusting all certificates configured for Client@510e0459[provider=null,keyStore=null,trustStore=null]
   [junit4]   2> 1071167 WARN  (SUITE-SolrPluginUtilsTest-seed#[4499A23AA97C3A70]-worker) [     ] o.e.j.u.s.S.config No Client EndPointIdentificationAlgorithm configured for Client@510e0459[provider=null,keyStore=null,trustStore=null]
   [junit4]   2> 1071179 INFO  (SUITE-SolrPluginUtilsTest-seed#[4499A23AA97C3A70]-worker) [     ] o.a.s.c.TransientSolrCoreCacheDefault Allocating transient cache for 2147483647 transient cores
   [junit4]   2> 1071179 INFO  (SUITE-SolrPluginUtilsTest-seed#[4499A23AA97C3A70]-worker) [     ] o.a.s.h.a.MetricsHistoryHandler No .system collection, keeping metrics history in memory.
   [junit4]   2> 1071193 INFO  (SUITE-SolrPluginUtilsTest-seed#[4499A23AA97C3A70]-worker) [     ] o.a.s.m.r.SolrJmxReporter JMX monitoring for 'solr.node' (registry 'solr.node') enabled at server: com.sun.jmx.mbeanserver.JmxMBeanServer@4173d4b3
   [junit4]   2> 1071201 INFO  (SUITE-SolrPluginUtilsTest-seed#[4499A23AA97C3A70]-worker) [     ] o.a.s.m.r.SolrJmxReporter JMX monitoring for 'solr.jvm' (registry 'solr.jvm') enabled at server: com.sun.jmx.mbeanserver.JmxMBeanServer@4173d4b3
   [junit4]   2> 1071201 INFO  (SUITE-SolrPluginUtilsTest-seed#[4499A23AA97C3A70]-worker) [     ] o.a.s.m.r.SolrJmxReporter JMX monitoring for 'solr.jetty' (registry 'solr.jetty') enabled at server: com.sun.jmx.mbeanserver.JmxMBeanServer@4173d4b3
   [junit4]   2> 1071202 INFO  (coreLoadExecutor-5445-thread-1) [    x:collection1 ] o.a.s.c.SolrResourceLoader [null] Added 2 libs to classloader, from paths: [/home/jenkins/workspace/Lucene-Solr-master-Linux/solr/core/src/test-files/solr/collection1/lib, /home/jenkins/workspace/Lucene-Solr-master-Linux/solr/core/src/test-files/solr/collection1/lib/classes]
   [junit4]   2> 1071213 INFO  (coreLoadExecutor-5445-thread-1) [    x:collection1 ] o.a.s.c.SolrConfig Using Lucene MatchVersion: 9.0.0
   [junit4]   2> 1071232 INFO  (coreLoadExecutor-5445-thread-1) [    x:collection1 ] o.a.s.s.IndexSchema [collection1] Schema name=test
   [junit4]   2> 1071324 INFO  (coreLoadExecutor-5445-thread-1) [    x:collection1 ] o.a.s.s.IndexSchema Loaded schema test/1.0 with uniqueid field id
   [junit4]   2> 1071331 INFO  (coreLoadExecutor-5445-thread-1) [    x:collection1 ] o.a.s.c.CoreContainer Creating SolrCore 'collection1' using configuration from instancedir /home/jenkins/workspace/Lucene-Solr-master-Linux/solr/core/src/test-files/solr/collection1, trusted=true
   [junit4]   2> 1071331 INFO  (coreLoadExecutor-5445-thread-1) [    x:collection1 ] o.a.s.m.r.SolrJmxReporter JMX monitoring for 'solr.core.collection1' (registry 'solr.core.collection1') enabled at server: com.sun.jmx.mbeanserver.JmxMBeanServer@4173d4b3
   [junit4]   2> 1071332 INFO  (coreLoadExecutor-5445-thread-1) [    x:collection1 ] o.a.s.c.SolrCore [[collection1] ] Opening new SolrCore at [/home/jenkins/workspace/Lucene-Solr-master-Linux/solr/core/src/test-files/solr/collection1], dataDir=[/home/jenkins/workspace/Lucene-Solr-master-Linux/solr/build/solr-core/test/J2/temp/solr.util.SolrPluginUtilsTest_4499A23AA97C3A70-001/data-dir-125-001/]
   [junit4]   2> 1071333 INFO  (coreLoadExecutor-5445-thread-1) [    x:collection1 ] o.a.s.u.RandomMergePolicy RandomMergePolicy wrapping class org.apache.lucene.index.LogDocMergePolicy: [LogDocMergePolicy: minMergeSize=1000, mergeFactor=32, maxMergeSize=9223372036854775807, maxMergeSizeForForcedMerge=9223372036854775807, calibrateSizeByDeletes=true, maxMergeDocs=2147483647, maxCFSSegmentSizeMB=8.796093022207999E12, noCFSRatio=1.0]
   [junit4]   2> 1071376 INFO  (coreLoadExecutor-5445-thread-1) [    x:collection1 ] o.a.s.u.UpdateHandler Using UpdateLog implementation: org.apache.solr.update.UpdateLog
   [junit4]   2> 1071376 INFO  (coreLoadExecutor-5445-thread-1) [    x:collection1 ] o.a.s.u.UpdateLog Initializing UpdateLog: dataDir= defaultSyncLevel=FLUSH numRecordsToKeep=100 maxNumLogsToKeep=10 numVersionBuckets=65536
   [junit4]   2> 1071377 INFO  (coreLoadExecutor-5445-thread-1) [    x:collection1 ] o.a.s.u.CommitTracker Hard AutoCommit: disabled
   [junit4]   2> 1071377 INFO  (coreLoadExecutor-5445-thread-1) [    x:collection1 ] o.a.s.u.CommitTracker Soft AutoCommit: disabled
   [junit4]   2> 1071377 INFO  (coreLoadExecutor-5445-thread-1) [    x:collection1 ] o.a.s.u.RandomMergePolicy RandomMergePolicy wrapping class org.apache.lucene.index.LogDocMergePolicy: [LogDocMergePolicy: minMergeSize=1000, mergeFactor=16, maxMergeSize=9223372036854775807, maxMergeSizeForForcedMerge=9223372036854775807, calibrateSizeByDeletes=false, maxMergeDocs=2147483647, maxCFSSegmentSizeMB=8.796093022207999E12, noCFSRatio=0.26538797745064135]
   [junit4]   2> 1071377 INFO  (coreLoadExecutor-5445-thread-1) [    x:collection1 ] o.a.s.s.SolrIndexSearcher Opening [Searcher@3b2fb601[collection1] main]
   [junit4]   2> 1071378 INFO  (coreLoadExecutor-5445-thread-1) [    x:collection1 ] o.a.s.h.c.SpellCheckComponent Initializing spell checkers
   [junit4]   2> 1071456 INFO  (coreLoadExecutor-5445-thread-1) [    x:collection1 ] o.a.s.s.DirectSolrSpellChecker init: {name=direct, classname=DirectSolrSpellChecker, field=lowerfilt, minQueryLength=3}
   [junit4]   2> 1071494 INFO  (coreLoadExecutor-5445-thread-1) [    x:collection1 ] o.a.s.h.ReplicationHandler Commits will be reserved for 10000ms.
   [junit4]   2> 1071495 INFO  (coreLoadExecutor-5445-thread-1) [    x:collection1 ] o.a.s.u.UpdateLog Could not find max version in index or recent updates, using new clock 1649032249707855872
   [junit4]   2> 1071496 INFO  (searcherExecutor-5446-thread-1-processing-x:collection1) [    x:collection1 ] o.a.s.h.c.SpellCheckComponent Loading spell index for spellchecker: default
   [junit4]   2> 1071496 INFO  (searcherExecutor-5446-thread-1-processing-x:collection1) [    x:collection1 ] o.a.s.h.c.SpellCheckComponent Loading spell index for spellchecker: direct
   [junit4]   2> 1071496 INFO  (searcherExecutor-5446-thread-1-processing-x:collection1) [    x:collection1 ] o.a.s.h.c.SpellCheckComponent Loading spell index for spellchecker: wordbreak
   [junit4]   2> 1071496 INFO  (searcherExecutor-5446-thread-1-processing-x:collection1) [    x:collection1 ] o.a.s.h.c.SpellCheckComponent Loading spell index for spellchecker: multipleFields
   [junit4]   2> 1071496 INFO  (searcherExecutor-5446-thread-1-processing-x:collection1) [    x:collection1 ] o.a.s.h.c.SpellCheckComponent Loading spell index for spellchecker: jarowinkler
   [junit4]   2> 1071496 INFO  (searcherExecutor-5446-thread-1-processing-x:collection1) [    x:collection1 ] o.a.s.h.c.SpellCheckComponent Loading spell index for spellchecker: external
   [junit4]   2> 1071497 INFO  (searcherExecutor-5446-thread-1-processing-x:collection1) [    x:collection1 ] o.a.s.h.c.SpellCheckComponent Loading spell index for spellchecker: freq
   [junit4]   2> 1071497 INFO  (searcherExecutor-5446-thread-1-processing-x:collection1) [    x:collection1 ] o.a.s.h.c.SpellCheckComponent Loading spell index for spellchecker: fqcn
   [junit4]   2> 1071497 INFO  (SUITE-SolrPluginUtilsTest-seed#[4499A23AA97C3A70]-worker) [     ] o.a.s.SolrTestCaseJ4 ####initCore end
   [junit4]   2> 1071497 INFO  (searcherExecutor-5446-thread-1-processing-x:collection1) [    x:collection1 ] o.a.s.h.c.SpellCheckComponent Loading spell index for spellchecker: perDict
   [junit4]   2> 1071498 INFO  (searcherExecutor-5446-thread-1-processing-x:collection1) [    x:collection1 ] o.a.s.c.SolrCore [collection1] Registered new searcher Searcher@3b2fb601[collection1] main{ExitableDirectoryReader(UninvertingDirectoryReader())}
   [junit4]   2> 1071499 INFO  (TEST-SolrPluginUtilsTest.testInvokeSetters-seed#[4499A23AA97C3A70]) [     ] o.a.s.SolrTestCaseJ4 ###Starting testInvokeSetters
   [junit4]   2> 1071502 INFO  (TEST-SolrPluginUtilsTest.testInvokeSetters-seed#[4499A23AA97C3A70]) [     ] o.a.s.SolrTestCaseJ4 ###Ending testInvokeSetters
   [junit4]   2> 1071504 INFO  (TEST-SolrPluginUtilsTest.testParseFieldBoosts-seed#[4499A23AA97C3A70]) [     ] o.a.s.SolrTestCaseJ4 ###Starting testParseFieldBoosts
   [junit4]   2> 1071504 INFO  (TEST-SolrPluginUtilsTest.testParseFieldBoosts-seed#[4499A23AA97C3A70]) [     ] o.a.s.SolrTestCaseJ4 ###Ending testParseFieldBoosts
   [junit4]   2> 1071506 INFO  (TEST-SolrPluginUtilsTest.testMinShouldMatchCalculator-seed#[4499A23AA97C3A70]) [     ] o.a.s.SolrTestCaseJ4 ###Starting testMinShouldMatchCalculator
   [junit4]   2> 1071507 INFO  (TEST-SolrPluginUtilsTest.testMinShouldMatchCalculator-seed#[4499A23AA97C3A70]) [     ] o.a.s.SolrTestCaseJ4 ###Ending testMinShouldMatchCalculator
   [junit4]   2> 1071509 INFO  (TEST-SolrPluginUtilsTest.testPartialEscape-seed#[4499A23AA97C3A70]) [     ] o.a.s.SolrTestCaseJ4 ###Starting testPartialEscape
   [junit4]   2> 1071509 INFO  (TEST-SolrPluginUtilsTest.testPartialEscape-seed#[4499A23AA97C3A70]) [     ] o.a.s.SolrTestCaseJ4 ###Ending testPartialEscape
   [junit4]   2> 1071511 INFO  (TEST-SolrPluginUtilsTest.testMinShouldMatchAutoRelax-seed#[4499A23AA97C3A70]) [     ] o.a.s.SolrTestCaseJ4 ###Starting testMinShouldMatchAutoRelax
   [junit4]   2> 1071512 INFO  (TEST-SolrPluginUtilsTest.testMinShouldMatchAutoRelax-seed#[4499A23AA97C3A70]) [     ] o.a.s.SolrTestCaseJ4 ###Ending testMinShouldMatchAutoRelax
   [junit4]   2> 1071514 INFO  (TEST-SolrPluginUtilsTest.testStripIllegalOperators-seed#[4499A23AA97C3A70]) [     ] o.a.s.SolrTestCaseJ4 ###Starting testStripIllegalOperators
   [junit4]   2> 1071514 INFO  (TEST-SolrPluginUtilsTest.testStripIllegalOperators-seed#[4499A23AA97C3A70]) [     ] o.a.s.SolrTestCaseJ4 ###Ending testStripIllegalOperators
   [junit4]   2> 1071516 INFO  (TEST-SolrPluginUtilsTest.testDisjunctionMaxQueryParser-seed#[4499A23AA97C3A70]) [     ] o.a.s.SolrTestCaseJ4 ###Starting testDisjunctionMaxQueryParser
   [junit4]   2> 1071518 INFO  (TEST-SolrPluginUtilsTest.testDisjunctionMaxQueryParser-seed#[4499A23AA97C3A70]) [     ] o.a.s.SolrTestCaseJ4 ###Ending testDisjunctionMaxQueryParser
   [junit4]   2> 1071520 INFO  (TEST-SolrPluginUtilsTest.testMinShouldMatchBadQueries-seed#[4499A23AA97C3A70]) [     ] o.a.s.SolrTestCaseJ4 ###Starting testMinShouldMatchBadQueries
   [junit4]   2> 1071521 INFO  (TEST-SolrPluginUtilsTest.testMinShouldMatchBadQueries-seed#[4499A23AA97C3A70]) [     ] o.a.s.SolrTestCaseJ4 ###Ending testMinShouldMatchBadQueries
   [junit4]   2> NOTE: reproduce with: ant test  -Dtestcase=SolrPluginUtilsTest -Dtests.method=testMinShouldMatchBadQueries -Dtests.seed=4499A23AA97C3A70 -Dtests.multiplier=3 -Dtests.slow=true -Dtests.locale=en-MH -Dtests.timezone=America/Swift_Current -Dtests.asserts=true -Dtests.file.encoding=US-ASCII
   [junit4] FAILURE 0.00s J2 | SolrPluginUtilsTest.testMinShouldMatchBadQueries <<<
   [junit4]    > Throwable #1: junit.framework.AssertionFailedError: Expected exception SolrException but no exception was thrown
   [junit4]    >        at __randomizedtesting.SeedInfo.seed([4499A23AA97C3A70:8A456290D744B57E]:0)
   [junit4]    >        at org.apache.lucene.util.LuceneTestCase.expectThrows(LuceneTestCase.java:2729)
   [junit4]    >        at org.apache.lucene.util.LuceneTestCase.expectThrows(LuceneTestCase.java:2719)
   [junit4]    >        at org.apache.solr.util.SolrPluginUtilsTest.testMinShouldMatchBadQueries(SolrPluginUtilsTest.java:344)
   [junit4]    >        at java.base/jdk.internal.reflect.NativeMethodAccessorImpl.invoke0(Native Method)
   [junit4]    >        at java.base/jdk.internal.reflect.NativeMethodAccessorImpl.invoke(NativeMethodAccessorImpl.java:62)
   [junit4]    >        at java.base/jdk.internal.reflect.DelegatingMethodAccessorImpl.invoke(DelegatingMethodAccessorImpl.java:43)
   [junit4]    >        at java.base/java.lang.reflect.Method.invoke(Method.java:567)
   [junit4]    >        at java.base/java.lang.Thread.run(Thread.java:835)
   [junit4]   2> 1071524 INFO  (TEST-SolrPluginUtilsTest.testStripUnbalancedQuotes-seed#[4499A23AA97C3A70]) [     ] o.a.s.SolrTestCaseJ4 ###Starting testStripUnbalancedQuotes
   [junit4]   2> 1071524 INFO  (TEST-SolrPluginUtilsTest.testStripUnbalancedQuotes-seed#[4499A23AA97C3A70]) [     ] o.a.s.SolrTestCaseJ4 ###Ending testStripUnbalancedQuotes
   [junit4]   2> 1071524 INFO  (SUITE-SolrPluginUtilsTest-seed#[4499A23AA97C3A70]-worker) [     ] o.a.s.SolrTestCaseJ4 ###deleteCore
   [junit4]   2> 1071524 INFO  (SUITE-SolrPluginUtilsTest-seed#[4499A23AA97C3A70]-worker) [     ] o.a.s.c.CoreContainer Shutting down CoreContainer instance=1654055628
   [junit4]   2> 1071525 INFO  (coreCloseExecutor-5451-thread-1) [    x:collection1 ] o.a.s.c.SolrCore [collection1]  CLOSING SolrCore org.apache.solr.core.SolrCore@32b1f747
   [junit4]   2> 1071525 INFO  (coreCloseExecutor-5451-thread-1) [    x:collection1 ] o.a.s.m.SolrMetricManager Closing metric reporters for registry=solr.core.collection1, tag=SolrCore@32b1f747
   [junit4]   2> 1071525 INFO  (coreCloseExecutor-5451-thread-1) [    x:collection1 ] o.a.s.m.r.SolrJmxReporter Closing reporter [org.apache.solr.metrics.reporters.SolrJmxReporter@44ea5764: rootName = null, domain = solr.core.collection1, service url = null, agent id = null] for registry solr.core.collection1 / com.codahale.metrics.MetricRegistry@7b8fa50b
   [junit4]   2> 1071533 INFO  (SUITE-SolrPluginUtilsTest-seed#[4499A23AA97C3A70]-worker) [     ] o.a.s.m.SolrMetricManager Closing metric reporters for registry=solr.node, tag=null
   [junit4]   2> 1071533 INFO  (SUITE-SolrPluginUtilsTest-seed#[4499A23AA97C3A70]-worker) [     ] o.a.s.m.r.SolrJmxReporter Closing reporter [org.apache.solr.metrics.reporters.SolrJmxReporter@1c266ffa: rootName = null, domain = solr.node, service url = null, agent id = null] for registry solr.node / com.codahale.metrics.MetricRegistry@1835a2ec
   [junit4]   2> 1071536 INFO  (SUITE-SolrPluginUtilsTest-seed#[4499A23AA97C3A70]-worker) [     ] o.a.s.m.SolrMetricManager Closing metric reporters for registry=solr.jvm, tag=null
   [junit4]   2> 1071536 INFO  (SUITE-SolrPluginUtilsTest-seed#[4499A23AA97C3A70]-worker) [     ] o.a.s.m.r.SolrJmxReporter Closing reporter [org.apache.solr.metrics.reporters.SolrJmxReporter@2daa1187: rootName = null, domain = solr.jvm, service url = null, agent id = null] for registry solr.jvm / com.codahale.metrics.MetricRegistry@5eeeea33
   [junit4]   2> 1071539 INFO  (SUITE-SolrPluginUtilsTest-seed#[4499A23AA97C3A70]-worker) [     ] o.a.s.m.SolrMetricManager Closing metric reporters for registry=solr.jetty, tag=null
   [junit4]   2> 1071539 INFO  (SUITE-SolrPluginUtilsTest-seed#[4499A23AA97C3A70]-worker) [     ] o.a.s.m.r.SolrJmxReporter Closing reporter [org.apache.solr.metrics.reporters.SolrJmxReporter@5c23142c: rootName = null, domain = solr.jetty, service url = null, agent id = null] for registry solr.jetty / com.codahale.metrics.MetricRegistry@7c79d1f
   [junit4]   2> NOTE: leaving temporary files on disk at: /home/jenkins/workspace/Lucene-Solr-master-Linux/solr/build/solr-core/test/J2/temp/solr.util.SolrPluginUtilsTest_4499A23AA97C3A70-001
   [junit4]   2> NOTE: test params are: codec=HighCompressionCompressingStoredFields(storedFieldsFormat=CompressingStoredFieldsFormat(compressionMode=HIGH_COMPRESSION, chunkSize=1, maxDocsPerChunk=3, blockSize=555), termVectorsFormat=CompressingTermVectorsFormat(compressionMode=HIGH_COMPRESSION, chunkSize=1, blockSize=555)), sim=Asserting(org.apache.lucene.search.similarities.AssertingSimilarity@6ba6546f), locale=en-MH, timezone=America/Swift_Current
   [junit4]   2> NOTE: Linux 5.0.0-25-generic amd64/AdoptOpenJDK 12.0.1 (64-bit)/cpus=8,threads=1,free=135819920,total=518979584
   [junit4]   2> NOTE: All tests run in this JVM: [TestReplicaProperties, XsltUpdateRequestHandlerTest, ChaosMonkeyNothingIsSafeWithPullReplicasTest, ConnectionReuseTest, TestJsonRequest, ExternalFileFieldSortTest, TestLuceneMatchVersion, DeleteStatusTest, TestCodecSupport, TestSimpleQParserPlugin, TestManagedStopFilterFactory, DateFieldTest, TestStressCloudBlindAtomicUpdates, GraphQueryTest, TestZkChroot, DistributedDebugComponentTest, DirectSolrSpellCheckerTest, BigEndianAscendingWordDeserializerTest, MoveReplicaHDFSTest, HighlighterConfigTest, TestFaceting, TestLegacyTerms, MigrateRouteKeyTest, SolrXmlInZkTest, TestBlobHandler, SolrGraphiteReporterTest, DistributedSpellCheckComponentTest, TestShortCircuitedRequests, TestDFRSimilarityFactory, CustomCollectionTest, TestRestoreCore, SimpleCollectionCreateDeleteTest, TestStandardQParsers, SoftAutoCommitTest, AuditLoggerIntegrationTest, SolrTestCaseJ4Test, QueryResultKeyTest, TestHttpShardHandlerFactory, TestSimExecutePlanAction, TestDistributedGrouping, DistributedIntervalFacetingTest, ResponseHeaderTest, CollectionsAPIAsyncDistributedZkTest, TestCollectionsAPIViaSolrCloudCluster, HttpPartitionTest, TestSimComputePlanAction, SolrRrdBackendFactoryTest, SuggestComponentTest, TestCoreBackup, AutoAddReplicasPlanActionTest, TestInPlaceUpdatesDistrib, TestDynamicLoadingUrl, TestScoreJoinQPNoScore, ClassificationUpdateProcessorFactoryTest, OverseerModifyCollectionTest, RecoveryAfterSoftCommitTest, TestRawResponseWriter, TestSha256AuthenticationProvider, TestFieldCacheSort, TestJavabinTupleStreamParser, TestCloudPhrasesIdentificationComponent, CollectionStateFormat2Test, TestSimLargeCluster, TestSubQueryTransformerDistrib, DirectSolrConnectionTest, SolrCoreTest, SuggesterWFSTTest, SegmentsInfoRequestHandlerTest, BinaryUpdateRequestHandlerTest, TestNumericTerms64, SliceStateTest, TestSolrQueryResponse, AliasIntegrationTest, TestReplicationHandlerBackup, ManagedSchemaRoundRobinCloudTest, TestBlendedInfixSuggestions, ZkControllerTest, VersionInfoTest, ShardRoutingCustomTest, TestDocumentBuilder, LeaderFailureAfterFreshStartTest, MetricsHistoryHandlerTest, TestSurroundQueryParser, ResolveAnalyzerByNameTest, TriggerIntegrationTest, TestAuthorizationFramework, PeerSyncWithLeaderAndIndexFingerprintCachingTest, NodeLostTriggerTest, SpellCheckComponentTest, MultiDestinationAuditLoggerTest, BadCopyFieldTest, ExitableDirectoryReaderTest, TestFieldCacheWithThreads, TestMinHashQParser, TestStreamBody, TestCustomStream, TestSchemaNameResource, TestUseDocValuesAsStored, SignatureUpdateProcessorFactoryTest, TestSolrCloudWithHadoopAuthPlugin, CircularListTest, TestQueryUtils, TestLRUCache, CoreAdminCreateDiscoverTest, TestJsonFacetsStatsParsing, AnalysisErrorHandlingTest, TestDistribDocBasedVersion, ZkStateWriterTest, TestSortByMinMaxFunction, TestBinaryField, RangeFacetCloudTest, UninvertDocValuesMergePolicyTest, MultiThreadedOCPTest, HdfsSyncSliceTest, PreAnalyzedFieldTest, PhrasesIdentificationComponentTest, RulesTest, TestShardHandlerFactory, TestMacroExpander, SolrPluginUtilsTest]
   [junit4] Completed [412/887 (1!)] on J2 in 0.76s, 9 tests, 1 failure <<< FAILURES!

[...truncated 46580 lines...]
[repro] Jenkins log URL: https://jenkins.thetaphi.de/job/Lucene-Solr-master-Linux/24968/consoleText

[repro] Revision: b17d630e509adc9e62b07c599583558e715a869f

[repro] Ant options: "-Dargs=-XX:+UseCompressedOops -XX:+UseSerialGC"
[repro] Repro line:  ant test  -Dtestcase=SolrPluginUtilsTest -Dtests.method=testMinShouldMatchBadQueries -Dtests.seed=4499A23AA97C3A70 -Dtests.multiplier=3 -Dtests.slow=true -Dtests.locale=en-MH -Dtests.timezone=America/Swift_Current -Dtests.asserts=true -Dtests.file.encoding=US-ASCII

[repro] ant clean

[...truncated 6 lines...]
[repro] Test suites by module:
[repro]    solr/core
[repro]       SolrPluginUtilsTest
[repro] ant compile-test

[...truncated 3334 lines...]
[repro] ant test-nocompile -Dtests.dups=5 -Dtests.maxfailures=5 -Dtests.class="*.SolrPluginUtilsTest" -Dtests.showOutput=onerror "-Dargs=-XX:+UseCompressedOops -XX:+UseSerialGC" -Dtests.seed=4499A23AA97C3A70 -Dtests.multiplier=3 -Dtests.slow=true -Dtests.locale=en-MH -Dtests.timezone=America/Swift_Current -Dtests.asserts=true -Dtests.file.encoding=US-ASCII

[...truncated 32 lines...]
   [junit4] Suite: org.apache.solr.util.SolrPluginUtilsTest
   [junit4]   2> 2711 INFO  (SUITE-SolrPluginUtilsTest-seed#[4499A23AA97C3A70]-worker) [     ] o.a.s.SolrTestCaseJ4 SecureRandom sanity checks: test.solr.allowed.securerandom=null & java.security.egd=file:/dev/./urandom
   [junit4]   2> 2749 INFO  (SUITE-SolrPluginUtilsTest-seed#[4499A23AA97C3A70]-worker) [     ] o.a.s.SolrTestCaseJ4 Created dataDir: /home/jenkins/workspace/Lucene-Solr-master-Linux/solr/build/solr-core/test/J1/temp/solr.util.SolrPluginUtilsTest_4499A23AA97C3A70-001/data-dir-1-001
   [junit4]   2> 2818 INFO  (SUITE-SolrPluginUtilsTest-seed#[4499A23AA97C3A70]-worker) [     ] o.a.s.SolrTestCaseJ4 Using PointFields (NUMERIC_POINTS_SYSPROP=true) w/NUMERIC_DOCVALUES_SYSPROP=true
   [junit4]   2> 2857 INFO  (SUITE-SolrPluginUtilsTest-seed#[4499A23AA97C3A70]-worker) [     ] o.e.j.u.log Logging initialized @4128ms to org.eclipse.jetty.util.log.Slf4jLog
   [junit4]   2> 2865 INFO  (SUITE-SolrPluginUtilsTest-seed#[4499A23AA97C3A70]-worker) [     ] o.a.s.SolrTestCaseJ4 Randomized ssl (false) and clientAuth (false) via: @org.apache.solr.util.RandomizeSSL(reason="", value=0.0/0.0, ssl=0.0/0.0, clientAuth=0.0/0.0)
   [junit4]   2> 2884 INFO  (SUITE-SolrPluginUtilsTest-seed#[4499A23AA97C3A70]-worker) [     ] o.a.s.SolrTestCaseJ4 ####initCore
   [junit4]   2> 2989 INFO  (SUITE-SolrPluginUtilsTest-seed#[4499A23AA97C3A70]-worker) [     ] o.a.s.c.SolrResourceLoader Using system property solr.solr.home: /home/jenkins/workspace/Lucene-Solr-master-Linux/solr/core/src/test-files/solr
   [junit4]   2> 2993 INFO  (SUITE-SolrPluginUtilsTest-seed#[4499A23AA97C3A70]-worker) [     ] o.a.s.c.SolrResourceLoader [null] Added 2 libs to classloader, from paths: [/home/jenkins/workspace/Lucene-Solr-master-Linux/solr/core/src/test-files/solr/collection1/lib, /home/jenkins/workspace/Lucene-Solr-master-Linux/solr/core/src/test-files/solr/collection1/lib/classes]
   [junit4]   2> 3660 INFO  (SUITE-SolrPluginUtilsTest-seed#[4499A23AA97C3A70]-worker) [     ] o.a.s.c.SolrConfig Using Lucene MatchVersion: 9.0.0
   [junit4]   2> 4139 INFO  (SUITE-SolrPluginUtilsTest-seed#[4499A23AA97C3A70]-worker) [     ] o.a.s.s.IndexSchema [null] Schema name=test
   [junit4]   2> 4848 WARN  (SUITE-SolrPluginUtilsTest-seed#[4499A23AA97C3A70]-worker) [     ] o.a.s.c.SolrResourceLoader Solr loaded a deprecated plugin/analysis class [solr.WordDelimiterFilterFactory]. Please consult documentation how to replace it accordingly.
   [junit4]   2> 5021 WARN  (SUITE-SolrPluginUtilsTest-seed#[4499A23AA97C3A70]-worker) [     ] o.a.s.c.SolrResourceLoader Solr loaded a deprecated plugin/analysis class [solr.GeoHashField]. Please consult documentation how to replace it accordingly.
   [junit4]   2> 5027 WARN  (SUITE-SolrPluginUtilsTest-seed#[4499A23AA97C3A70]-worker) [     ] o.a.s.c.SolrResourceLoader Solr loaded a deprecated plugin/analysis class [solr.LatLonType]. Please consult documentation how to replace it accordingly.
   [junit4]   2> 5035 WARN  (SUITE-SolrPluginUtilsTest-seed#[4499A23AA97C3A70]-worker) [     ] o.a.s.c.SolrResourceLoader Solr loaded a deprecated plugin/analysis class [solr.CurrencyField]. Please consult documentation how to replace it accordingly.
   [junit4]   2> 5698 INFO  (SUITE-SolrPluginUtilsTest-seed#[4499A23AA97C3A70]-worker) [     ] o.a.s.s.IndexSchema Loaded schema test/1.0 with uniqueid field id
   [junit4]   2> 6479 WARN  (SUITE-SolrPluginUtilsTest-seed#[4499A23AA97C3A70]-worker) [     ] o.a.s.f.DistribPackageStore Unable to create [/home/jenkins/workspace/Lucene-Solr-master-Linux/solr/core/src/test-files/solr/filestore] directory in SOLR_HOME [/home/jenkins/workspace/Lucene-Solr-master-Linux/solr/core/src/test-files/solr].  Features requiring this directory may fail.
   [junit4]   2>           => java.security.AccessControlException: access denied ("java.io.FilePermission" "/home/jenkins/workspace/Lucene-Solr-master-Linux/solr/core/src/test-files/solr/filestore" "write")
   [junit4]   2>        at java.base/java.security.AccessControlContext.checkPermission(AccessControlContext.java:472)
   [junit4]   2> java.security.AccessControlException: access denied ("java.io.FilePermission" "/home/jenkins/workspace/Lucene-Solr-master-Linux/solr/core/src/test-files/solr/filestore" "write")
   [junit4]   2>        at java.security.AccessControlContext.checkPermission(AccessControlContext.java:472) ~[?:?]
   [junit4]   2>        at java.security.AccessController.checkPermission(AccessController.java:1042) ~[?:?]
   [junit4]   2>        at java.lang.SecurityManager.checkPermission(SecurityManager.java:408) ~[?:?]
   [junit4]   2>        at java.lang.SecurityManager.checkWrite(SecurityManager.java:838) ~[?:?]
   [junit4]   2>        at java.io.File.mkdir(File.java:1323) ~[?:?]
   [junit4]   2>        at java.io.File.mkdirs(File.java:1355) ~[?:?]
   [junit4]   2>        at org.apache.solr.filestore.DistribPackageStore.ensurePackageStoreDir(DistribPackageStore.java:465) ~[java/:?]
   [junit4]   2>        at org.apache.solr.filestore.DistribPackageStore.<init>(DistribPackageStore.java:65) ~[java/:?]
   [junit4]   2>        at org.apache.solr.filestore.PackageStoreAPI.<init>(PackageStoreAPI.java:77) ~[java/:?]
   [junit4]   2>        at org.apache.solr.core.CoreContainer.load(CoreContainer.java:618) ~[java/:?]
   [junit4]   2>        at org.apache.solr.util.TestHarness.<init>(TestHarness.java:180) ~[java/:?]
   [junit4]   2>        at org.apache.solr.util.TestHarness.<init>(TestHarness.java:143) ~[java/:?]
   [junit4]   2>        at org.apache.solr.util.TestHarness.<init>(TestHarness.java:149) ~[java/:?]
   [junit4]   2>        at org.apache.solr.util.TestHarness.<init>(TestHarness.java:112) ~[java/:?]
   [junit4]   2>        at org.apache.solr.SolrTestCaseJ4.createCore(SolrTestCaseJ4.java:797) ~[java/:?]
   [junit4]   2>        at org.apache.solr.SolrTestCaseJ4.initCore(SolrTestCaseJ4.java:787) ~[java/:?]
   [junit4]   2>        at org.apache.solr.SolrTestCaseJ4.initCore(SolrTestCaseJ4.java:648) ~[java/:?]
   [junit4]   2>        at org.apache.solr.SolrTestCaseJ4.initCore(SolrTestCaseJ4.java:637) ~[java/:?]
   [junit4]   2>        at org.apache.solr.util.SolrPluginUtilsTest.beforeClass(SolrPluginUtilsTest.java:50) ~[test/:?]
   [junit4]   2>        at jdk.internal.reflect.NativeMethodAccessorImpl.invoke0(Native Method) ~[?:?]
   [junit4]   2>        at jdk.internal.reflect.NativeMethodAccessorImpl.invoke(NativeMethodAccessorImpl.java:62) ~[?:?]
   [junit4]   2>        at jdk.internal.reflect.DelegatingMethodAccessorImpl.invoke(DelegatingMethodAccessorImpl.java:43) ~[?:?]
   [junit4]   2>        at java.lang.reflect.Method.invoke(Method.java:567) ~[?:?]
   [junit4]   2>        at com.carrotsearch.randomizedtesting.RandomizedRunner.invoke(RandomizedRunner.java:1750) ~[randomizedtesting-runner-2.7.2.jar:?]
   [junit4]   2>        at com.carrotsearch.randomizedtesting.RandomizedRunner$6.evaluate(RandomizedRunner.java:878) ~[randomizedtesting-runner-2.7.2.jar:?]
   [junit4]   2>        at com.carrotsearch.randomizedtesting.RandomizedRunner$7.evaluate(RandomizedRunner.java:894) ~[randomizedtesting-runner-2.7.2.jar:?]
   [junit4]   2>        at com.carrotsearch.randomizedtesting.rules.StatementAdapter.evaluate(StatementAdapter.java:36) ~[randomizedtesting-runner-2.7.2.jar:?]
   [junit4]   2>        at com.carrotsearch.randomizedtesting.rules.SystemPropertiesRestoreRule$1.evaluate(SystemPropertiesRestoreRule.java:57) ~[randomizedtesting-runner-2.7.2.jar:?]
   [junit4]   2>        at org.apache.lucene.util.AbstractBeforeAfterRule$1.evaluate(AbstractBeforeAfterRule.java:45) ~[java/:?]
   [junit4]   2>        at com.carrotsearch.randomizedtesting.rules.StatementAdapter.evaluate(StatementAdapter.java:36) ~[randomizedtesting-runner-2.7.2.jar:?]
   [junit4]   2>        at org.apache.lucene.util.TestRuleStoreClassName$1.evaluate(TestRuleStoreClassName.java:41) ~[java/:?]
   [junit4]   2>        at com.carrotsearch.randomizedtesting.rules.NoShadowingOrOverridesOnMethodsRule$1.evaluate(NoShadowingOrOverridesOnMethodsRule.java:40) ~[randomizedtesting-runner-2.7.2.jar:?]
   [junit4]   2>        at com.carrotsearch.randomizedtesting.rules.NoShadowingOrOverridesOnMethodsRule$1.evaluate(NoShadowingOrOverridesOnMethodsRule.java:40) ~[randomizedtesting-runner-2.7.2.jar:?]
   [junit4]   2>        at com.carrotsearch.randomizedtesting.rules.StatementAdapter.evaluate(StatementAdapter.java:36) ~[randomizedtesting-runner-2.7.2.jar:?]
   [junit4]   2>        at com.carrotsearch.randomizedtesting.rules.StatementAdapter.evaluate(StatementAdapter.java:36) ~[randomizedtesting-runner-2.7.2.jar:?]
   [junit4]   2>        at org.apache.lucene.util.TestRuleAssertionsRequired$1.evaluate(TestRuleAssertionsRequired.java:53) ~[java/:?]
   [junit4]   2>        at org.apache.lucene.util.TestRuleMarkFailure$1.evaluate(TestRuleMarkFailure.java:47) ~[java/:?]
   [junit4]   2>        at org.apache.lucene.util.TestRuleIgnoreAfterMaxFailures$1.evaluate(TestRuleIgnoreAfterMaxFailures.java:64) ~[java/:?]
   [junit4]   2>        at org.apache.lucene.util.TestRuleIgnoreTestSuites$1.evaluate(TestRuleIgnoreTestSuites.java:54) ~[java/:?]
   [junit4]   2>        at com.carrotsearch.randomizedtesting.rules.StatementAdapter.evaluate(StatementAdapter.java:36) ~[randomizedtesting-runner-2.7.2.jar:?]
   [junit4]   2>        at com.carrotsearch.randomizedtesting.ThreadLeakControl$StatementRunner.run(ThreadLeakControl.java:368) ~[randomizedtesting-runner-2.7.2.jar:?]
   [junit4]   2>        at java.lang.Thread.run(Thread.java:835) [?:?]
   [junit4]   2> 6858 INFO  (SUITE-SolrPluginUtilsTest-seed#[4499A23AA97C3A70]-worker) [     ] o.a.s.h.c.HttpShardHandlerFactory Host whitelist initialized: WhitelistHostChecker [whitelistHosts=null, whitelistHostCheckingEnabled=true]
   [junit4]   2> 7089 WARN  (SUITE-SolrPluginUtilsTest-seed#[4499A23AA97C3A70]-worker) [     ] o.e.j.u.s.S.config Trusting all certificates configured for Client@59f18d0e[provider=null,keyStore=null,trustStore=null]
   [junit4]   2> 7089 WARN  (SUITE-SolrPluginUtilsTest-seed#[4499A23AA97C3A70]-worker) [     ] o.e.j.u.s.S.config No Client EndPointIdentificationAlgorithm configured for Client@59f18d0e[provider=null,keyStore=null,trustStore=null]
   [junit4]   2> 7338 WARN  (SUITE-SolrPluginUtilsTest-seed#[4499A23AA97C3A70]-worker) [     ] o.e.j.u.s.S.config Trusting all certificates configured for Client@5336540f[provider=null,keyStore=null,trustStore=null]
   [junit4]   2> 7338 WARN  (SUITE-SolrPluginUtilsTest-seed#[4499A23AA97C3A70]-worker) [     ] o.e.j.u.s.S.config No Client EndPointIdentificationAlgorithm configured for Client@5336540f[provider=null,keyStore=null,trustStore=null]
   [junit4]   2> 7737 INFO  (SUITE-SolrPluginUtilsTest-seed#[4499A23AA97C3A70]-worker) [     ] o.a.s.c.TransientSolrCoreCacheDefault Allocating transient cache for 2147483647 transient cores
   [junit4]   2> 7740 INFO  (SUITE-SolrPluginUtilsTest-seed#[4499A23AA97C3A70]-worker) [     ] o.a.s.h.a.MetricsHistoryHandler No .system collection, keeping metrics history in memory.
   [junit4]   2> 7861 INFO  (SUITE-SolrPluginUtilsTest-seed#[4499A23AA97C3A70]-worker) [     ] o.a.s.m.r.SolrJmxReporter JMX monitoring for 'solr.node' (registry 'solr.node') enabled at server: com.sun.jmx.mbeanserver.JmxMBeanServer@32da9ad1
   [junit4]   2> 7862 INFO  (SUITE-SolrPluginUtilsTest-seed#[4499A23AA97C3A70]-worker) [     ] o.a.s.m.r.SolrJmxReporter JMX monitoring for 'solr.jvm' (registry 'solr.jvm') enabled at server: com.sun.jmx.mbeanserver.JmxMBeanServer@32da9ad1
   [junit4]   2> 7862 INFO  (SUITE-SolrPluginUtilsTest-seed#[4499A23AA97C3A70]-worker) [     ] o.a.s.m.r.SolrJmxReporter JMX monitoring for 'solr.jetty' (registry 'solr.jetty') enabled at server: com.sun.jmx.mbeanserver.JmxMBeanServer@32da9ad1
   [junit4]   2> 7956 INFO  (coreLoadExecutor-9-thread-1) [    x:collection1 ] o.a.s.c.SolrResourceLoader [null] Added 2 libs to classloader, from paths: [/home/jenkins/workspace/Lucene-Solr-master-Linux/solr/core/src/test-files/solr/collection1/lib, /home/jenkins/workspace/Lucene-Solr-master-Linux/solr/core/src/test-files/solr/collection1/lib/classes]
   [junit4]   2> 8062 INFO  (coreLoadExecutor-9-thread-1) [    x:collection1 ] o.a.s.c.SolrConfig Using Lucene MatchVersion: 9.0.0
   [junit4]   2> 8221 INFO  (coreLoadExecutor-9-thread-1) [    x:collection1 ] o.a.s.s.IndexSchema [collection1] Schema name=test
   [junit4]   2> 8471 INFO  (coreLoadExecutor-9-thread-1) [    x:collection1 ] o.a.s.s.IndexSchema Loaded schema test/1.0 with uniqueid field id
   [junit4]   2> 8505 INFO  (coreLoadExecutor-9-thread-1) [    x:collection1 ] o.a.s.c.CoreContainer Creating SolrCore 'collection1' using configuration from instancedir /home/jenkins/workspace/Lucene-Solr-master-Linux/solr/core/src/test-files/solr/collection1, trusted=true
   [junit4]   2> 8531 INFO  (coreLoadExecutor-9-thread-1) [    x:collection1 ] o.a.s.m.r.SolrJmxReporter JMX monitoring for 'solr.core.collection1' (registry 'solr.core.collection1') enabled at server: com.sun.jmx.mbeanserver.JmxMBeanServer@32da9ad1
   [junit4]   2> 8544 INFO  (coreLoadExecutor-9-thread-1) [    x:collection1 ] o.a.s.c.SolrCore [[collection1] ] Opening new SolrCore at [/home/jenkins/workspace/Lucene-Solr-master-Linux/solr/core/src/test-files/solr/collection1], dataDir=[/home/jenkins/workspace/Lucene-Solr-master-Linux/solr/build/solr-core/test/J1/temp/solr.util.SolrPluginUtilsTest_4499A23AA97C3A70-001/data-dir-1-001/]
   [junit4]   2> 8596 INFO  (coreLoadExecutor-9-thread-1) [    x:collection1 ] o.a.s.u.RandomMergePolicy RandomMergePolicy wrapping class org.apache.lucene.index.LogDocMergePolicy: [LogDocMergePolicy: minMergeSize=1000, mergeFactor=32, maxMergeSize=9223372036854775807, maxMergeSizeForForcedMerge=9223372036854775807, calibrateSizeByDeletes=true, maxMergeDocs=2147483647, maxCFSSegmentSizeMB=8.796093022207999E12, noCFSRatio=1.0]
   [junit4]   2> 9124 INFO  (coreLoadExecutor-9-thread-1) [    x:collection1 ] o.a.s.u.UpdateHandler Using UpdateLog implementation: org.apache.solr.update.UpdateLog
   [junit4]   2> 9124 INFO  (coreLoadExecutor-9-thread-1) [    x:collection1 ] o.a.s.u.UpdateLog Initializing UpdateLog: dataDir= defaultSyncLevel=FLUSH numRecordsToKeep=100 maxNumLogsToKeep=10 numVersionBuckets=65536
   [junit4]   2> 9142 INFO  (coreLoadExecutor-9-thread-1) [    x:collection1 ] o.a.s.u.CommitTracker Hard AutoCommit: disabled
   [junit4]   2> 9142 INFO  (coreLoadExecutor-9-thread-1) [    x:collection1 ] o.a.s.u.CommitTracker Soft AutoCommit: disabled
   [junit4]   2> 9146 INFO  (coreLoadExecutor-9-thread-1) [    x:collection1 ] o.a.s.u.RandomMergePolicy RandomMergePolicy wrapping class org.apache.lucene.index.LogDocMergePolicy: [LogDocMergePolicy: minMergeSize=1000, mergeFactor=16, maxMergeSize=9223372036854775807, maxMergeSizeForForcedMerge=9223372036854775807, calibrateSizeByDeletes=false, maxMergeDocs=2147483647, maxCFSSegmentSizeMB=8.796093022207999E12, noCFSRatio=0.26538797745064135]
   [junit4]   2> 9160 INFO  (coreLoadExecutor-9-thread-1) [    x:collection1 ] o.a.s.s.SolrIndexSearcher Opening [Searcher@507a98af[collection1] main]
   [junit4]   2> 9208 INFO  (coreLoadExecutor-9-thread-1) [    x:collection1 ] o.a.s.h.c.SpellCheckComponent Initializing spell checkers
   [junit4]   2> 9427 INFO  (coreLoadExecutor-9-thread-1) [    x:collection1 ] o.a.s.s.DirectSolrSpellChecker init: {name=direct, classname=DirectSolrSpellChecker, field=lowerfilt, minQueryLength=3}
   [junit4]   2> 9557 INFO  (coreLoadExecutor-9-thread-1) [    x:collection1 ] o.a.s.h.ReplicationHandler Commits will be reserved for 10000ms.
   [junit4]   2> 9561 INFO  (coreLoadExecutor-9-thread-1) [    x:collection1 ] o.a.s.u.UpdateLog Could not find max version in index or recent updates, using new clock 1649034578931744768
   [junit4]   2> 9566 INFO  (searcherExecutor-10-thread-1-processing-x:collection1) [    x:collection1 ] o.a.s.h.c.SpellCheckComponent Loading spell index for spellchecker: default
   [junit4]   2> 9580 INFO  (searcherExecutor-10-thread-1-processing-x:collection1) [    x:collection1 ] o.a.s.h.c.SpellCheckComponent Loading spell index for spellchecker: direct
   [junit4]   2> 9580 INFO  (searcherExecutor-10-thread-1-processing-x:collection1) [    x:collection1 ] o.a.s.h.c.SpellCheckComponent Loading spell index for spellchecker: wordbreak
   [junit4]   2> 9580 INFO  (searcherExecutor-10-thread-1-processing-x:collection1) [    x:collection1 ] o.a.s.h.c.SpellCheckComponent Loading spell index for spellchecker: multipleFields
   [junit4]   2> 9580 INFO  (SUITE-SolrPluginUtilsTest-seed#[4499A23AA97C3A70]-worker) [     ] o.a.s.SolrTestCaseJ4 ####initCore end
   [junit4]   2> 9582 INFO  (searcherExecutor-10-thread-1-processing-x:collection1) [    x:collection1 ] o.a.s.h.c.SpellCheckComponent Loading spell index for spellchecker: jarowinkler
   [junit4]   2> 9601 INFO  (searcherExecutor-10-thread-1-processing-x:collection1) [    x:collection1 ] o.a.s.h.c.SpellCheckComponent Loading spell index for spellchecker: external
   [junit4]   2> 9603 INFO  (TEST-SolrPluginUtilsTest.testInvokeSetters-seed#[4499A23AA97C3A70]) [     ] o.a.s.SolrTestCaseJ4 ###Starting testInvokeSetters
   [junit4] OK      0.04s J1 | SolrPluginUtilsTest.testInvokeSetters
   [junit4]   2> 9611 INFO  (searcherExecutor-10-thread-1-processing-x:collection1) [    x:collection1 ] o.a.s.h.c.SpellCheckComponent Loading spell index for spellchecker: freq
   [junit4]   2> 9612 INFO  (searcherExecutor-10-thread-1-processing-x:collection1) [    x:collection1 ] o.a.s.h.c.SpellCheckComponent Loading spell index for spellchecker: fqcn
   [junit4]   2> 9614 INFO  (searcherExecutor-10-thread-1-processing-x:collection1) [    x:collection1 ] o.a.s.h.c.SpellCheckComponent Loading spell index for spellchecker: perDict
   [junit4]   2> 9618 INFO  (TEST-SolrPluginUtilsTest.testInvokeSetters-seed#[4499A23AA97C3A70]) [     ] o.a.s.SolrTestCaseJ4 ###Ending testInvokeSetters
   [junit4]   2> 9624 INFO  (searcherExecutor-10-thread-1-processing-x:collection1) [    x:collection1 ] o.a.s.c.SolrCore [collection1] Registered new searcher Searcher@507a98af[collection1] main{ExitableDirectoryReader(UninvertingDirectoryReader())}
   [junit4]   2> 9636 INFO  (TEST-SolrPluginUtilsTest.testParseFieldBoosts-seed#[4499A23AA97C3A70]) [     ] o.a.s.SolrTestCaseJ4 ###Starting testParseFieldBoosts
   [junit4]   2> 9639 INFO  (TEST-SolrPluginUtilsTest.testParseFieldBoosts-seed#[4499A23AA97C3A70]) [     ] o.a.s.SolrTestCaseJ4 ###Ending testParseFieldBoosts
   [junit4] OK      0.02s J1 | SolrPluginUtilsTest.testParseFieldBoosts
   [junit4]   2> 9658 INFO  (TEST-SolrPluginUtilsTest.testMinShouldMatchCalculator-seed#[4499A23AA97C3A70]) [     ] o.a.s.SolrTestCaseJ4 ###Starting testMinShouldMatchCalculator
   [junit4]   2> 9660 INFO  (TEST-SolrPluginUtilsTest.testMinShouldMatchCalculator-seed#[4499A23AA97C3A70]) [     ] o.a.s.SolrTestCaseJ4 ###Ending testMinShouldMatchCalculator
   [junit4] OK      0.02s J1 | SolrPluginUtilsTest.testMinShouldMatchCalculator
   [junit4]   2> 9669 INFO  (TEST-SolrPluginUtilsTest.testPartialEscape-seed#[4499A23AA97C3A70]) [     ] o.a.s.SolrTestCaseJ4 ###Starting testPartialEscape
   [junit4]   2> 9670 INFO  (TEST-SolrPluginUtilsTest.testPartialEscape-seed#[4499A23AA97C3A70]) [     ] o.a.s.SolrTestCaseJ4 ###Ending testPartialEscape
   [junit4] OK      0.01s J1 | SolrPluginUtilsTest.testPartialEscape
   [junit4]   2> 9692 INFO  (TEST-SolrPluginUtilsTest.testMinShouldMatchAutoRelax-seed#[4499A23AA97C3A70]) [     ] o.a.s.SolrTestCaseJ4 ###Starting testMinShouldMatchAutoRelax
   [junit4]   2> 9694 INFO  (TEST-SolrPluginUtilsTest.testMinShouldMatchAutoRelax-seed#[4499A23AA97C3A70]) [     ] o.a.s.SolrTestCaseJ4 ###Ending testMinShouldMatchAutoRelax
   [junit4] OK      0.02s J1 | SolrPluginUtilsTest.testMinShouldMatchAutoRelax
   [junit4]   2> 9737 INFO  (TEST-SolrPluginUtilsTest.testStripIllegalOperators-seed#[4499A23AA97C3A70]) [     ] o.a.s.SolrTestCaseJ4 ###Starting testStripIllegalOperators
   [junit4]   2> 9738 INFO  (TEST-SolrPluginUtilsTest.testStripIllegalOperators-seed#[4499A23AA97C3A70]) [     ] o.a.s.SolrTestCaseJ4 ###Ending testStripIllegalOperators
   [junit4] OK      0.04s J1 | SolrPluginUtilsTest.testStripIllegalOperators
   [junit4]   2> 9745 INFO  (TEST-SolrPluginUtilsTest.testDisjunctionMaxQueryParser-seed#[4499A23AA97C3A70]) [     ] o.a.s.SolrTestCaseJ4 ###Starting testDisjunctionMaxQueryParser
   [junit4]   2> 9820 INFO  (TEST-SolrPluginUtilsTest.testDisjunctionMaxQueryParser-seed#[4499A23AA97C3A70]) [     ] o.a.s.SolrTestCaseJ4 ###Ending testDisjunctionMaxQueryParser
   [junit4] OK      0.08s J1 | SolrPluginUtilsTest.testDisjunctionMaxQueryParser
   [junit4]   2> 9827 INFO  (TEST-SolrPluginUtilsTest.testMinShouldMatchBadQueries-seed#[4499A23AA97C3A70]) [     ] o.a.s.SolrTestCaseJ4 ###Starting testMinShouldMatchBadQueries
   [junit4]   2> 9830 INFO  (TEST-SolrPluginUtilsTest.testMinShouldMatchBadQueries-seed#[4499A23AA97C3A70]) [     ] o.a.s.SolrTestCaseJ4 ###Ending testMinShouldMatchBadQueries
   [junit4]   2> NOTE: reproduce with: ant test  -Dtestcase=SolrPluginUtilsTest -Dtests.method=testMinShouldMatchBadQueries -Dtests.seed=4499A23AA97C3A70 -Dtests.multiplier=3 -Dtests.slow=true -Dtests.badapples=true -Dtests.locale=en-MH -Dtests.timezone=America/Swift_Current -Dtests.asserts=true -Dtests.file.encoding=US-ASCII
   [junit4] FAILURE 0.02s J1 | SolrPluginUtilsTest.testMinShouldMatchBadQueries <<<
   [junit4]    > Throwable #1: junit.framework.AssertionFailedError: Expected exception SolrException but no exception was thrown
   [junit4]    >        at __randomizedtesting.SeedInfo.seed([4499A23AA97C3A70:8A456290D744B57E]:0)
   [junit4]    >        at org.apache.lucene.util.LuceneTestCase.expectThrows(LuceneTestCase.java:2729)
   [junit4]    >        at org.apache.lucene.util.LuceneTestCase.expectThrows(LuceneTestCase.java:2719)
   [junit4]    >        at org.apache.solr.util.SolrPluginUtilsTest.testMinShouldMatchBadQueries(SolrPluginUtilsTest.java:344)
   [junit4]    >        at java.base/jdk.internal.reflect.NativeMethodAccessorImpl.invoke0(Native Method)
   [junit4]    >        at java.base/jdk.internal.reflect.NativeMethodAccessorImpl.invoke(NativeMethodAccessorImpl.java:62)
   [junit4]    >        at java.base/jdk.internal.reflect.DelegatingMethodAccessorImpl.invoke(DelegatingMethodAccessorImpl.java:43)
   [junit4]    >        at java.base/java.lang.reflect.Method.invoke(Method.java:567)
   [junit4]    >        at java.base/java.lang.Thread.run(Thread.java:835)
   [junit4]   2> 9880 INFO  (TEST-SolrPluginUtilsTest.testStripUnbalancedQuotes-seed#[4499A23AA97C3A70]) [     ] o.a.s.SolrTestCaseJ4 ###Starting testStripUnbalancedQuotes
   [junit4]   2> 9881 INFO  (TEST-SolrPluginUtilsTest.testStripUnbalancedQuotes-seed#[4499A23AA97C3A70]) [     ] o.a.s.SolrTestCaseJ4 ###Ending testStripUnbalancedQuotes
   [junit4] OK      0.05s J1 | SolrPluginUtilsTest.testStripUnbalancedQuotes
   [junit4]   2> 9882 INFO  (SUITE-SolrPluginUtilsTest-seed#[4499A23AA97C3A70]-worker) [     ] o.a.s.SolrTestCaseJ4 ###deleteCore
   [junit4]   2> 9882 INFO  (SUITE-SolrPluginUtilsTest-seed#[4499A23AA97C3A70]-worker) [     ] o.a.s.c.CoreContainer Shutting down CoreContainer instance=1526107656
   [junit4]   2> 9905 INFO  (coreCloseExecutor-15-thread-1) [    x:collection1 ] o.a.s.c.SolrCore [collection1]  CLOSING SolrCore org.apache.solr.core.SolrCore@4a333c35
   [junit4]   2> 9911 INFO  (coreCloseExecutor-15-thread-1) [    x:collection1 ] o.a.s.m.SolrMetricManager Closing metric reporters for registry=solr.core.collection1, tag=SolrCore@4a333c35
   [junit4]   2> 9912 INFO  (coreCloseExecutor-15-thread-1) [    x:collection1 ] o.a.s.m.r.SolrJmxReporter Closing reporter [org.apache.solr.metrics.reporters.SolrJmxReporter@7ca13c6c: rootName = null, domain = solr.core.collection1, service url = null, agent id = null] for registry solr.core.collection1 / com.codahale.metrics.MetricRegistry@60bbf28d
   [junit4]   2> 10063 INFO  (SUITE-SolrPluginUtilsTest-seed#[4499A23AA97C3A70]-worker) [     ] o.a.s.m.SolrMetricManager Closing metric reporters for registry=solr.node, tag=null
   [junit4]   2> 10064 INFO  (SUITE-SolrPluginUtilsTest-seed#[4499A23AA97C3A70]-worker) [     ] o.a.s.m.r.SolrJmxReporter Closing reporter [org.apache.solr.metrics.reporters.SolrJmxReporter@63918b65: rootName = null, domain = solr.node, service url = null, agent id = null] for registry solr.node / com.codahale.metrics.MetricRegistry@5388bf15
   [junit4]   2> 10081 INFO  (SUITE-SolrPluginUtilsTest-seed#[4499A23AA97C3A70]-worker) [     ] o.a.s.m.SolrMetricManager Closing metric reporters for registry=solr.jvm, tag=null
   [junit4]   2> 10082 INFO  (SUITE-SolrPluginUtilsTest-seed#[4499A23AA97C3A70]-worker) [     ] o.a.s.m.r.SolrJmxReporter Closing reporter [org.apache.solr.metrics.reporters.SolrJmxReporter@371bf740: rootName = null, domain = solr.jvm, service url = null, agent id = null] for registry solr.jvm / com.codahale.metrics.MetricRegistry@2a0bd8b5
   [junit4]   2> 10082 INFO  (SUITE-SolrPluginUtilsTest-seed#[4499A23AA97C3A70]-worker) [     ] o.a.s.m.SolrMetricManager Closing metric reporters for registry=solr.jetty, tag=null
   [junit4]   2> 10082 INFO  (SUITE-SolrPluginUtilsTest-seed#[4499A23AA97C3A70]-worker) [     ] o.a.s.m.r.SolrJmxReporter Closing reporter [org.apache.solr.metrics.reporters.SolrJmxReporter@42bd046: rootName = null, domain = solr.jetty, service url = null, agent id = null] for registry solr.jetty / com.codahale.metrics.MetricRegistry@1bcde693
   [junit4]   2> NOTE: leaving temporary files on disk at: /home/jenkins/workspace/Lucene-Solr-master-Linux/solr/build/solr-core/test/J1/temp/solr.util.SolrPluginUtilsTest_4499A23AA97C3A70-001
   [junit4]   2> NOTE: test params are: codec=HighCompressionCompressingStoredFields(storedFieldsFormat=CompressingStoredFieldsFormat(compressionMode=HIGH_COMPRESSION, chunkSize=1, maxDocsPerChunk=3, blockSize=555), termVectorsFormat=CompressingTermVectorsFormat(compressionMode=HIGH_COMPRESSION, chunkSize=1, blockSize=555)), sim=Asserting(org.apache.lucene.search.similarities.AssertingSimilarity@193484b7), locale=en-MH, timezone=America/Swift_Current
   [junit4]   2> NOTE: Linux 5.0.0-25-generic amd64/AdoptOpenJDK 12.0.1 (64-bit)/cpus=8,threads=2,free=357949744,total=518979584
   [junit4]   2> NOTE: All tests run in this JVM: [SolrPluginUtilsTest]
   [junit4] Completed [1/5 (1!)] on J1 in 9.38s, 9 tests, 1 failure <<< FAILURES!

[...truncated 1 lines...]
   [junit4] Suite: org.apache.solr.util.SolrPluginUtilsTest
   [junit4]   2> 3092 INFO  (SUITE-SolrPluginUtilsTest-seed#[4499A23AA97C3A70]-worker) [     ] o.a.s.SolrTestCaseJ4 SecureRandom sanity checks: test.solr.allowed.securerandom=null & java.security.egd=file:/dev/./urandom
   [junit4]   2> 3131 INFO  (SUITE-SolrPluginUtilsTest-seed#[4499A23AA97C3A70]-worker) [     ] o.a.s.SolrTestCaseJ4 Created dataDir: /home/jenkins/workspace/Lucene-Solr-master-Linux/solr/build/solr-core/test/J2/temp/solr.util.SolrPluginUtilsTest_4499A23AA97C3A70-001/data-dir-1-001
   [junit4]   2> 3217 INFO  (SUITE-SolrPluginUtilsTest-seed#[4499A23AA97C3A70]-worker) [     ] o.a.s.SolrTestCaseJ4 Using PointFields (NUMERIC_POINTS_SYSPROP=true) w/NUMERIC_DOCVALUES_SYSPROP=true
   [junit4]   2> 3285 INFO  (SUITE-SolrPluginUtilsTest-seed#[4499A23AA97C3A70]-worker) [     ] o.e.j.u.log Logging initialized @4582ms to org.eclipse.jetty.util.log.Slf4jLog
   [junit4]   2> 3291 INFO  (SUITE-SolrPluginUtilsTest-seed#[4499A23AA97C3A70]-worker) [     ] o.a.s.SolrTestCaseJ4 Randomized ssl (false) and clientAuth (false) via: @org.apache.solr.util.RandomizeSSL(reason="", value=0.0/0.0, ssl=0.0/0.0, clientAuth=0.0/0.0)
   [junit4]   2> 3312 INFO  (SUITE-SolrPluginUtilsTest-seed#[4499A23AA97C3A70]-worker) [     ] o.a.s.SolrTestCaseJ4 ####initCore
   [junit4]   2> 3413 INFO  (SUITE-SolrPluginUtilsTest-seed#[4499A23AA97C3A70]-worker) [     ] o.a.s.c.SolrResourceLoader Using system property solr.solr.home: /home/jenkins/workspace/Lucene-Solr-master-Linux/solr/core/src/test-files/solr
   [junit4]   2> 3415 INFO  (SUITE-SolrPluginUtilsTest-seed#[4499A23AA97C3A70]-worker) [     ] o.a.s.c.SolrResourceLoader [null] Added 2 libs to classloader, from paths: [/home/jenkins/workspace/Lucene-Solr-master-Linux/solr/core/src/test-files/solr/collection1/lib, /home/jenkins/workspace/Lucene-Solr-master-Linux/solr/core/src/test-files/solr/collection1/lib/classes]
   [junit4]   2> 4153 INFO  (SUITE-SolrPluginUtilsTest-seed#[4499A23AA97C3A70]-worker) [     ] o.a.s.c.SolrConfig Using Lucene MatchVersion: 9.0.0
   [junit4]   2> 4603 INFO  (SUITE-SolrPluginUtilsTest-seed#[4499A23AA97C3A70]-worker) [     ] o.a.s.s.IndexSchema [null] Schema name=test
   [junit4]   2> 4936 WARN  (SUITE-SolrPluginUtilsTest-seed#[4499A23AA97C3A70]-worker) [     ] o.a.s.c.SolrResourceLoader Solr loaded a deprecated plugin/analysis class [solr.WordDelimiterFilterFactory]. Please consult documentation how to replace it accordingly.
   [junit4]   2> 5064 WARN  (SUITE-SolrPluginUtilsTest-seed#[4499A23AA97C3A70]-worker) [     ] o.a.s.c.SolrResourceLoader Solr loaded a deprecated plugin/analysis class [solr.GeoHashField]. Please consult documentation how to replace it accordingly.
   [junit4]   2> 5069 WARN  (SUITE-SolrPluginUtilsTest-seed#[4499A23AA97C3A70]-worker) [     ] o.a.s.c.SolrResourceLoader Solr loaded a deprecated plugin/analysis class [solr.LatLonType]. Please consult documentation how to replace it accordingly.
   [junit4]   2> 5075 WARN  (SUITE-SolrPluginUtilsTest-seed#[4499A23AA97C3A70]-worker) [     ] o.a.s.c.SolrResourceLoader Solr loaded a deprecated plugin/analysis class [solr.CurrencyField]. Please consult documentation how to replace it accordingly.
   [junit4]   2> 5541 INFO  (SUITE-SolrPluginUtilsTest-seed#[4499A23AA97C3A70]-worker) [     ] o.a.s.s.IndexSchema Loaded schema test/1.0 with uniqueid field id
   [junit4]   2> 6468 WARN  (SUITE-SolrPluginUtilsTest-seed#[4499A23AA97C3A70]-worker) [     ] o.a.s.f.DistribPackageStore Unable to create [/home/jenkins/workspace/Lucene-Solr-master-Linux/solr/core/src/test-files/solr/filestore] directory in SOLR_HOME [/home/jenkins/workspace/Lucene-Solr-master-Linux/solr/core/src/test-files/solr].  Features requiring this directory may fail.
   [junit4]   2>           => java.security.AccessControlException: access denied ("java.io.FilePermission" "/home/jenkins/workspace/Lucene-Solr-master-Linux/solr/core/src/test-files/solr/filestore" "write")
   [junit4]   2>        at java.base/java.security.AccessControlContext.checkPermission(AccessControlContext.java:472)
   [junit4]   2> java.security.AccessControlException: access denied ("java.io.FilePermission" "/home/jenkins/workspace/Lucene-Solr-master-Linux/solr/core/src/test-files/solr/filestore" "write")
   [junit4]   2>        at java.security.AccessControlContext.checkPermission(AccessControlContext.java:472) ~[?:?]
   [junit4]   2>        at java.security.AccessController.checkPermission(AccessController.java:1042) ~[?:?]
   [junit4]   2>        at java.lang.SecurityManager.checkPermission(SecurityManager.java:408) ~[?:?]
   [junit4]   2>        at java.lang.SecurityManager.checkWrite(SecurityManager.java:838) ~[?:?]
   [junit4]   2>        at java.io.File.mkdir(File.java:1323) ~[?:?]
   [junit4]   2>        at java.io.File.mkdirs(File.java:1355) ~[?:?]
   [junit4]   2>        at org.apache.solr.filestore.DistribPackageStore.ensurePackageStoreDir(DistribPackageStore.java:465) ~[java/:?]
   [junit4]   2>        at org.apache.solr.filestore.DistribPackageStore.<init>(DistribPackageStore.java:65) ~[java/:?]
   [junit4]   2>        at org.apache.solr.filestore.PackageStoreAPI.<init>(PackageStoreAPI.java:77) ~[java/:?]
   [junit4]   2>        at org.apache.solr.core.CoreContainer.load(CoreContainer.java:618) ~[java/:?]
   [junit4]   2>        at org.apache.solr.util.TestHarness.<init>(TestHarness.java:180) ~[java/:?]
   [junit4]   2>        at org.apache.solr.util.TestHarness.<init>(TestHarness.java:143) ~[java/:?]
   [junit4]   2>        at org.apache.solr.util.TestHarness.<init>(TestHarness.java:149) ~[java/:?]
   [junit4]   2>        at org.apache.solr.util.TestHarness.<init>(TestHarness.java:112) ~[java/:?]
   [junit4]   2>        at org.apache.solr.SolrTestCaseJ4.createCore(SolrTestCaseJ4.java:797) ~[java/:?]
   [junit4]   2>        at org.apache.solr.SolrTestCaseJ4.initCore(SolrTestCaseJ4.java:787) ~[java/:?]
   [junit4]   2>        at org.apache.solr.SolrTestCaseJ4.initCore(SolrTestCaseJ4.java:648) ~[java/:?]
   [junit4]   2>        at org.apache.solr.SolrTestCaseJ4.initCore(SolrTestCaseJ4.java:637) ~[java/:?]
   [junit4]   2>        at org.apache.solr.util.SolrPluginUtilsTest.beforeClass(SolrPluginUtilsTest.java:50) ~[test/:?]
   [junit4]   2>        at jdk.internal.reflect.NativeMethodAccessorImpl.invoke0(Native Method) ~[?:?]
   [junit4]   2>        at jdk.internal.reflect.NativeMethodAccessorImpl.invoke(NativeMethodAccessorImpl.java:62) ~[?:?]
   [junit4]   2>        at jdk.internal.reflect.DelegatingMethodAccessorImpl.invoke(DelegatingMethodAccessorImpl.java:43) ~[?:?]
   [junit4]   2>        at java.lang.reflect.Method.invoke(Method.java:567) ~[?:?]
   [junit4]   2>        at com.carrotsearch.randomizedtesting.RandomizedRunner.invoke(RandomizedRunner.java:1750) ~[randomizedtesting-runner-2.7.2.jar:?]
   [junit4]   2>        at com.carrotsearch.randomizedtesting.RandomizedRunner$6.evaluate(RandomizedRunner.java:878) ~[randomizedtesting-runner-2.7.2.jar:?]
   [junit4]   2>        at com.carrotsearch.randomizedtesting.RandomizedRunner$7.evaluate(RandomizedRunner.java:894) ~[randomizedtesting-runner-2.7.2.jar:?]
   [junit4]   2>        at com.carrotsearch.randomizedtesting.rules.StatementAdapter.evaluate(StatementAdapter.java:36) ~[randomizedtesting-runner-2.7.2.jar:?]
   [junit4]   2>        at com.carrotsearch.randomizedtesting.rules.SystemPropertiesRestoreRule$1.evaluate(SystemPropertiesRestoreRule.java:57) ~[randomizedtesting-runner-2.7.2.jar:?]
   [junit4]   2>        at org.apache.lucene.util.AbstractBeforeAfterRule$1.evaluate(AbstractBeforeAfterRule.java:45) ~[java/:?]
   [junit4]   2>        at com.carrotsearch.randomizedtesting.rules.StatementAdapter.evaluate(StatementAdapter.java:36) ~[randomizedtesting-runner-2.7.2.jar:?]
   [junit4]   2>        at org.apache.lucene.util.TestRuleStoreClassName$1.evaluate(TestRuleStoreClassName.java:41) ~[java/:?]
   [junit4]   2>        at com.carrotsearch.randomizedtesting.rules.NoShadowingOrOverridesOnMethodsRule$1.evaluate(NoShadowingOrOverridesOnMethodsRule.java:40) ~[randomizedtesting-runner-2.7.2.jar:?]
   [junit4]   2>        at com.carrotsearch.randomizedtesting.rules.NoShadowingOrOverridesOnMethodsRule$1.evaluate(NoShadowingOrOverridesOnMethodsRule.java:40) ~[randomizedtesting-runner-2.7.2.jar:?]
   [junit4]   2>        at com.carrotsearch.randomizedtesting.rules.StatementAdapter.evaluate(StatementAdapter.java:36) ~[randomizedtesting-runner-2.7.2.jar:?]
   [junit4]   2>        at com.carrotsearch.randomizedtesting.rules.StatementAdapter.evaluate(StatementAdapter.java:36) ~[randomizedtesting-runner-2.7.2.jar:?]
   [junit4]   2>        at org.apache.lucene.util.TestRuleAssertionsRequired$1.evaluate(TestRuleAssertionsRequired.java:53) ~[java/:?]
   [junit4]   2>        at org.apache.lucene.util.TestRuleMarkFailure$1.evaluate(TestRuleMarkFailure.java:47) ~[java/:?]
   [junit4]   2>        at org.apache.lucene.util.TestRuleIgnoreAfterMaxFailures$1.evaluate(TestRuleIgnoreAfterMaxFailures.java:64) ~[java/:?]
   [junit4]   2>        at org.apache.lucene.util.TestRuleIgnoreTestSuites$1.evaluate(TestRuleIgnoreTestSuites.java:54) ~[java/:?]
   [junit4]   2>        at com.carrotsearch.randomizedtesting.rules.StatementAdapter.evaluate(StatementAdapter.java:36) ~[randomizedtesting-runner-2.7.2.jar:?]
   [junit4]   2>        at com.carrotsearch.randomizedtesting.ThreadLeakControl$StatementRunner.run(ThreadLeakControl.java:368) ~[randomizedtesting-runner-2.7.2.jar:?]
   [junit4]   2>        at java.lang.Thread.run(Thread.java:835) [?:?]
   [junit4]   2> 6700 INFO  (SUITE-SolrPluginUtilsTest-seed#[4499A23AA97C3A70]-worker) [     ] o.a.s.h.c.HttpShardHandlerFactory Host whitelist initialized: WhitelistHostChecker [whitelistHosts=null, whitelistHostCheckingEnabled=true]
   [junit4]   2> 6966 WARN  (SUITE-SolrPluginUtilsTest-seed#[4499A23AA97C3A70]-worker) [     ] o.e.j.u.s.S.config Trusting all certificates configured for Client@5db42cb5[provider=null,keyStore=null,trustStore=null]
   [junit4]   2> 6966 WARN  (SUITE-SolrPluginUtilsTest-seed#[4499A23AA97C3A70]-worker) [     ] o.e.j.u.s.S.config No Client EndPointIdentificationAlgorithm configured for Client@5db42cb5[provider=null,keyStore=null,trustStore=null]
   [junit4]   2> 7196 WARN  (SUITE-SolrPluginUtilsTest-seed#[4499A23AA97C3A70]-worker) [     ] o.e.j.u.s.S.config Trusting all certificates configured for Client@69a7638b[provider=null,keyStore=null,trustStore=null]
   [junit4]   2> 7196 WARN  (SUITE-SolrPluginUtilsTest-seed#[4499A23AA97C3A70]-worker) [     ] o.e.j.u.s.S.config No Client EndPointIdentificationAlgorithm configured for Client@69a7638b[provider=null,keyStore=null,trustStore=null]
   [junit4]   2> 7546 INFO  (SUITE-SolrPluginUtilsTest-seed#[4499A23AA97C3A70]-worker) [     ] o.a.s.c.TransientSolrCoreCacheDefault Allocating transient cache for 2147483647 transient cores
   [junit4]   2> 7548 INFO  (SUITE-SolrPluginUtilsTest-seed#[4499A23AA97C3A70]-worker) [     ] o.a.s.h.a.MetricsHistoryHandler No .system collection, keeping metrics history in memory.
   [junit4]   2> 7704 INFO  (SUITE-SolrPluginUtilsTest-seed#[4499A23AA97C3A70]-worker) [     ] o.a.s.m.r.SolrJmxReporter JMX monitoring for 'solr.node' (registry 'solr.node') enabled at server: com.sun.jmx.mbeanserver.JmxMBeanServer@377939f5
   [junit4]   2> 7706 INFO  (SUITE-SolrPluginUtilsTest-seed#[4499A23AA97C3A70]-worker) [     ] o.a.s.m.r.SolrJmxReporter JMX monitoring for 'solr.jvm' (registry 'solr.jvm') enabled at server: com.sun.jmx.mbeanserver.JmxMBeanServer@377939f5
   [junit4]   2> 7707 INFO  (SUITE-SolrPluginUtilsTest-seed#[4499A23AA97C3A70]-worker) [     ] o.a.s.m.r.SolrJmxReporter JMX monitoring for 'solr.jetty' (registry 'solr.jetty') enabled at server: com.sun.jmx.mbeanserver.JmxMBeanServer@377939f5
   [junit4]   2> 7841 INFO  (coreLoadExecutor-9-thread-1) [    x:collection1 ] o.a.s.c.SolrResourceLoader [null] Added 2 libs to classloader, from paths: [/home/jenkins/workspace/Lucene-Solr-master-Linux/solr/core/src/test-files/solr/collection1/lib, /home/jenkins/workspace/Lucene-Solr-master-Linux/solr/core/src/test-files/solr/collection1/lib/classes]
   [junit4]   2> 7900 INFO  (coreLoadExecutor-9-thread-1) [    x:collection1 ] o.a.s.c.SolrConfig Using Lucene MatchVersion: 9.0.0
   [junit4]   2> 8028 INFO  (coreLoadExecutor-9-thread-1) [    x:collection1 ] o.a.s.s.IndexSchema [collection1] Schema name=test
   [junit4]   2> 8340 INFO  (coreLoadExecutor-9-thread-1) [    x:collection1 ] o.a.s.s.IndexSchema Loaded schema test/1.0 with uniqueid field id
   [junit4]   2> 8403 INFO  (coreLoadExecutor-9-thread-1) [    x:collection1 ] o.a.s.c.CoreContainer Creating SolrCore 'collection1' using configuration from instancedir /home/jenkins/workspace/Lucene-Solr-master-Linux/solr/core/src/test-files/solr/collection1, trusted=true
   [junit4]   2> 8442 INFO  (coreLoadExecutor-9-thread-1) [    x:collection1 ] o.a.s.m.r.SolrJmxReporter JMX monitoring for 'solr.core.collection1' (registry 'solr.core.collection1') enabled at server: com.sun.jmx.mbeanserver.JmxMBeanServer@377939f5
   [junit4]   2> 8458 INFO  (coreLoadExecutor-9-thread-1) [    x:collection1 ] o.a.s.c.SolrCore [[collection1] ] Opening new SolrCore at [/home/jenkins/workspace/Lucene-Solr-master-Linux/solr/core/src/test-files/solr/collection1], dataDir=[/home/jenkins/workspace/Lucene-Solr-master-Linux/solr/build/solr-core/test/J2/temp/solr.util.SolrPluginUtilsTest_4499A23AA97C3A70-001/data-dir-1-001/]
   [junit4]   2> 8508 INFO  (coreLoadExecutor-9-thread-1) [    x:collection1 ] o.a.s.u.RandomMergePolicy RandomMergePolicy wrapping class org.apache.lucene.index.LogDocMergePolicy: [LogDocMergePolicy: minMergeSize=1000, mergeFactor=32, maxMergeSize=9223372036854775807, maxMergeSizeForForcedMerge=9223372036854775807, calibrateSizeByDeletes=true, maxMergeDocs=2147483647, maxCFSSegmentSizeMB=8.796093022207999E12, noCFSRatio=1.0]
   [junit4]   2> 9101 INFO  (coreLoadExecutor-9-thread-1) [    x:collection1 ] o.a.s.u.UpdateHandler Using UpdateLog implementation: org.apache.solr.update.UpdateLog
   [junit4]   2> 9101 INFO  (coreLoadExecutor-9-thread-1) [    x:collection1 ] o.a.s.u.UpdateLog Initializing UpdateLog: dataDir= defaultSyncLevel=FLUSH numRecordsToKeep=100 maxNumLogsToKeep=10 numVersionBuckets=65536
   [junit4]   2> 9115 INFO  (coreLoadExecutor-9-thread-1) [    x:collection1 ] o.a.s.u.CommitTracker Hard AutoCommit: disabled
   [junit4]   2> 9115 INFO  (coreLoadExecutor-9-thread-1) [    x:collection1 ] o.a.s.u.CommitTracker Soft AutoCommit: disabled
   [junit4]   2> 9118 INFO  (coreLoadExecutor-9-thread-1) [    x:collection1 ] o.a.s.u.RandomMergePolicy RandomMergePolicy wrapping class org.apache.lucene.index.LogDocMergePolicy: [LogDocMergePolicy: minMergeSize=1000, mergeFactor=16, maxMergeSize=9223372036854775807, maxMergeSizeForForcedMerge=9223372036854775807, calibrateSizeByDeletes=false, maxMergeDocs=2147483647, maxCFSSegmentSizeMB=8.796093022207999E12, noCFSRatio=0.26538797745064135]
   [junit4]   2> 9131 INFO  (coreLoadExecutor-9-thread-1) [    x:collection1 ] o.a.s.s.SolrIndexSearcher Opening [Searcher@2c7b4fcd[collection1] main]
   [junit4]   2> 9195 INFO  (coreLoadExecutor-9-thread-1) [    x:collection1 ] o.a.s.h.c.SpellCheckComponent Initializing spell checkers
   [junit4]   2> 9390 INFO  (coreLoadExecutor-9-thread-1) [    x:collection1 ] o.a.s.s.DirectSolrSpellChecker init: {name=direct, classname=DirectSolrSpellChecker, field=lowerfilt, minQueryLength=3}
   [junit4]   2> 9524 INFO  (coreLoadExecutor-9-thread-1) [    x:collection1 ] o.a.s.h.ReplicationHandler Commits will be reserved for 10000ms.
   [junit4]   2> 9538 INFO  (coreLoadExecutor-9-thread-1) [    x:collection1 ] o.a.s.u.UpdateLog Could not find max version in index or recent updates, using new clock 1649034578933841920
   [junit4]   2> 9545 INFO  (searcherExecutor-10-thread-1-processing-x:collection1) [    x:collection1 ] o.a.s.h.c.SpellCheckComponent Loading spell index for spellchecker: default
   [junit4]   2> 9549 INFO  (searcherExecutor-10-thread-1-processing-x:collection1) [    x:collection1 ] o.a.s.h.c.SpellCheckComponent Loading spell index for spellchecker: direct
   [junit4]   2> 9550 INFO  (searcherExecutor-10-thread-1-processing-x:collection1) [    x:collection1 ] o.a.s.h.c.SpellCheckComponent Loading spell index for spellchecker: wordbreak
   [junit4]   2> 9550 INFO  (searcherExecutor-10-thread-1-processing-x:collection1) [    x:collection1 ] o.a.s.h.c.SpellCheckComponent Loading spell index for spellchecker: multipleFields
   [junit4]   2> 9557 INFO  (searcherExecutor-10-thread-1-processing-x:collection1) [    x:collection1 ] o.a.s.h.c.SpellCheckComponent Loading spell index for spellchecker: jarowinkler
   [junit4]   2> 9562 INFO  (searcherExecutor-10-thread-1-processing-x:collection1) [    x:collection1 ] o.a.s.h.c.SpellCheckComponent Loading spell index for spellchecker: external
   [junit4]   2> 9584 INFO  (searcherExecutor-10-thread-1-processing-x:collection1) [    x:collection1 ] o.a.s.h.c.SpellCheckComponent Loading spell index for spellchecker: freq
   [junit4]   2> 9586 INFO  (searcherExecutor-10-thread-1-processing-x:collection1) [    x:collection1 ] o.a.s.h.c.SpellCheckComponent Loading spell index for spellchecker: fqcn
   [junit4]   2> 9588 INFO  (searcherExecutor-10-thread-1-processing-x:collection1) [    x:collection1 ] o.a.s.h.c.SpellCheckComponent Loading spell index for spellchecker: perDict
   [junit4]   2> 9593 INFO  (SUITE-SolrPluginUtilsTest-seed#[4499A23AA97C3A70]-worker) [     ] o.a.s.SolrTestCaseJ4 ####initCore end
   [junit4]   2> 9603 INFO  (searcherExecutor-10-thread-1-processing-x:collection1) [    x:collection1 ] o.a.s.c.SolrCore [collection1] Registered new searcher Searcher@2c7b4fcd[collection1] main{ExitableDirectoryReader(UninvertingDirectoryReader())}
   [j

[...truncated too long message...]

eFieldBoosts
   [junit4]   2> 12141 INFO  (TEST-SolrPluginUtilsTest.testMinShouldMatchCalculator-seed#[4499A23AA97C3A70]) [     ] o.a.s.SolrTestCaseJ4 ###Starting testMinShouldMatchCalculator
   [junit4] OK      0.03s J2 | SolrPluginUtilsTest.testMinShouldMatchCalculator
   [junit4] OK      0.00s J2 | SolrPluginUtilsTest.testPartialEscape
   [junit4] OK      0.01s J2 | SolrPluginUtilsTest.testMinShouldMatchAutoRelax
   [junit4]   2> 12141 INFO  (TEST-SolrPluginUtilsTest.testMinShouldMatchCalculator-seed#[4499A23AA97C3A70]) [     ] o.a.s.SolrTestCaseJ4 ###Ending testMinShouldMatchCalculator
   [junit4]   2> 12146 INFO  (TEST-SolrPluginUtilsTest.testPartialEscape-seed#[4499A23AA97C3A70]) [     ] o.a.s.SolrTestCaseJ4 ###Starting testPartialEscape
   [junit4]   2> 12146 INFO  (TEST-SolrPluginUtilsTest.testPartialEscape-seed#[4499A23AA97C3A70]) [     ] o.a.s.SolrTestCaseJ4 ###Ending testPartialEscape
   [junit4]   2> 12157 INFO  (TEST-SolrPluginUtilsTest.testMinShouldMatchAutoRelax-seed#[4499A23AA97C3A70]) [     ] o.a.s.SolrTestCaseJ4 ###Starting testMinShouldMatchAutoRelax
   [junit4]   2> 12158 INFO  (TEST-SolrPluginUtilsTest.testMinShouldMatchAutoRelax-seed#[4499A23AA97C3A70]) [     ] o.a.s.SolrTestCaseJ4 ###Ending testMinShouldMatchAutoRelax
   [junit4]   2> 12170 INFO  (TEST-SolrPluginUtilsTest.testStripIllegalOperators-seed#[4499A23AA97C3A70]) [     ] o.a.s.SolrTestCaseJ4 ###Starting testStripIllegalOperators
   [junit4]   2> 12170 INFO  (TEST-SolrPluginUtilsTest.testStripIllegalOperators-seed#[4499A23AA97C3A70]) [     ] o.a.s.SolrTestCaseJ4 ###Ending testStripIllegalOperators
   [junit4] OK      0.01s J2 | SolrPluginUtilsTest.testStripIllegalOperators
   [junit4]   2> 12176 INFO  (TEST-SolrPluginUtilsTest.testDisjunctionMaxQueryParser-seed#[4499A23AA97C3A70]) [     ] o.a.s.SolrTestCaseJ4 ###Starting testDisjunctionMaxQueryParser
   [junit4]   2> 12179 INFO  (TEST-SolrPluginUtilsTest.testDisjunctionMaxQueryParser-seed#[4499A23AA97C3A70]) [     ] o.a.s.SolrTestCaseJ4 ###Ending testDisjunctionMaxQueryParser
   [junit4] OK      0.01s J2 | SolrPluginUtilsTest.testDisjunctionMaxQueryParser
   [junit4]   2> 12185 INFO  (TEST-SolrPluginUtilsTest.testMinShouldMatchBadQueries-seed#[4499A23AA97C3A70]) [     ] o.a.s.SolrTestCaseJ4 ###Starting testMinShouldMatchBadQueries
   [junit4]   2> 12186 INFO  (TEST-SolrPluginUtilsTest.testMinShouldMatchBadQueries-seed#[4499A23AA97C3A70]) [     ] o.a.s.SolrTestCaseJ4 ###Ending testMinShouldMatchBadQueries
   [junit4]   2> NOTE: reproduce with: ant test  -Dtestcase=SolrPluginUtilsTest -Dtests.method=testMinShouldMatchBadQueries -Dtests.seed=4499A23AA97C3A70 -Dtests.multiplier=3 -Dtests.slow=true -Dtests.badapples=true -Dtests.locale=en-MH -Dtests.timezone=America/Swift_Current -Dtests.asserts=true -Dtests.file.encoding=US-ASCII
   [junit4] FAILURE 0.01s J2 | SolrPluginUtilsTest.testMinShouldMatchBadQueries <<<
   [junit4]    > Throwable #1: junit.framework.AssertionFailedError: Expected exception SolrException but no exception was thrown
   [junit4]    >        at __randomizedtesting.SeedInfo.seed([4499A23AA97C3A70:8A456290D744B57E]:0)
   [junit4]    >        at org.apache.lucene.util.LuceneTestCase.expectThrows(LuceneTestCase.java:2729)
   [junit4]    >        at org.apache.lucene.util.LuceneTestCase.expectThrows(LuceneTestCase.java:2719)
   [junit4]    >        at org.apache.solr.util.SolrPluginUtilsTest.testMinShouldMatchBadQueries(SolrPluginUtilsTest.java:344)
   [junit4]    >        at java.base/jdk.internal.reflect.NativeMethodAccessorImpl.invoke0(Native Method)
   [junit4]    >        at java.base/jdk.internal.reflect.NativeMethodAccessorImpl.invoke(NativeMethodAccessorImpl.java:62)
   [junit4]    >        at java.base/jdk.internal.reflect.DelegatingMethodAccessorImpl.invoke(DelegatingMethodAccessorImpl.java:43)
   [junit4]    >        at java.base/java.lang.reflect.Method.invoke(Method.java:567)
   [junit4]    >        at java.base/java.lang.Thread.run(Thread.java:835)
   [junit4]   2> 12191 INFO  (TEST-SolrPluginUtilsTest.testStripUnbalancedQuotes-seed#[4499A23AA97C3A70]) [     ] o.a.s.SolrTestCaseJ4 ###Starting testStripUnbalancedQuotes
   [junit4]   2> 12192 INFO  (TEST-SolrPluginUtilsTest.testStripUnbalancedQuotes-seed#[4499A23AA97C3A70]) [     ] o.a.s.SolrTestCaseJ4 ###Ending testStripUnbalancedQuotes
   [junit4] OK      0.01s J2 | SolrPluginUtilsTest.testStripUnbalancedQuotes
   [junit4]   2> 12193 INFO  (SUITE-SolrPluginUtilsTest-seed#[4499A23AA97C3A70]-worker) [     ] o.a.s.SolrTestCaseJ4 ###deleteCore
   [junit4]   2> 12193 INFO  (SUITE-SolrPluginUtilsTest-seed#[4499A23AA97C3A70]-worker) [     ] o.a.s.c.CoreContainer Shutting down CoreContainer instance=1998229894
   [junit4]   2> 12193 INFO  (coreCloseExecutor-31-thread-1) [    x:collection1 ] o.a.s.c.SolrCore [collection1]  CLOSING SolrCore org.apache.solr.core.SolrCore@3437a38b
   [junit4]   2> 12193 INFO  (coreCloseExecutor-31-thread-1) [    x:collection1 ] o.a.s.m.SolrMetricManager Closing metric reporters for registry=solr.core.collection1, tag=SolrCore@3437a38b
   [junit4]   2> 12193 INFO  (coreCloseExecutor-31-thread-1) [    x:collection1 ] o.a.s.m.r.SolrJmxReporter Closing reporter [org.apache.solr.metrics.reporters.SolrJmxReporter@3479c691: rootName = null, domain = solr.core.collection1, service url = null, agent id = null] for registry solr.core.collection1 / com.codahale.metrics.MetricRegistry@5c38518c
   [junit4]   2> 12239 INFO  (SUITE-SolrPluginUtilsTest-seed#[4499A23AA97C3A70]-worker) [     ] o.a.s.m.SolrMetricManager Closing metric reporters for registry=solr.node, tag=null
   [junit4]   2> 12240 INFO  (SUITE-SolrPluginUtilsTest-seed#[4499A23AA97C3A70]-worker) [     ] o.a.s.m.r.SolrJmxReporter Closing reporter [org.apache.solr.metrics.reporters.SolrJmxReporter@39d06b0e: rootName = null, domain = solr.node, service url = null, agent id = null] for registry solr.node / com.codahale.metrics.MetricRegistry@73b84d69
   [junit4]   2> 12246 INFO  (SUITE-SolrPluginUtilsTest-seed#[4499A23AA97C3A70]-worker) [     ] o.a.s.m.SolrMetricManager Closing metric reporters for registry=solr.jvm, tag=null
   [junit4]   2> 12246 INFO  (SUITE-SolrPluginUtilsTest-seed#[4499A23AA97C3A70]-worker) [     ] o.a.s.m.r.SolrJmxReporter Closing reporter [org.apache.solr.metrics.reporters.SolrJmxReporter@516003fb: rootName = null, domain = solr.jvm, service url = null, agent id = null] for registry solr.jvm / com.codahale.metrics.MetricRegistry@3911ecd8
   [junit4]   2> 12246 INFO  (SUITE-SolrPluginUtilsTest-seed#[4499A23AA97C3A70]-worker) [     ] o.a.s.m.SolrMetricManager Closing metric reporters for registry=solr.jetty, tag=null
   [junit4]   2> 12246 INFO  (SUITE-SolrPluginUtilsTest-seed#[4499A23AA97C3A70]-worker) [     ] o.a.s.m.r.SolrJmxReporter Closing reporter [org.apache.solr.metrics.reporters.SolrJmxReporter@447de09f: rootName = null, domain = solr.jetty, service url = null, agent id = null] for registry solr.jetty / com.codahale.metrics.MetricRegistry@43a1c991
   [junit4]   2> NOTE: leaving temporary files on disk at: /home/jenkins/workspace/Lucene-Solr-master-Linux/solr/build/solr-core/test/J2/temp/solr.util.SolrPluginUtilsTest_4499A23AA97C3A70-002
   [junit4]   2> NOTE: test params are: codec=HighCompressionCompressingStoredFields(storedFieldsFormat=CompressingStoredFieldsFormat(compressionMode=HIGH_COMPRESSION, chunkSize=1, maxDocsPerChunk=3, blockSize=555), termVectorsFormat=CompressingTermVectorsFormat(compressionMode=HIGH_COMPRESSION, chunkSize=1, blockSize=555)), sim=Asserting(org.apache.lucene.search.similarities.AssertingSimilarity@7871912f), locale=en-MH, timezone=America/Swift_Current
   [junit4]   2> NOTE: Linux 5.0.0-25-generic amd64/AdoptOpenJDK 12.0.1 (64-bit)/cpus=8,threads=1,free=363142008,total=518979584
   [junit4]   2> NOTE: All tests run in this JVM: [SolrPluginUtilsTest, SolrPluginUtilsTest]
   [junit4] Completed [5/5 (5!)] on J2 in 1.81s, 9 tests, 1 failure <<< FAILURES!

[...truncated 15 lines...]
BUILD FAILED
/home/jenkins/workspace/Lucene-Solr-master-Linux/lucene/common-build.xml:1510: The following error occurred while executing this line:
/home/jenkins/workspace/Lucene-Solr-master-Linux/lucene/common-build.xml:1037: There were test failures: 5 suites, 45 tests, 5 failures [seed: 4499A23AA97C3A70]

Total time: 16 seconds

[repro] Setting last failure code to 256

[repro] Failures:
[repro]   5/5 failed: org.apache.solr.util.SolrPluginUtilsTest
[repro] Exiting with code 256
+ mv lucene/build lucene/build.repro
+ mv solr/build solr/build.repro
+ mv lucene/build.orig lucene/build
+ mv solr/build.orig solr/build
Archiving artifacts
Setting ANT_1_8_2_HOME=/home/jenkins/tools/hudson.tasks.Ant_AntInstallation/ANT_1.8.2
[WARNINGS] Parsing warnings in console log with parser Java Compiler (javac)
Setting ANT_1_8_2_HOME=/home/jenkins/tools/hudson.tasks.Ant_AntInstallation/ANT_1.8.2
No credentials specified
Setting ANT_1_8_2_HOME=/home/jenkins/tools/hudson.tasks.Ant_AntInstallation/ANT_1.8.2
<Git Blamer> Using GitBlamer to create author and commit information for all warnings.
<Git Blamer> GIT_COMMIT=b17d630e509adc9e62b07c599583558e715a869f, workspace=/home/jenkins/workspace/Lucene-Solr-master-Linux
[WARNINGS] Computing warning deltas based on reference build #24967
Recording test results
Setting ANT_1_8_2_HOME=/home/jenkins/tools/hudson.tasks.Ant_AntInstallation/ANT_1.8.2
Build step 'Publish JUnit test result report' changed build result to UNSTABLE
Email was triggered for: Unstable (Test Failures)
Sending email for trigger: Unstable (Test Failures)
Setting ANT_1_8_2_HOME=/home/jenkins/tools/hudson.tasks.Ant_AntInstallation/ANT_1.8.2
Setting ANT_1_8_2_HOME=/home/jenkins/tools/hudson.tasks.Ant_AntInstallation/ANT_1.8.2
Setting ANT_1_8_2_HOME=/home/jenkins/tools/hudson.tasks.Ant_AntInstallation/ANT_1.8.2
Setting ANT_1_8_2_HOME=/home/jenkins/tools/hudson.tasks.Ant_AntInstallation/ANT_1.8.2
Setting ANT_1_8_2_HOME=/home/jenkins/tools/hudson.tasks.Ant_AntInstallation/ANT_1.8.2
Setting ANT_1_8_2_HOME=/home/jenkins/tools/hudson.tasks.Ant_AntInstallation/ANT_1.8.2

---------------------------------------------------------------------
To unsubscribe, e-mail: [hidden email]
For additional commands, e-mail: [hidden email]