Re: [JENKINS] Lucene-Solr-master-MacOSX (64bit/jdk-13.0.1) - Build # 5514 - Unstable!

classic Classic list List threaded Threaded
1 message Options
Reply | Threaded
Open this post in threaded view
|

Re: [JENKINS] Lucene-Solr-master-MacOSX (64bit/jdk-13.0.1) - Build # 5514 - Unstable!

Dawid Weiss-2
This reproduces. Hits wrong exception type?

ant test  -Dtestcase=TestFuzzyQuery -Dtests.method=testErrorMessage
-Dtests.seed=CE3DF037C6D29401 -Dtests.slow=true -Dtests.locale=fr-GN
-Dtests.timezone=US/Pacific-New -Dtests.asserts=true
-Dtests.file.encoding=ISO-8859-1

On Fri, Jan 3, 2020 at 1:54 AM Policeman Jenkins Server
<[hidden email]> wrote:

>
> Build: https://jenkins.thetaphi.de/job/Lucene-Solr-master-MacOSX/5514/
> Java: 64bit/jdk-13.0.1 -XX:-UseCompressedOops -XX:+UseParallelGC
>
> 6 tests failed.
> FAILED:  org.apache.lucene.search.TestFuzzyQuery.testErrorMessage
>
> Error Message:
> Unexpected exception type, expected FuzzyTermsException but got java.lang.UnsupportedOperationException
>
> Stack Trace:
> junit.framework.AssertionFailedError: Unexpected exception type, expected FuzzyTermsException but got java.lang.UnsupportedOperationException
>         at __randomizedtesting.SeedInfo.seed([CE3DF037C6D29401:1836CAB94FFCBD4F]:0)
>         at org.apache.lucene.util.LuceneTestCase.expectThrows(LuceneTestCase.java:2753)
>         at org.apache.lucene.util.LuceneTestCase.expectThrows(LuceneTestCase.java:2741)
>         at org.apache.lucene.search.TestFuzzyQuery.testErrorMessage(TestFuzzyQuery.java:507)
>         at java.base/jdk.internal.reflect.NativeMethodAccessorImpl.invoke0(Native Method)
>         at java.base/jdk.internal.reflect.NativeMethodAccessorImpl.invoke(NativeMethodAccessorImpl.java:62)
>         at java.base/jdk.internal.reflect.DelegatingMethodAccessorImpl.invoke(DelegatingMethodAccessorImpl.java:43)
>         at java.base/java.lang.reflect.Method.invoke(Method.java:567)
>         at com.carrotsearch.randomizedtesting.RandomizedRunner.invoke(RandomizedRunner.java:1754)
>         at com.carrotsearch.randomizedtesting.RandomizedRunner$8.evaluate(RandomizedRunner.java:942)
>         at com.carrotsearch.randomizedtesting.RandomizedRunner$9.evaluate(RandomizedRunner.java:978)
>         at com.carrotsearch.randomizedtesting.RandomizedRunner$10.evaluate(RandomizedRunner.java:992)
>         at org.apache.lucene.util.TestRuleSetupTeardownChained$1.evaluate(TestRuleSetupTeardownChained.java:49)
>         at org.apache.lucene.util.AbstractBeforeAfterRule$1.evaluate(AbstractBeforeAfterRule.java:45)
>         at org.apache.lucene.util.TestRuleThreadAndTestName$1.evaluate(TestRuleThreadAndTestName.java:48)
>         at org.apache.lucene.util.TestRuleIgnoreAfterMaxFailures$1.evaluate(TestRuleIgnoreAfterMaxFailures.java:64)
>         at org.apache.lucene.util.TestRuleMarkFailure$1.evaluate(TestRuleMarkFailure.java:47)
>         at com.carrotsearch.randomizedtesting.rules.StatementAdapter.evaluate(StatementAdapter.java:36)
>         at com.carrotsearch.randomizedtesting.ThreadLeakControl$StatementRunner.run(ThreadLeakControl.java:370)
>         at com.carrotsearch.randomizedtesting.ThreadLeakControl.forkTimeoutingTask(ThreadLeakControl.java:819)
>         at com.carrotsearch.randomizedtesting.ThreadLeakControl$3.evaluate(ThreadLeakControl.java:470)
>         at com.carrotsearch.randomizedtesting.RandomizedRunner.runSingleTest(RandomizedRunner.java:951)
>         at com.carrotsearch.randomizedtesting.RandomizedRunner$5.evaluate(RandomizedRunner.java:836)
>         at com.carrotsearch.randomizedtesting.RandomizedRunner$6.evaluate(RandomizedRunner.java:887)
>         at com.carrotsearch.randomizedtesting.RandomizedRunner$7.evaluate(RandomizedRunner.java:898)
>         at org.apache.lucene.util.AbstractBeforeAfterRule$1.evaluate(AbstractBeforeAfterRule.java:45)
>         at com.carrotsearch.randomizedtesting.rules.StatementAdapter.evaluate(StatementAdapter.java:36)
>         at org.apache.lucene.util.TestRuleStoreClassName$1.evaluate(TestRuleStoreClassName.java:41)
>         at com.carrotsearch.randomizedtesting.rules.NoShadowingOrOverridesOnMethodsRule$1.evaluate(NoShadowingOrOverridesOnMethodsRule.java:40)
>         at com.carrotsearch.randomizedtesting.rules.NoShadowingOrOverridesOnMethodsRule$1.evaluate(NoShadowingOrOverridesOnMethodsRule.java:40)
>         at com.carrotsearch.randomizedtesting.rules.StatementAdapter.evaluate(StatementAdapter.java:36)
>         at com.carrotsearch.randomizedtesting.rules.StatementAdapter.evaluate(StatementAdapter.java:36)
>         at org.apache.lucene.util.TestRuleAssertionsRequired$1.evaluate(TestRuleAssertionsRequired.java:53)
>         at org.apache.lucene.util.TestRuleMarkFailure$1.evaluate(TestRuleMarkFailure.java:47)
>         at org.apache.lucene.util.TestRuleIgnoreAfterMaxFailures$1.evaluate(TestRuleIgnoreAfterMaxFailures.java:64)
>         at org.apache.lucene.util.TestRuleIgnoreTestSuites$1.evaluate(TestRuleIgnoreTestSuites.java:54)
>         at com.carrotsearch.randomizedtesting.rules.StatementAdapter.evaluate(StatementAdapter.java:36)
>         at com.carrotsearch.randomizedtesting.ThreadLeakControl$StatementRunner.run(ThreadLeakControl.java:370)
>         at com.carrotsearch.randomizedtesting.ThreadLeakControl.lambda$forkTimeoutingTask$0(ThreadLeakControl.java:826)
>         at java.base/java.lang.Thread.run(Thread.java:830)
> Caused by: java.lang.UnsupportedOperationException
>         at org.apache.lucene.search.TestFuzzyQuery$1.iterator(TestFuzzyQuery.java:511)
>         at org.apache.lucene.index.Terms.intersect(Terms.java:70)
>         at org.apache.lucene.search.FuzzyTermsEnum.getAutomatonEnum(FuzzyTermsEnum.java:206)
>         at org.apache.lucene.search.FuzzyTermsEnum.bottomChanged(FuzzyTermsEnum.java:233)
>         at org.apache.lucene.search.FuzzyTermsEnum.<init>(FuzzyTermsEnum.java:148)
>         at org.apache.lucene.search.FuzzyQuery.getTermsEnum(FuzzyQuery.java:182)
>         at org.apache.lucene.search.MultiTermQuery.getTermsEnum(MultiTermQuery.java:303)
>         at org.apache.lucene.search.TestFuzzyQuery.lambda$testErrorMessage$6(TestFuzzyQuery.java:508)
>         at org.apache.lucene.util.LuceneTestCase._expectThrows(LuceneTestCase.java:2871)
>         at org.apache.lucene.util.LuceneTestCase.expectThrows(LuceneTestCase.java:2746)
>         ... 38 more
>
>
> FAILED:  org.apache.lucene.search.TestFuzzyQuery.testErrorMessage
>
> Error Message:
> Unexpected exception type, expected FuzzyTermsException but got java.lang.UnsupportedOperationException
>
> Stack Trace:
> junit.framework.AssertionFailedError: Unexpected exception type, expected FuzzyTermsException but got java.lang.UnsupportedOperationException
>         at __randomizedtesting.SeedInfo.seed([CE3DF037C6D29401:1836CAB94FFCBD4F]:0)
>         at org.apache.lucene.util.LuceneTestCase.expectThrows(LuceneTestCase.java:2753)
>         at org.apache.lucene.util.LuceneTestCase.expectThrows(LuceneTestCase.java:2741)
>         at org.apache.lucene.search.TestFuzzyQuery.testErrorMessage(TestFuzzyQuery.java:507)
>         at java.base/jdk.internal.reflect.NativeMethodAccessorImpl.invoke0(Native Method)
>         at java.base/jdk.internal.reflect.NativeMethodAccessorImpl.invoke(NativeMethodAccessorImpl.java:62)
>         at java.base/jdk.internal.reflect.DelegatingMethodAccessorImpl.invoke(DelegatingMethodAccessorImpl.java:43)
>         at java.base/java.lang.reflect.Method.invoke(Method.java:567)
>         at com.carrotsearch.randomizedtesting.RandomizedRunner.invoke(RandomizedRunner.java:1754)
>         at com.carrotsearch.randomizedtesting.RandomizedRunner$8.evaluate(RandomizedRunner.java:942)
>         at com.carrotsearch.randomizedtesting.RandomizedRunner$9.evaluate(RandomizedRunner.java:978)
>         at com.carrotsearch.randomizedtesting.RandomizedRunner$10.evaluate(RandomizedRunner.java:992)
>         at org.apache.lucene.util.TestRuleSetupTeardownChained$1.evaluate(TestRuleSetupTeardownChained.java:49)
>         at org.apache.lucene.util.AbstractBeforeAfterRule$1.evaluate(AbstractBeforeAfterRule.java:45)
>         at org.apache.lucene.util.TestRuleThreadAndTestName$1.evaluate(TestRuleThreadAndTestName.java:48)
>         at org.apache.lucene.util.TestRuleIgnoreAfterMaxFailures$1.evaluate(TestRuleIgnoreAfterMaxFailures.java:64)
>         at org.apache.lucene.util.TestRuleMarkFailure$1.evaluate(TestRuleMarkFailure.java:47)
>         at com.carrotsearch.randomizedtesting.rules.StatementAdapter.evaluate(StatementAdapter.java:36)
>         at com.carrotsearch.randomizedtesting.ThreadLeakControl$StatementRunner.run(ThreadLeakControl.java:370)
>         at com.carrotsearch.randomizedtesting.ThreadLeakControl.forkTimeoutingTask(ThreadLeakControl.java:819)
>         at com.carrotsearch.randomizedtesting.ThreadLeakControl$3.evaluate(ThreadLeakControl.java:470)
>         at com.carrotsearch.randomizedtesting.RandomizedRunner.runSingleTest(RandomizedRunner.java:951)
>         at com.carrotsearch.randomizedtesting.RandomizedRunner$5.evaluate(RandomizedRunner.java:836)
>         at com.carrotsearch.randomizedtesting.RandomizedRunner$6.evaluate(RandomizedRunner.java:887)
>         at com.carrotsearch.randomizedtesting.RandomizedRunner$7.evaluate(RandomizedRunner.java:898)
>         at org.apache.lucene.util.AbstractBeforeAfterRule$1.evaluate(AbstractBeforeAfterRule.java:45)
>         at com.carrotsearch.randomizedtesting.rules.StatementAdapter.evaluate(StatementAdapter.java:36)
>         at org.apache.lucene.util.TestRuleStoreClassName$1.evaluate(TestRuleStoreClassName.java:41)
>         at com.carrotsearch.randomizedtesting.rules.NoShadowingOrOverridesOnMethodsRule$1.evaluate(NoShadowingOrOverridesOnMethodsRule.java:40)
>         at com.carrotsearch.randomizedtesting.rules.NoShadowingOrOverridesOnMethodsRule$1.evaluate(NoShadowingOrOverridesOnMethodsRule.java:40)
>         at com.carrotsearch.randomizedtesting.rules.StatementAdapter.evaluate(StatementAdapter.java:36)
>         at com.carrotsearch.randomizedtesting.rules.StatementAdapter.evaluate(StatementAdapter.java:36)
>         at org.apache.lucene.util.TestRuleAssertionsRequired$1.evaluate(TestRuleAssertionsRequired.java:53)
>         at org.apache.lucene.util.TestRuleMarkFailure$1.evaluate(TestRuleMarkFailure.java:47)
>         at org.apache.lucene.util.TestRuleIgnoreAfterMaxFailures$1.evaluate(TestRuleIgnoreAfterMaxFailures.java:64)
>         at org.apache.lucene.util.TestRuleIgnoreTestSuites$1.evaluate(TestRuleIgnoreTestSuites.java:54)
>         at com.carrotsearch.randomizedtesting.rules.StatementAdapter.evaluate(StatementAdapter.java:36)
>         at com.carrotsearch.randomizedtesting.ThreadLeakControl$StatementRunner.run(ThreadLeakControl.java:370)
>         at com.carrotsearch.randomizedtesting.ThreadLeakControl.lambda$forkTimeoutingTask$0(ThreadLeakControl.java:826)
>         at java.base/java.lang.Thread.run(Thread.java:830)
> Caused by: java.lang.UnsupportedOperationException
>         at org.apache.lucene.search.TestFuzzyQuery$1.iterator(TestFuzzyQuery.java:511)
>         at org.apache.lucene.index.Terms.intersect(Terms.java:70)
>         at org.apache.lucene.search.FuzzyTermsEnum.getAutomatonEnum(FuzzyTermsEnum.java:206)
>         at org.apache.lucene.search.FuzzyTermsEnum.bottomChanged(FuzzyTermsEnum.java:233)
>         at org.apache.lucene.search.FuzzyTermsEnum.<init>(FuzzyTermsEnum.java:148)
>         at org.apache.lucene.search.FuzzyQuery.getTermsEnum(FuzzyQuery.java:182)
>         at org.apache.lucene.search.MultiTermQuery.getTermsEnum(MultiTermQuery.java:303)
>         at org.apache.lucene.search.TestFuzzyQuery.lambda$testErrorMessage$6(TestFuzzyQuery.java:508)
>         at org.apache.lucene.util.LuceneTestCase._expectThrows(LuceneTestCase.java:2871)
>         at org.apache.lucene.util.LuceneTestCase.expectThrows(LuceneTestCase.java:2746)
>         ... 38 more
>
>
> FAILED:  org.apache.lucene.search.TestFuzzyQuery.testErrorMessage
>
> Error Message:
> Unexpected exception type, expected FuzzyTermsException but got java.lang.UnsupportedOperationException
>
> Stack Trace:
> junit.framework.AssertionFailedError: Unexpected exception type, expected FuzzyTermsException but got java.lang.UnsupportedOperationException
>         at __randomizedtesting.SeedInfo.seed([CE3DF037C6D29401:1836CAB94FFCBD4F]:0)
>         at org.apache.lucene.util.LuceneTestCase.expectThrows(LuceneTestCase.java:2753)
>         at org.apache.lucene.util.LuceneTestCase.expectThrows(LuceneTestCase.java:2741)
>         at org.apache.lucene.search.TestFuzzyQuery.testErrorMessage(TestFuzzyQuery.java:507)
>         at java.base/jdk.internal.reflect.NativeMethodAccessorImpl.invoke0(Native Method)
>         at java.base/jdk.internal.reflect.NativeMethodAccessorImpl.invoke(NativeMethodAccessorImpl.java:62)
>         at java.base/jdk.internal.reflect.DelegatingMethodAccessorImpl.invoke(DelegatingMethodAccessorImpl.java:43)
>         at java.base/java.lang.reflect.Method.invoke(Method.java:567)
>         at com.carrotsearch.randomizedtesting.RandomizedRunner.invoke(RandomizedRunner.java:1754)
>         at com.carrotsearch.randomizedtesting.RandomizedRunner$8.evaluate(RandomizedRunner.java:942)
>         at com.carrotsearch.randomizedtesting.RandomizedRunner$9.evaluate(RandomizedRunner.java:978)
>         at com.carrotsearch.randomizedtesting.RandomizedRunner$10.evaluate(RandomizedRunner.java:992)
>         at org.apache.lucene.util.TestRuleSetupTeardownChained$1.evaluate(TestRuleSetupTeardownChained.java:49)
>         at org.apache.lucene.util.AbstractBeforeAfterRule$1.evaluate(AbstractBeforeAfterRule.java:45)
>         at org.apache.lucene.util.TestRuleThreadAndTestName$1.evaluate(TestRuleThreadAndTestName.java:48)
>         at org.apache.lucene.util.TestRuleIgnoreAfterMaxFailures$1.evaluate(TestRuleIgnoreAfterMaxFailures.java:64)
>         at org.apache.lucene.util.TestRuleMarkFailure$1.evaluate(TestRuleMarkFailure.java:47)
>         at com.carrotsearch.randomizedtesting.rules.StatementAdapter.evaluate(StatementAdapter.java:36)
>         at com.carrotsearch.randomizedtesting.ThreadLeakControl$StatementRunner.run(ThreadLeakControl.java:370)
>         at com.carrotsearch.randomizedtesting.ThreadLeakControl.forkTimeoutingTask(ThreadLeakControl.java:819)
>         at com.carrotsearch.randomizedtesting.ThreadLeakControl$3.evaluate(ThreadLeakControl.java:470)
>         at com.carrotsearch.randomizedtesting.RandomizedRunner.runSingleTest(RandomizedRunner.java:951)
>         at com.carrotsearch.randomizedtesting.RandomizedRunner$5.evaluate(RandomizedRunner.java:836)
>         at com.carrotsearch.randomizedtesting.RandomizedRunner$6.evaluate(RandomizedRunner.java:887)
>         at com.carrotsearch.randomizedtesting.RandomizedRunner$7.evaluate(RandomizedRunner.java:898)
>         at org.apache.lucene.util.AbstractBeforeAfterRule$1.evaluate(AbstractBeforeAfterRule.java:45)
>         at com.carrotsearch.randomizedtesting.rules.StatementAdapter.evaluate(StatementAdapter.java:36)
>         at org.apache.lucene.util.TestRuleStoreClassName$1.evaluate(TestRuleStoreClassName.java:41)
>         at com.carrotsearch.randomizedtesting.rules.NoShadowingOrOverridesOnMethodsRule$1.evaluate(NoShadowingOrOverridesOnMethodsRule.java:40)
>         at com.carrotsearch.randomizedtesting.rules.NoShadowingOrOverridesOnMethodsRule$1.evaluate(NoShadowingOrOverridesOnMethodsRule.java:40)
>         at com.carrotsearch.randomizedtesting.rules.StatementAdapter.evaluate(StatementAdapter.java:36)
>         at com.carrotsearch.randomizedtesting.rules.StatementAdapter.evaluate(StatementAdapter.java:36)
>         at org.apache.lucene.util.TestRuleAssertionsRequired$1.evaluate(TestRuleAssertionsRequired.java:53)
>         at org.apache.lucene.util.TestRuleMarkFailure$1.evaluate(TestRuleMarkFailure.java:47)
>         at org.apache.lucene.util.TestRuleIgnoreAfterMaxFailures$1.evaluate(TestRuleIgnoreAfterMaxFailures.java:64)
>         at org.apache.lucene.util.TestRuleIgnoreTestSuites$1.evaluate(TestRuleIgnoreTestSuites.java:54)
>         at com.carrotsearch.randomizedtesting.rules.StatementAdapter.evaluate(StatementAdapter.java:36)
>         at com.carrotsearch.randomizedtesting.ThreadLeakControl$StatementRunner.run(ThreadLeakControl.java:370)
>         at com.carrotsearch.randomizedtesting.ThreadLeakControl.lambda$forkTimeoutingTask$0(ThreadLeakControl.java:826)
>         at java.base/java.lang.Thread.run(Thread.java:830)
> Caused by: java.lang.UnsupportedOperationException
>         at org.apache.lucene.search.TestFuzzyQuery$1.iterator(TestFuzzyQuery.java:511)
>         at org.apache.lucene.index.Terms.intersect(Terms.java:70)
>         at org.apache.lucene.search.FuzzyTermsEnum.getAutomatonEnum(FuzzyTermsEnum.java:206)
>         at org.apache.lucene.search.FuzzyTermsEnum.bottomChanged(FuzzyTermsEnum.java:233)
>         at org.apache.lucene.search.FuzzyTermsEnum.<init>(FuzzyTermsEnum.java:148)
>         at org.apache.lucene.search.FuzzyQuery.getTermsEnum(FuzzyQuery.java:182)
>         at org.apache.lucene.search.MultiTermQuery.getTermsEnum(MultiTermQuery.java:303)
>         at org.apache.lucene.search.TestFuzzyQuery.lambda$testErrorMessage$6(TestFuzzyQuery.java:508)
>         at org.apache.lucene.util.LuceneTestCase._expectThrows(LuceneTestCase.java:2871)
>         at org.apache.lucene.util.LuceneTestCase.expectThrows(LuceneTestCase.java:2746)
>         ... 38 more
>
>
> FAILED:  org.apache.lucene.search.TestFuzzyQuery.testErrorMessage
>
> Error Message:
> Unexpected exception type, expected FuzzyTermsException but got java.lang.UnsupportedOperationException
>
> Stack Trace:
> junit.framework.AssertionFailedError: Unexpected exception type, expected FuzzyTermsException but got java.lang.UnsupportedOperationException
>         at __randomizedtesting.SeedInfo.seed([CE3DF037C6D29401:1836CAB94FFCBD4F]:0)
>         at org.apache.lucene.util.LuceneTestCase.expectThrows(LuceneTestCase.java:2753)
>         at org.apache.lucene.util.LuceneTestCase.expectThrows(LuceneTestCase.java:2741)
>         at org.apache.lucene.search.TestFuzzyQuery.testErrorMessage(TestFuzzyQuery.java:507)
>         at java.base/jdk.internal.reflect.NativeMethodAccessorImpl.invoke0(Native Method)
>         at java.base/jdk.internal.reflect.NativeMethodAccessorImpl.invoke(NativeMethodAccessorImpl.java:62)
>         at java.base/jdk.internal.reflect.DelegatingMethodAccessorImpl.invoke(DelegatingMethodAccessorImpl.java:43)
>         at java.base/java.lang.reflect.Method.invoke(Method.java:567)
>         at com.carrotsearch.randomizedtesting.RandomizedRunner.invoke(RandomizedRunner.java:1754)
>         at com.carrotsearch.randomizedtesting.RandomizedRunner$8.evaluate(RandomizedRunner.java:942)
>         at com.carrotsearch.randomizedtesting.RandomizedRunner$9.evaluate(RandomizedRunner.java:978)
>         at com.carrotsearch.randomizedtesting.RandomizedRunner$10.evaluate(RandomizedRunner.java:992)
>         at org.apache.lucene.util.TestRuleSetupTeardownChained$1.evaluate(TestRuleSetupTeardownChained.java:49)
>         at org.apache.lucene.util.AbstractBeforeAfterRule$1.evaluate(AbstractBeforeAfterRule.java:45)
>         at org.apache.lucene.util.TestRuleThreadAndTestName$1.evaluate(TestRuleThreadAndTestName.java:48)
>         at org.apache.lucene.util.TestRuleIgnoreAfterMaxFailures$1.evaluate(TestRuleIgnoreAfterMaxFailures.java:64)
>         at org.apache.lucene.util.TestRuleMarkFailure$1.evaluate(TestRuleMarkFailure.java:47)
>         at com.carrotsearch.randomizedtesting.rules.StatementAdapter.evaluate(StatementAdapter.java:36)
>         at com.carrotsearch.randomizedtesting.ThreadLeakControl$StatementRunner.run(ThreadLeakControl.java:370)
>         at com.carrotsearch.randomizedtesting.ThreadLeakControl.forkTimeoutingTask(ThreadLeakControl.java:819)
>         at com.carrotsearch.randomizedtesting.ThreadLeakControl$3.evaluate(ThreadLeakControl.java:470)
>         at com.carrotsearch.randomizedtesting.RandomizedRunner.runSingleTest(RandomizedRunner.java:951)
>         at com.carrotsearch.randomizedtesting.RandomizedRunner$5.evaluate(RandomizedRunner.java:836)
>         at com.carrotsearch.randomizedtesting.RandomizedRunner$6.evaluate(RandomizedRunner.java:887)
>         at com.carrotsearch.randomizedtesting.RandomizedRunner$7.evaluate(RandomizedRunner.java:898)
>         at org.apache.lucene.util.AbstractBeforeAfterRule$1.evaluate(AbstractBeforeAfterRule.java:45)
>         at com.carrotsearch.randomizedtesting.rules.StatementAdapter.evaluate(StatementAdapter.java:36)
>         at org.apache.lucene.util.TestRuleStoreClassName$1.evaluate(TestRuleStoreClassName.java:41)
>         at com.carrotsearch.randomizedtesting.rules.NoShadowingOrOverridesOnMethodsRule$1.evaluate(NoShadowingOrOverridesOnMethodsRule.java:40)
>         at com.carrotsearch.randomizedtesting.rules.NoShadowingOrOverridesOnMethodsRule$1.evaluate(NoShadowingOrOverridesOnMethodsRule.java:40)
>         at com.carrotsearch.randomizedtesting.rules.StatementAdapter.evaluate(StatementAdapter.java:36)
>         at com.carrotsearch.randomizedtesting.rules.StatementAdapter.evaluate(StatementAdapter.java:36)
>         at org.apache.lucene.util.TestRuleAssertionsRequired$1.evaluate(TestRuleAssertionsRequired.java:53)
>         at org.apache.lucene.util.TestRuleMarkFailure$1.evaluate(TestRuleMarkFailure.java:47)
>         at org.apache.lucene.util.TestRuleIgnoreAfterMaxFailures$1.evaluate(TestRuleIgnoreAfterMaxFailures.java:64)
>         at org.apache.lucene.util.TestRuleIgnoreTestSuites$1.evaluate(TestRuleIgnoreTestSuites.java:54)
>         at com.carrotsearch.randomizedtesting.rules.StatementAdapter.evaluate(StatementAdapter.java:36)
>         at com.carrotsearch.randomizedtesting.ThreadLeakControl$StatementRunner.run(ThreadLeakControl.java:370)
>         at com.carrotsearch.randomizedtesting.ThreadLeakControl.lambda$forkTimeoutingTask$0(ThreadLeakControl.java:826)
>         at java.base/java.lang.Thread.run(Thread.java:830)
> Caused by: java.lang.UnsupportedOperationException
>         at org.apache.lucene.search.TestFuzzyQuery$1.iterator(TestFuzzyQuery.java:511)
>         at org.apache.lucene.index.Terms.intersect(Terms.java:70)
>         at org.apache.lucene.search.FuzzyTermsEnum.getAutomatonEnum(FuzzyTermsEnum.java:206)
>         at org.apache.lucene.search.FuzzyTermsEnum.bottomChanged(FuzzyTermsEnum.java:233)
>         at org.apache.lucene.search.FuzzyTermsEnum.<init>(FuzzyTermsEnum.java:148)
>         at org.apache.lucene.search.FuzzyQuery.getTermsEnum(FuzzyQuery.java:182)
>         at org.apache.lucene.search.MultiTermQuery.getTermsEnum(MultiTermQuery.java:303)
>         at org.apache.lucene.search.TestFuzzyQuery.lambda$testErrorMessage$6(TestFuzzyQuery.java:508)
>         at org.apache.lucene.util.LuceneTestCase._expectThrows(LuceneTestCase.java:2871)
>         at org.apache.lucene.util.LuceneTestCase.expectThrows(LuceneTestCase.java:2746)
>         ... 38 more
>
>
> FAILED:  org.apache.lucene.search.TestFuzzyQuery.testErrorMessage
>
> Error Message:
> Unexpected exception type, expected FuzzyTermsException but got java.lang.UnsupportedOperationException
>
> Stack Trace:
> junit.framework.AssertionFailedError: Unexpected exception type, expected FuzzyTermsException but got java.lang.UnsupportedOperationException
>         at __randomizedtesting.SeedInfo.seed([CE3DF037C6D29401:1836CAB94FFCBD4F]:0)
>         at org.apache.lucene.util.LuceneTestCase.expectThrows(LuceneTestCase.java:2753)
>         at org.apache.lucene.util.LuceneTestCase.expectThrows(LuceneTestCase.java:2741)
>         at org.apache.lucene.search.TestFuzzyQuery.testErrorMessage(TestFuzzyQuery.java:507)
>         at java.base/jdk.internal.reflect.NativeMethodAccessorImpl.invoke0(Native Method)
>         at java.base/jdk.internal.reflect.NativeMethodAccessorImpl.invoke(NativeMethodAccessorImpl.java:62)
>         at java.base/jdk.internal.reflect.DelegatingMethodAccessorImpl.invoke(DelegatingMethodAccessorImpl.java:43)
>         at java.base/java.lang.reflect.Method.invoke(Method.java:567)
>         at com.carrotsearch.randomizedtesting.RandomizedRunner.invoke(RandomizedRunner.java:1754)
>         at com.carrotsearch.randomizedtesting.RandomizedRunner$8.evaluate(RandomizedRunner.java:942)
>         at com.carrotsearch.randomizedtesting.RandomizedRunner$9.evaluate(RandomizedRunner.java:978)
>         at com.carrotsearch.randomizedtesting.RandomizedRunner$10.evaluate(RandomizedRunner.java:992)
>         at org.apache.lucene.util.TestRuleSetupTeardownChained$1.evaluate(TestRuleSetupTeardownChained.java:49)
>         at org.apache.lucene.util.AbstractBeforeAfterRule$1.evaluate(AbstractBeforeAfterRule.java:45)
>         at org.apache.lucene.util.TestRuleThreadAndTestName$1.evaluate(TestRuleThreadAndTestName.java:48)
>         at org.apache.lucene.util.TestRuleIgnoreAfterMaxFailures$1.evaluate(TestRuleIgnoreAfterMaxFailures.java:64)
>         at org.apache.lucene.util.TestRuleMarkFailure$1.evaluate(TestRuleMarkFailure.java:47)
>         at com.carrotsearch.randomizedtesting.rules.StatementAdapter.evaluate(StatementAdapter.java:36)
>         at com.carrotsearch.randomizedtesting.ThreadLeakControl$StatementRunner.run(ThreadLeakControl.java:370)
>         at com.carrotsearch.randomizedtesting.ThreadLeakControl.forkTimeoutingTask(ThreadLeakControl.java:819)
>         at com.carrotsearch.randomizedtesting.ThreadLeakControl$3.evaluate(ThreadLeakControl.java:470)
>         at com.carrotsearch.randomizedtesting.RandomizedRunner.runSingleTest(RandomizedRunner.java:951)
>         at com.carrotsearch.randomizedtesting.RandomizedRunner$5.evaluate(RandomizedRunner.java:836)
>         at com.carrotsearch.randomizedtesting.RandomizedRunner$6.evaluate(RandomizedRunner.java:887)
>         at com.carrotsearch.randomizedtesting.RandomizedRunner$7.evaluate(RandomizedRunner.java:898)
>         at org.apache.lucene.util.AbstractBeforeAfterRule$1.evaluate(AbstractBeforeAfterRule.java:45)
>         at com.carrotsearch.randomizedtesting.rules.StatementAdapter.evaluate(StatementAdapter.java:36)
>         at org.apache.lucene.util.TestRuleStoreClassName$1.evaluate(TestRuleStoreClassName.java:41)
>         at com.carrotsearch.randomizedtesting.rules.NoShadowingOrOverridesOnMethodsRule$1.evaluate(NoShadowingOrOverridesOnMethodsRule.java:40)
>         at com.carrotsearch.randomizedtesting.rules.NoShadowingOrOverridesOnMethodsRule$1.evaluate(NoShadowingOrOverridesOnMethodsRule.java:40)
>         at com.carrotsearch.randomizedtesting.rules.StatementAdapter.evaluate(StatementAdapter.java:36)
>         at com.carrotsearch.randomizedtesting.rules.StatementAdapter.evaluate(StatementAdapter.java:36)
>         at org.apache.lucene.util.TestRuleAssertionsRequired$1.evaluate(TestRuleAssertionsRequired.java:53)
>         at org.apache.lucene.util.TestRuleMarkFailure$1.evaluate(TestRuleMarkFailure.java:47)
>         at org.apache.lucene.util.TestRuleIgnoreAfterMaxFailures$1.evaluate(TestRuleIgnoreAfterMaxFailures.java:64)
>         at org.apache.lucene.util.TestRuleIgnoreTestSuites$1.evaluate(TestRuleIgnoreTestSuites.java:54)
>         at com.carrotsearch.randomizedtesting.rules.StatementAdapter.evaluate(StatementAdapter.java:36)
>         at com.carrotsearch.randomizedtesting.ThreadLeakControl$StatementRunner.run(ThreadLeakControl.java:370)
>         at com.carrotsearch.randomizedtesting.ThreadLeakControl.lambda$forkTimeoutingTask$0(ThreadLeakControl.java:826)
>         at java.base/java.lang.Thread.run(Thread.java:830)
> Caused by: java.lang.UnsupportedOperationException
>         at org.apache.lucene.search.TestFuzzyQuery$1.iterator(TestFuzzyQuery.java:511)
>         at org.apache.lucene.index.Terms.intersect(Terms.java:70)
>         at org.apache.lucene.search.FuzzyTermsEnum.getAutomatonEnum(FuzzyTermsEnum.java:206)
>         at org.apache.lucene.search.FuzzyTermsEnum.bottomChanged(FuzzyTermsEnum.java:233)
>         at org.apache.lucene.search.FuzzyTermsEnum.<init>(FuzzyTermsEnum.java:148)
>         at org.apache.lucene.search.FuzzyQuery.getTermsEnum(FuzzyQuery.java:182)
>         at org.apache.lucene.search.MultiTermQuery.getTermsEnum(MultiTermQuery.java:303)
>         at org.apache.lucene.search.TestFuzzyQuery.lambda$testErrorMessage$6(TestFuzzyQuery.java:508)
>         at org.apache.lucene.util.LuceneTestCase._expectThrows(LuceneTestCase.java:2871)
>         at org.apache.lucene.util.LuceneTestCase.expectThrows(LuceneTestCase.java:2746)
>         ... 38 more
>
>
> FAILED:  org.apache.lucene.search.TestFuzzyQuery.testErrorMessage
>
> Error Message:
> Unexpected exception type, expected FuzzyTermsException but got java.lang.UnsupportedOperationException
>
> Stack Trace:
> junit.framework.AssertionFailedError: Unexpected exception type, expected FuzzyTermsException but got java.lang.UnsupportedOperationException
>         at __randomizedtesting.SeedInfo.seed([CE3DF037C6D29401:1836CAB94FFCBD4F]:0)
>         at org.apache.lucene.util.LuceneTestCase.expectThrows(LuceneTestCase.java:2753)
>         at org.apache.lucene.util.LuceneTestCase.expectThrows(LuceneTestCase.java:2741)
>         at org.apache.lucene.search.TestFuzzyQuery.testErrorMessage(TestFuzzyQuery.java:507)
>         at java.base/jdk.internal.reflect.NativeMethodAccessorImpl.invoke0(Native Method)
>         at java.base/jdk.internal.reflect.NativeMethodAccessorImpl.invoke(NativeMethodAccessorImpl.java:62)
>         at java.base/jdk.internal.reflect.DelegatingMethodAccessorImpl.invoke(DelegatingMethodAccessorImpl.java:43)
>         at java.base/java.lang.reflect.Method.invoke(Method.java:567)
>         at com.carrotsearch.randomizedtesting.RandomizedRunner.invoke(RandomizedRunner.java:1754)
>         at com.carrotsearch.randomizedtesting.RandomizedRunner$8.evaluate(RandomizedRunner.java:942)
>         at com.carrotsearch.randomizedtesting.RandomizedRunner$9.evaluate(RandomizedRunner.java:978)
>         at com.carrotsearch.randomizedtesting.RandomizedRunner$10.evaluate(RandomizedRunner.java:992)
>         at org.apache.lucene.util.TestRuleSetupTeardownChained$1.evaluate(TestRuleSetupTeardownChained.java:49)
>         at org.apache.lucene.util.AbstractBeforeAfterRule$1.evaluate(AbstractBeforeAfterRule.java:45)
>         at org.apache.lucene.util.TestRuleThreadAndTestName$1.evaluate(TestRuleThreadAndTestName.java:48)
>         at org.apache.lucene.util.TestRuleIgnoreAfterMaxFailures$1.evaluate(TestRuleIgnoreAfterMaxFailures.java:64)
>         at org.apache.lucene.util.TestRuleMarkFailure$1.evaluate(TestRuleMarkFailure.java:47)
>         at com.carrotsearch.randomizedtesting.rules.StatementAdapter.evaluate(StatementAdapter.java:36)
>         at com.carrotsearch.randomizedtesting.ThreadLeakControl$StatementRunner.run(ThreadLeakControl.java:370)
>         at com.carrotsearch.randomizedtesting.ThreadLeakControl.forkTimeoutingTask(ThreadLeakControl.java:819)
>         at com.carrotsearch.randomizedtesting.ThreadLeakControl$3.evaluate(ThreadLeakControl.java:470)
>         at com.carrotsearch.randomizedtesting.RandomizedRunner.runSingleTest(RandomizedRunner.java:951)
>         at com.carrotsearch.randomizedtesting.RandomizedRunner$5.evaluate(RandomizedRunner.java:836)
>         at com.carrotsearch.randomizedtesting.RandomizedRunner$6.evaluate(RandomizedRunner.java:887)
>         at com.carrotsearch.randomizedtesting.RandomizedRunner$7.evaluate(RandomizedRunner.java:898)
>         at org.apache.lucene.util.AbstractBeforeAfterRule$1.evaluate(AbstractBeforeAfterRule.java:45)
>         at com.carrotsearch.randomizedtesting.rules.StatementAdapter.evaluate(StatementAdapter.java:36)
>         at org.apache.lucene.util.TestRuleStoreClassName$1.evaluate(TestRuleStoreClassName.java:41)
>         at com.carrotsearch.randomizedtesting.rules.NoShadowingOrOverridesOnMethodsRule$1.evaluate(NoShadowingOrOverridesOnMethodsRule.java:40)
>         at com.carrotsearch.randomizedtesting.rules.NoShadowingOrOverridesOnMethodsRule$1.evaluate(NoShadowingOrOverridesOnMethodsRule.java:40)
>         at com.carrotsearch.randomizedtesting.rules.StatementAdapter.evaluate(StatementAdapter.java:36)
>         at com.carrotsearch.randomizedtesting.rules.StatementAdapter.evaluate(StatementAdapter.java:36)
>         at org.apache.lucene.util.TestRuleAssertionsRequired$1.evaluate(TestRuleAssertionsRequired.java:53)
>         at org.apache.lucene.util.TestRuleMarkFailure$1.evaluate(TestRuleMarkFailure.java:47)
>         at org.apache.lucene.util.TestRuleIgnoreAfterMaxFailures$1.evaluate(TestRuleIgnoreAfterMaxFailures.java:64)
>         at org.apache.lucene.util.TestRuleIgnoreTestSuites$1.evaluate(TestRuleIgnoreTestSuites.java:54)
>         at com.carrotsearch.randomizedtesting.rules.StatementAdapter.evaluate(StatementAdapter.java:36)
>         at com.carrotsearch.randomizedtesting.ThreadLeakControl$StatementRunner.run(ThreadLeakControl.java:370)
>         at com.carrotsearch.randomizedtesting.ThreadLeakControl.lambda$forkTimeoutingTask$0(ThreadLeakControl.java:826)
>         at java.base/java.lang.Thread.run(Thread.java:830)
> Caused by: java.lang.UnsupportedOperationException
>         at org.apache.lucene.search.TestFuzzyQuery$1.iterator(TestFuzzyQuery.java:511)
>         at org.apache.lucene.index.Terms.intersect(Terms.java:70)
>         at org.apache.lucene.search.FuzzyTermsEnum.getAutomatonEnum(FuzzyTermsEnum.java:206)
>         at org.apache.lucene.search.FuzzyTermsEnum.bottomChanged(FuzzyTermsEnum.java:233)
>         at org.apache.lucene.search.FuzzyTermsEnum.<init>(FuzzyTermsEnum.java:148)
>         at org.apache.lucene.search.FuzzyQuery.getTermsEnum(FuzzyQuery.java:182)
>         at org.apache.lucene.search.MultiTermQuery.getTermsEnum(MultiTermQuery.java:303)
>         at org.apache.lucene.search.TestFuzzyQuery.lambda$testErrorMessage$6(TestFuzzyQuery.java:508)
>         at org.apache.lucene.util.LuceneTestCase._expectThrows(LuceneTestCase.java:2871)
>         at org.apache.lucene.util.LuceneTestCase.expectThrows(LuceneTestCase.java:2746)
>         ... 38 more
>
>
>
>
> Build Log:
> [...truncated 642 lines...]
>    [junit4] Suite: org.apache.lucene.search.TestFuzzyQuery
>    [junit4]   2> NOTE: reproduce with: ant test  -Dtestcase=TestFuzzyQuery -Dtests.method=testErrorMessage -Dtests.seed=CE3DF037C6D29401 -Dtests.slow=true -Dtests.locale=fr-GN -Dtests.timezone=US/Pacific-New -Dtests.asserts=true -Dtests.file.encoding=ISO-8859-1
>    [junit4] FAILURE 0.22s J1 | TestFuzzyQuery.testErrorMessage <<<
>    [junit4]    > Throwable #1: junit.framework.AssertionFailedError: Unexpected exception type, expected FuzzyTermsException but got java.lang.UnsupportedOperationException
>    [junit4]    >        at __randomizedtesting.SeedInfo.seed([CE3DF037C6D29401:1836CAB94FFCBD4F]:0)
>    [junit4]    >        at org.apache.lucene.util.LuceneTestCase.expectThrows(LuceneTestCase.java:2753)
>    [junit4]    >        at org.apache.lucene.util.LuceneTestCase.expectThrows(LuceneTestCase.java:2741)
>    [junit4]    >        at org.apache.lucene.search.TestFuzzyQuery.testErrorMessage(TestFuzzyQuery.java:507)
>    [junit4]    >        at java.base/jdk.internal.reflect.NativeMethodAccessorImpl.invoke0(Native Method)
>    [junit4]    >        at java.base/jdk.internal.reflect.NativeMethodAccessorImpl.invoke(NativeMethodAccessorImpl.java:62)
>    [junit4]    >        at java.base/jdk.internal.reflect.DelegatingMethodAccessorImpl.invoke(DelegatingMethodAccessorImpl.java:43)
>    [junit4]    >        at java.base/java.lang.reflect.Method.invoke(Method.java:567)
>    [junit4]    >        at java.base/java.lang.Thread.run(Thread.java:830)
>    [junit4]    > Caused by: java.lang.UnsupportedOperationException
>    [junit4]    >        at org.apache.lucene.search.TestFuzzyQuery$1.iterator(TestFuzzyQuery.java:511)
>    [junit4]    >        at org.apache.lucene.index.Terms.intersect(Terms.java:70)
>    [junit4]    >        at org.apache.lucene.search.FuzzyTermsEnum.getAutomatonEnum(FuzzyTermsEnum.java:206)
>    [junit4]    >        at org.apache.lucene.search.FuzzyTermsEnum.bottomChanged(FuzzyTermsEnum.java:233)
>    [junit4]    >        at org.apache.lucene.search.FuzzyTermsEnum.<init>(FuzzyTermsEnum.java:148)
>    [junit4]    >        at org.apache.lucene.search.FuzzyQuery.getTermsEnum(FuzzyQuery.java:182)
>    [junit4]    >        at org.apache.lucene.search.MultiTermQuery.getTermsEnum(MultiTermQuery.java:303)
>    [junit4]    >        at org.apache.lucene.search.TestFuzzyQuery.lambda$testErrorMessage$6(TestFuzzyQuery.java:508)
>    [junit4]    >        at org.apache.lucene.util.LuceneTestCase._expectThrows(LuceneTestCase.java:2871)
>    [junit4]    >        at org.apache.lucene.util.LuceneTestCase.expectThrows(LuceneTestCase.java:2746)
>    [junit4]    >        ... 38 more
>    [junit4]   2> NOTE: test params are: codec=DummyCompressingStoredFields(storedFieldsFormat=CompressingStoredFieldsFormat(compressionMode=DUMMY, chunkSize=5, maxDocsPerChunk=10, blockSize=8), termVectorsFormat=CompressingTermVectorsFormat(compressionMode=DUMMY, chunkSize=5, blockSize=8)), sim=Asserting(org.apache.lucene.search.similarities.AssertingSimilarity@18091df0), locale=fr-GN, timezone=US/Pacific-New
>    [junit4]   2> NOTE: Mac OS X 10.11.6 x86_64/AdoptOpenJDK 13.0.1 (64-bit)/cpus=3,threads=1,free=160832904,total=203948032
>    [junit4]   2> NOTE: All tests run in this JVM: [TestIndependenceSaturated, TestBM25Similarity, TestToken, TestIndexWriterOnJRECrash, TestDemoParallelLeafReader, TestForTooMuchCloning, TestLucene80NormsFormat, TestStressDeletes, TestSimpleAttributeImpl, TestWANDScorer, TestFieldCacheRewriteMethod, TestFeatureField, TestSegmentTermEnum, TestIndexWriterOutOfFileDescriptors, TestIndexTooManyDocs, TestCodecUtil, TestSloppyPhraseQuery2, TestCachingTokenFilter, TestIndexedDISI, TestFrequencyTrackingRingBuffer, TestFilterIterator, TestIndexReaderClose, TestSimpleSearchEquivalence, TestTopFieldCollectorEarlyTermination, TestDemo, TestControlledRealTimeReopenThread, TestNeedsScores, TestLucene50TermVectorsFormat, TestMultiTermQueryRewrites, TestSortRandom, FuzzyTermOnShortTermsTest, TestPrefixCodedTerms, Test2BPostingsBytes, TestAxiomaticF2LOG, LimitedFiniteStringsIteratorTest, TestMergeRateLimiter, TestSearcherManager, TestClassicSimilarity, Test4GBStoredFields, TestUniqueTermCount, TestSumDocFreq, TestSegmentInfos, TestNoDeletionPolicy, TestFilterLeafReader, TestNumericDocValuesUpdates, TestBitUtil, TestBoolean2, TestNIOFSDirectory, TestRegexpQuery, TestDirectoryReaderReopen, TestMatchAllDocsQuery, TestNotDocIdSet, TestBKDRadixSort, TestMultiSliceMerge, TestLucene84PostingsFormat, TestMergeSchedulerExternal, TestIndexFileDeleter, TestDisjunctionScoreBlockBoundaryPropagator, TestLevenshteinAutomata, TestMmapDirectory, TestAxiomaticF3LOG, TestIntroSelector, TestCharacterUtils, TestNot, TestIndexWriterLockRelease, TestBinaryTerms, TestCrashCausesCorruptIndex, TestMultiset, TestDocsAndPositions, TestSearchForDuplicates, TestBlendedTermQuery, TestIndexWriterMergePolicy, TestFuzzyQuery]
>    [junit4] Completed [79/526 (1!)] on J1 in 1.73s, 12 tests, 1 failure <<< FAILURES!
>
> [...truncated 60152 lines...]
> [repro] Jenkins log URL: https://jenkins.thetaphi.de/job/Lucene-Solr-master-MacOSX/5514/consoleText
>
> [repro] Revision: 7d0cf0df3286dba2354fc854a64eac5dcc09961a
>
> [repro] Ant options: "-Dargs=-XX:-UseCompressedOops -XX:+UseParallelGC"
> [repro] Repro line:  ant test  -Dtestcase=TestFuzzyQuery -Dtests.method=testErrorMessage -Dtests.seed=CE3DF037C6D29401 -Dtests.slow=true -Dtests.locale=fr-GN -Dtests.timezone=US/Pacific-New -Dtests.asserts=true -Dtests.file.encoding=ISO-8859-1
>
> [repro] JUnit rest result XML files will be moved to: ./repro-reports
> [repro] ant clean
>
> [...truncated 6 lines...]
> [repro] Test suites by module:
> [repro]    lucene/core
> [repro]       TestFuzzyQuery
> [repro] ant compile-test
>
> [...truncated 312 lines...]
> [repro] ant test-nocompile -Dtests.dups=5 -Dtests.maxfailures=5 -Dtests.class="*.TestFuzzyQuery" -Dtests.showOutput=onerror "-Dargs=-XX:-UseCompressedOops -XX:+UseParallelGC" -Dtests.seed=CE3DF037C6D29401 -Dtests.slow=true -Dtests.locale=fr-GN -Dtests.timezone=US/Pacific-New -Dtests.asserts=true -Dtests.file.encoding=ISO-8859-1
>
> [...truncated 31 lines...]
>    [junit4] Suite: org.apache.lucene.search.TestFuzzyQuery
>    [junit4] OK      0.97s J1 | TestFuzzyQuery.test2
>    [junit4] OK      0.01s J1 | TestFuzzyQuery.testValidation
>    [junit4] OK      0.11s J1 | TestFuzzyQuery.testGiga
>    [junit4] OK      0.10s J1 | TestFuzzyQuery.testDistanceAsEditsSearching
>    [junit4] OK      2.92s J1 | TestFuzzyQuery.testRandom
>    [junit4] OK      0.06s J1 | TestFuzzyQuery.testBoostOnlyRewrite
>    [junit4] OK      0.22s J1 | TestFuzzyQuery.testTieBreaker
>    [junit4] OK      0.09s J1 | TestFuzzyQuery.testFuzziness
>    [junit4]   2> NOTE: reproduce with: ant test  -Dtestcase=TestFuzzyQuery -Dtests.method=testErrorMessage -Dtests.seed=CE3DF037C6D29401 -Dtests.slow=true -Dtests.badapples=true -Dtests.locale=fr-GN -Dtests.timezone=US/Pacific-New -Dtests.asserts=true -Dtests.file.encoding=ISO-8859-1
>    [junit4] FAILURE 0.24s J1 | TestFuzzyQuery.testErrorMessage <<<
>    [junit4]    > Throwable #1: junit.framework.AssertionFailedError: Unexpected exception type, expected FuzzyTermsException but got java.lang.UnsupportedOperationException
>    [junit4]    >        at __randomizedtesting.SeedInfo.seed([CE3DF037C6D29401:1836CAB94FFCBD4F]:0)
>    [junit4]    >        at org.apache.lucene.util.LuceneTestCase.expectThrows(LuceneTestCase.java:2753)
>    [junit4]    >        at org.apache.lucene.util.LuceneTestCase.expectThrows(LuceneTestCase.java:2741)
>    [junit4]    >        at org.apache.lucene.search.TestFuzzyQuery.testErrorMessage(TestFuzzyQuery.java:507)
>    [junit4]    >        at java.base/jdk.internal.reflect.NativeMethodAccessorImpl.invoke0(Native Method)
>    [junit4]    >        at java.base/jdk.internal.reflect.NativeMethodAccessorImpl.invoke(NativeMethodAccessorImpl.java:62)
>    [junit4]    >        at java.base/jdk.internal.reflect.DelegatingMethodAccessorImpl.invoke(DelegatingMethodAccessorImpl.java:43)
>    [junit4]    >        at java.base/java.lang.reflect.Method.invoke(Method.java:567)
>    [junit4]    >        at java.base/java.lang.Thread.run(Thread.java:830)
>    [junit4]    > Caused by: java.lang.UnsupportedOperationException
>    [junit4]    >        at org.apache.lucene.search.TestFuzzyQuery$1.iterator(TestFuzzyQuery.java:511)
>    [junit4]    >        at org.apache.lucene.index.Terms.intersect(Terms.java:70)
>    [junit4]    >        at org.apache.lucene.search.FuzzyTermsEnum.getAutomatonEnum(FuzzyTermsEnum.java:206)
>    [junit4]    >        at org.apache.lucene.search.FuzzyTermsEnum.bottomChanged(FuzzyTermsEnum.java:233)
>    [junit4]    >        at org.apache.lucene.search.FuzzyTermsEnum.<init>(FuzzyTermsEnum.java:148)
>    [junit4]    >        at org.apache.lucene.search.FuzzyQuery.getTermsEnum(FuzzyQuery.java:182)
>    [junit4]    >        at org.apache.lucene.search.MultiTermQuery.getTermsEnum(MultiTermQuery.java:303)
>    [junit4]    >        at org.apache.lucene.search.TestFuzzyQuery.lambda$testErrorMessage$6(TestFuzzyQuery.java:508)
>    [junit4]    >        at org.apache.lucene.util.LuceneTestCase._expectThrows(LuceneTestCase.java:2871)
>    [junit4]    >        at org.apache.lucene.util.LuceneTestCase.expectThrows(LuceneTestCase.java:2746)
>    [junit4]    >        ... 38 more
>    [junit4] OK      0.18s J1 | TestFuzzyQuery.testBasicPrefix
>    [junit4] OK      0.30s J1 | TestFuzzyQuery.testMultipleQueriesIdfWorks
>    [junit4] OK      0.20s J1 | TestFuzzyQuery.testSingleQueryExactMatchScoresHighest
>    [junit4]   2> NOTE: test params are: codec=DummyCompressingStoredFields(storedFieldsFormat=CompressingStoredFieldsFormat(compressionMode=DUMMY, chunkSize=5, maxDocsPerChunk=10, blockSize=8), termVectorsFormat=CompressingTermVectorsFormat(compressionMode=DUMMY, chunkSize=5, blockSize=8)), sim=Asserting(org.apache.lucene.search.similarities.AssertingSimilarity@5d43fa98), locale=fr-GN, timezone=US/Pacific-New
>    [junit4]   2> NOTE: Mac OS X 10.11.6 x86_64/AdoptOpenJDK 13.0.1 (64-bit)/cpus=3,threads=1,free=47635616,total=87556096
>    [junit4]   2> NOTE: All tests run in this JVM: [TestFuzzyQuery]
>    [junit4] Completed [1/5 (1!)] on J1 in 5.91s, 12 tests, 1 failure <<< FAILURES!
>
> [...truncated 1 lines...]
>    [junit4] Suite: org.apache.lucene.search.TestFuzzyQuery
>    [junit4] OK      0.86s J0 | TestFuzzyQuery.test2
>    [junit4] OK      0.01s J0 | TestFuzzyQuery.testValidation
>    [junit4] OK      0.18s J0 | TestFuzzyQuery.testGiga
>    [junit4] OK      0.15s J0 | TestFuzzyQuery.testDistanceAsEditsSearching
>    [junit4] OK      3.02s J0 | TestFuzzyQuery.testRandom
>    [junit4] OK      0.11s J0 | TestFuzzyQuery.testBoostOnlyRewrite
>    [junit4] OK      0.25s J0 | TestFuzzyQuery.testTieBreaker
>    [junit4] OK      0.21s J0 | TestFuzzyQuery.testFuzziness
>    [junit4]   2> NOTE: reproduce with: ant test  -Dtestcase=TestFuzzyQuery -Dtests.method=testErrorMessage -Dtests.seed=CE3DF037C6D29401 -Dtests.slow=true -Dtests.badapples=true -Dtests.locale=fr-GN -Dtests.timezone=US/Pacific-New -Dtests.asserts=true -Dtests.file.encoding=ISO-8859-1
>    [junit4] FAILURE 0.22s J0 | TestFuzzyQuery.testErrorMessage <<<
>    [junit4]    > Throwable #1: junit.framework.AssertionFailedError: Unexpected exception type, expected FuzzyTermsException but got java.lang.UnsupportedOperationException
>    [junit4]    >        at __randomizedtesting.SeedInfo.seed([CE3DF037C6D29401:1836CAB94FFCBD4F]:0)
>    [junit4]    >        at org.apache.lucene.util.LuceneTestCase.expectThrows(LuceneTestCase.java:2753)
>    [junit4]    >        at org.apache.lucene.util.LuceneTestCase.expectThrows(LuceneTestCase.java:2741)
>    [junit4]    >        at org.apache.lucene.search.TestFuzzyQuery.testErrorMessage(TestFuzzyQuery.java:507)
>    [junit4]    >        at java.base/jdk.internal.reflect.NativeMethodAccessorImpl.invoke0(Native Method)
>    [junit4]    >        at java.base/jdk.internal.reflect.NativeMethodAccessorImpl.invoke(NativeMethodAccessorImpl.java:62)
>    [junit4]    >        at java.base/jdk.internal.reflect.DelegatingMethodAccessorImpl.invoke(DelegatingMethodAccessorImpl.java:43)
>    [junit4]    >        at java.base/java.lang.reflect.Method.invoke(Method.java:567)
>    [junit4]    >        at java.base/java.lang.Thread.run(Thread.java:830)
>    [junit4]    > Caused by: java.lang.UnsupportedOperationException
>    [junit4]    >        at org.apache.lucene.search.TestFuzzyQuery$1.iterator(TestFuzzyQuery.java:511)
>    [junit4]    >        at org.apache.lucene.index.Terms.intersect(Terms.java:70)
>    [junit4]    >        at org.apache.lucene.search.FuzzyTermsEnum.getAutomatonEnum(FuzzyTermsEnum.java:206)
>    [junit4]    >        at org.apache.lucene.search.FuzzyTermsEnum.bottomChanged(FuzzyTermsEnum.java:233)
>    [junit4]    >        at org.apache.lucene.search.FuzzyTermsEnum.<init>(FuzzyTermsEnum.java:148)
>    [junit4]    >        at org.apache.lucene.search.FuzzyQuery.getTermsEnum(FuzzyQuery.java:182)
>    [junit4]    >        at org.apache.lucene.search.MultiTermQuery.getTermsEnum(MultiTermQuery.java:303)
>    [junit4]    >        at org.apache.lucene.search.TestFuzzyQuery.lambda$testErrorMessage$6(TestFuzzyQuery.java:508)
>    [junit4]    >        at org.apache.lucene.util.LuceneTestCase._expectThrows(LuceneTestCase.java:2871)
>    [junit4]    >        at org.apache.lucene.util.LuceneTestCase.expectThrows(LuceneTestCase.java:2746)
>    [junit4]    >        ... 38 more
>    [junit4] OK      0.05s J0 | TestFuzzyQuery.testBasicPrefix
>    [junit4] OK      0.23s J0 | TestFuzzyQuery.testMultipleQueriesIdfWorks
>    [junit4] OK      0.37s J0 | TestFuzzyQuery.testSingleQueryExactMatchScoresHighest
>    [junit4]   2> NOTE: test params are: codec=DummyCompressingStoredFields(storedFieldsFormat=CompressingStoredFieldsFormat(compressionMode=DUMMY, chunkSize=5, maxDocsPerChunk=10, blockSize=8), termVectorsFormat=CompressingTermVectorsFormat(compressionMode=DUMMY, chunkSize=5, blockSize=8)), sim=Asserting(org.apache.lucene.search.similarities.AssertingSimilarity@5d43fa98), locale=fr-GN, timezone=US/Pacific-New
>    [junit4]   2> NOTE: Mac OS X 10.11.6 x86_64/AdoptOpenJDK 13.0.1 (64-bit)/cpus=3,threads=1,free=70216424,total=130023424
>    [junit4]   2> NOTE: All tests run in this JVM: [TestFuzzyQuery]
>    [junit4] Completed [2/5 (2!)] on J0 in 6.25s, 12 tests, 1 failure <<< FAILURES!
>
> [...truncated 1 lines...]
>    [junit4] Suite: org.apache.lucene.search.TestFuzzyQuery
>    [junit4] OK      0.17s J0 | TestFuzzyQuery.test2
>    [junit4] OK      0.01s J0 | TestFuzzyQuery.testValidation
>    [junit4] OK      0.08s J0 | TestFuzzyQuery.testGiga
>    [junit4] OK      0.06s J0 | TestFuzzyQuery.testDistanceAsEditsSearching
>    [junit4] OK      1.68s J0 | TestFuzzyQuery.testRandom
>    [junit4] OK      0.23s J0 | TestFuzzyQuery.testBoostOnlyRewrite
>    [junit4] OK      0.37s J0 | TestFuzzyQuery.testTieBreaker
>    [junit4] OK      0.15s J0 | TestFuzzyQuery.testFuzziness
>    [junit4]   2> NOTE: reproduce with: ant test  -Dtestcase=TestFuzzyQuery -Dtests.method=testErrorMessage -Dtests.seed=CE3DF037C6D29401 -Dtests.slow=true -Dtests.badapples=true -Dtests.locale=fr-GN -Dtests.timezone=US/Pacific-New -Dtests.asserts=true -Dtests.file.encoding=ISO-8859-1
>    [junit4] FAILURE 0.21s J0 | TestFuzzyQuery.testErrorMessage <<<
>    [junit4]    > Throwable #1: junit.framework.AssertionFailedError: Unexpected exception type, expected FuzzyTermsException but got java.lang.UnsupportedOperationException
>    [junit4]    >        at __randomizedtesting.SeedInfo.seed([CE3DF037C6D29401:1836CAB94FFCBD4F]:0)
>    [junit4]    >        at org.apache.lucene.util.LuceneTestCase.expectThrows(LuceneTestCase.java:2753)
>    [junit4]    >        at org.apache.lucene.util.LuceneTestCase.expectThrows(LuceneTestCase.java:2741)
>    [junit4]    >        at org.apache.lucene.search.TestFuzzyQuery.testErrorMessage(TestFuzzyQuery.java:507)
>    [junit4]    >        at java.base/jdk.internal.reflect.NativeMethodAccessorImpl.invoke0(Native Method)
>    [junit4]    >        at java.base/jdk.internal.reflect.NativeMethodAccessorImpl.invoke(NativeMethodAccessorImpl.java:62)
>    [junit4]    >        at java.base/jdk.internal.reflect.DelegatingMethodAccessorImpl.invoke(DelegatingMethodAccessorImpl.java:43)
>    [junit4]    >        at java.base/java.lang.reflect.Method.invoke(Method.java:567)
>    [junit4]    >        at java.base/java.lang.Thread.run(Thread.java:830)
>    [junit4]    > Caused by: java.lang.UnsupportedOperationException
>    [junit4]    >        at org.apache.lucene.search.TestFuzzyQuery$1.iterator(TestFuzzyQuery.java:511)
>    [junit4]    >        at org.apache.lucene.index.Terms.intersect(Terms.java:70)
>    [junit4]    >        at org.apache.lucene.search.FuzzyTermsEnum.getAutomatonEnum(FuzzyTermsEnum.java:206)
>    [junit4]    >        at org.apache.lucene.search.FuzzyTermsEnum.bottomChanged(FuzzyTermsEnum.java:233)
>    [junit4]    >        at org.apache.lucene.search.FuzzyTermsEnum.<init>(FuzzyTermsEnum.java:148)
>    [junit4]    >        at org.apache.lucene.search.FuzzyQuery.getTermsEnum(FuzzyQuery.java:182)
>    [junit4]    >        at org.apache.lucene.search.MultiTermQuery.getTermsEnum(MultiTermQuery.java:303)
>    [junit4]    >        at org.apache.lucene.search.TestFuzzyQuery.lambda$testErrorMessage$6(TestFuzzyQuery.java:508)
>    [junit4]    >        at org.apache.lucene.util.LuceneTestCase._expectThrows(LuceneTestCase.java:2871)
>    [junit4]    >        at org.apache.lucene.util.LuceneTestCase.expectThrows(LuceneTestCase.java:2746)
>    [junit4]    >        ... 38 more
>    [junit4] OK      0.20s J0 | TestFuzzyQuery.testBasicPrefix
>    [junit4] OK      0.14s J0 | TestFuzzyQuery.testMultipleQueriesIdfWorks
>    [junit4] OK      0.11s J0 | TestFuzzyQuery.testSingleQueryExactMatchScoresHighest
>    [junit4]   2> NOTE: test params are: codec=DummyCompressingStoredFields(storedFieldsFormat=CompressingStoredFieldsFormat(compressionMode=DUMMY, chunkSize=5, maxDocsPerChunk=10, blockSize=8), termVectorsFormat=CompressingTermVectorsFormat(compressionMode=DUMMY, chunkSize=5, blockSize=8)), sim=Asserting(org.apache.lucene.search.similarities.AssertingSimilarity@25dfbd97), locale=fr-GN, timezone=US/Pacific-New
>    [junit4]   2> NOTE: Mac OS X 10.11.6 x86_64/AdoptOpenJDK 13.0.1 (64-bit)/cpus=3,threads=1,free=63667880,total=103809024
>    [junit4]   2> NOTE: All tests run in this JVM: [TestFuzzyQuery, TestFuzzyQuery]
>    [junit4] Completed [3/5 (3!)] on J0 in 3.43s, 12 tests, 1 failure <<< FAILURES!
>
> [...truncated 1 lines...]
>    [junit4] Suite: org.apache.lucene.search.TestFuzzyQuery
>    [junit4] OK      0.17s J1 | TestFuzzyQuery.test2
>    [junit4] OK      0.00s J1 | TestFuzzyQuery.testValidation
>    [junit4] OK      0.07s J1 | TestFuzzyQuery.testGiga
>    [junit4] OK      0.07s J1 | TestFuzzyQuery.testDistanceAsEditsSearching
>    [junit4] OK      1.67s J1 | TestFuzzyQuery.testRandom
>    [junit4] OK      0.22s J1 | TestFuzzyQuery.testBoostOnlyRewrite
>    [junit4] OK      0.25s J1 | TestFuzzyQuery.testTieBreaker
>    [junit4] OK      0.10s J1 | TestFuzzyQuery.testFuzziness
>    [junit4]   2> NOTE: reproduce with: ant test  -Dtestcase=TestFuzzyQuery -Dtests.method=testErrorMessage -Dtests.seed=CE3DF037C6D29401 -Dtests.slow=true -Dtests.badapples=true -Dtests.locale=fr-GN -Dtests.timezone=US/Pacific-New -Dtests.asserts=true -Dtests.file.encoding=ISO-8859-1
>    [junit4] FAILURE 0.24s J1 | TestFuzzyQuery.testErrorMessage <<<
>    [junit4]    > Throwable #1: junit.framework.AssertionFailedError: Unexpected exception type, expected FuzzyTermsException but got java.lang.UnsupportedOperationException
>    [junit4]    >        at __randomizedtesting.SeedInfo.seed([CE3DF037C6D29401:1836CAB94FFCBD4F]:0)
>    [junit4]    >        at org.apache.lucene.util.LuceneTestCase.expectThrows(LuceneTestCase.java:2753)
>    [junit4]    >        at org.apache.lucene.util.LuceneTestCase.expectThrows(LuceneTestCase.java:2741)
>    [junit4]    >        at org.apache.lucene.search.TestFuzzyQuery.testErrorMessage(TestFuzzyQuery.java:507)
>    [junit4]    >        at java.base/jdk.internal.reflect.NativeMethodAccessorImpl.invoke0(Native Method)
>    [junit4]    >        at java.base/jdk.internal.reflect.NativeMethodAccessorImpl.invoke(NativeMethodAccessorImpl.java:62)
>    [junit4]    >        at java.base/jdk.internal.reflect.DelegatingMethodAccessorImpl.invoke(DelegatingMethodAccessorImpl.java:43)
>    [junit4]    >        at java.base/java.lang.reflect.Method.invoke(Method.java:567)
>    [junit4]    >        at java.base/java.lang.Thread.run(Thread.java:830)
>    [junit4]    > Caused by: java.lang.UnsupportedOperationException
>    [junit4]    >        at org.apache.lucene.search.TestFuzzyQuery$1.iterator(TestFuzzyQuery.java:511)
>    [junit4]    >        at org.apache.lucene.index.Terms.intersect(Terms.java:70)
>    [junit4]    >        at org.apache.lucene.search.FuzzyTermsEnum.getAutomatonEnum(FuzzyTermsEnum.java:206)
>    [junit4]    >        at org.apache.lucene.search.FuzzyTermsEnum.bottomChanged(FuzzyTermsEnum.java:233)
>    [junit4]    >        at org.apache.lucene.search.FuzzyTermsEnum.<init>(FuzzyTermsEnum.java:148)
>    [junit4]    >        at org.apache.lucene.search.FuzzyQuery.getTermsEnum(FuzzyQuery.java:182)
>    [junit4]    >        at org.apache.lucene.search.MultiTermQuery.getTermsEnum(MultiTermQuery.java:303)
>    [junit4]    >        at org.apache.lucene.search.TestFuzzyQuery.lambda$testErrorMessage$6(TestFuzzyQuery.java:508)
>    [junit4]    >        at org.apache.lucene.util.LuceneTestCase._expectThrows(LuceneTestCase.java:2871)
>    [junit4]    >        at org.apache.lucene.util.LuceneTestCase.expectThrows(LuceneTestCase.java:2746)
>    [junit4]    >        ... 38 more
>    [junit4] OK      0.26s J1 | TestFuzzyQuery.testBasicPrefix
>    [junit4] OK      0.13s J1 | TestFuzzyQuery.testMultipleQueriesIdfWorks
>    [junit4] OK      0.10s J1 | TestFuzzyQuery.testSingleQueryExactMatchScoresHighest
>    [junit4]   2> NOTE: test params are: codec=DummyCompressingStoredFields(storedFieldsFormat=CompressingStoredFieldsFormat(compressionMode=DUMMY, chunkSize=5, maxDocsPerChunk=10, blockSize=8), termVectorsFormat=CompressingTermVectorsFormat(compressionMode=DUMMY, chunkSize=5, blockSize=8)), sim=Asserting(org.apache.lucene.search.similarities.AssertingSimilarity@3ab3c29b), locale=fr-GN, timezone=US/Pacific-New
>    [junit4]   2> NOTE: Mac OS X 10.11.6 x86_64/AdoptOpenJDK 13.0.1 (64-bit)/cpus=3,threads=1,free=52426496,total=93323264
>    [junit4]   2> NOTE: All tests run in this JVM: [TestFuzzyQuery, TestFuzzyQuery]
>    [junit4] Completed [4/5 (4!)] on J1 in 3.34s, 12 tests, 1 failure <<< FAILURES!
>
> [...truncated 1 lines...]
>    [junit4] Suite: org.apache.lucene.search.TestFuzzyQuery
>    [junit4] OK      0.02s J0 | TestFuzzyQuery.test2
>    [junit4] OK      0.01s J0 | TestFuzzyQuery.testValidation
>    [junit4] OK      0.02s J0 | TestFuzzyQuery.testGiga
>    [junit4] OK      0.02s J0 | TestFuzzyQuery.testDistanceAsEditsSearching
>    [junit4] OK      0.89s J0 | TestFuzzyQuery.testRandom
>    [junit4] OK      0.01s J0 | TestFuzzyQuery.testBoostOnlyRewrite
>    [junit4] OK      0.02s J0 | TestFuzzyQuery.testTieBreaker
>    [junit4] OK      0.03s J0 | TestFuzzyQuery.testFuzziness
>    [junit4]   2> NOTE: reproduce with: ant test  -Dtestcase=TestFuzzyQuery -Dtests.method=testErrorMessage -Dtests.seed=CE3DF037C6D29401 -Dtests.slow=true -Dtests.badapples=true -Dtests.locale=fr-GN -Dtests.timezone=US/Pacific-New -Dtests.asserts=true -Dtests.file.encoding=ISO-8859-1
>    [junit4] FAILURE 0.15s J0 | TestFuzzyQuery.testErrorMessage <<<
>    [junit4]    > Throwable #1: junit.framework.AssertionFailedError: Unexpected exception type, expected FuzzyTermsException but got java.lang.UnsupportedOperationException
>    [junit4]    >        at __randomizedtesting.SeedInfo.seed([CE3DF037C6D29401:1836CAB94FFCBD4F]:0)
>    [junit4]    >        at org.apache.lucene.util.LuceneTestCase.expectThrows(LuceneTestCase.java:2753)
>    [junit4]    >        at org.apache.lucene.util.LuceneTestCase.expectThrows(LuceneTestCase.java:2741)
>    [junit4]    >        at org.apache.lucene.search.TestFuzzyQuery.testErrorMessage(TestFuzzyQuery.java:507)
>    [junit4]    >        at java.base/jdk.internal.reflect.NativeMethodAccessorImpl.invoke0(Native Method)
>    [junit4]    >        at java.base/jdk.internal.reflect.NativeMethodAccessorImpl.invoke(NativeMethodAccessorImpl.java:62)
>    [junit4]    >        at java.base/jdk.internal.reflect.DelegatingMethodAccessorImpl.invoke(DelegatingMethodAccessorImpl.java:43)
>    [junit4]    >        at java.base/java.lang.reflect.Method.invoke(Method.java:567)
>    [junit4]    >        at java.base/java.lang.Thread.run(Thread.java:830)
>    [junit4]    > Caused by: java.lang.UnsupportedOperationException
>    [junit4]    >        at org.apache.lucene.search.TestFuzzyQuery$1.iterator(TestFuzzyQuery.java:511)
>    [junit4]    >        at org.apache.lucene.index.Terms.intersect(Terms.java:70)
>    [junit4]    >        at org.apache.lucene.search.FuzzyTermsEnum.getAutomatonEnum(FuzzyTermsEnum.java:206)
>    [junit4]    >        at org.apache.lucene.search.FuzzyTermsEnum.bottomChanged(FuzzyTermsEnum.java:233)
>    [junit4]    >        at org.apache.lucene.search.FuzzyTermsEnum.<init>(FuzzyTermsEnum.java:148)
>    [junit4]    >        at org.apache.lucene.search.FuzzyQuery.getTermsEnum(FuzzyQuery.java:182)
>    [junit4]    >        at org.apache.lucene.search.MultiTermQuery.getTermsEnum(MultiTermQuery.java:303)
>    [junit4]    >        at org.apache.lucene.search.TestFuzzyQuery.lambda$testErrorMessage$6(TestFuzzyQuery.java:508)
>    [junit4]    >        at org.apache.lucene.util.LuceneTestCase._expectThrows(LuceneTestCase.java:2871)
>    [junit4]    >        at org.apache.lucene.util.LuceneTestCase.expectThrows(LuceneTestCase.java:2746)
>    [junit4]    >        ... 38 more
>    [junit4] OK      0.01s J0 | TestFuzzyQuery.testBasicPrefix
>    [junit4] OK      0.02s J0 | TestFuzzyQuery.testMultipleQueriesIdfWorks
>    [junit4] OK      0.02s J0 | TestFuzzyQuery.testSingleQueryExactMatchScoresHighest
>    [junit4]   2> NOTE: test params are: codec=DummyCompressingStoredFields(storedFieldsFormat=CompressingStoredFieldsFormat(compressionMode=DUMMY, chunkSize=5, maxDocsPerChunk=10, blockSize=8), termVectorsFormat=CompressingTermVectorsFormat(compressionMode=DUMMY, chunkSize=5, blockSize=8)), sim=Asserting(org.apache.lucene.search.similarities.AssertingSimilarity@6f5ba440), locale=fr-GN, timezone=US/Pacific-New
>    [junit4]   2> NOTE: Mac OS X 10.11.6 x86_64/AdoptOpenJDK 13.0.1 (64-bit)/cpus=3,threads=1,free=56886936,total=80216064
>    [junit4]   2> NOTE: All tests run in this JVM: [TestFuzzyQuery, TestFuzzyQuery, TestFuzzyQuery]
>    [junit4] Completed [5/5 (5!)] on J0 in 1.24s, 12 tests, 1 failure <<< FAILURES!
>
> [...truncated 14 lines...]
> BUILD FAILED
> /Users/jenkins/workspace/Lucene-Solr-master-MacOSX/lucene/common-build.xml:1510: The following error occurred while executing this line:
> /Users/jenkins/workspace/Lucene-Solr-master-MacOSX/lucene/common-build.xml:1037: There were test failures: 5 suites, 60 tests, 5 failures [seed: CE3DF037C6D29401]
>
> Total time: 14 seconds
>
> [repro] Setting last failure code to 256
>
> [repro] Failures w/original seeds:
> [repro]   5/5 failed: org.apache.lucene.search.TestFuzzyQuery
> [repro] Exiting with code 256
> + mv lucene/build lucene/build.repro
> + mv solr/build solr/build.repro
> mv: rename solr/build to solr/build.repro: No such file or directory
> + true
> + mv lucene/build.orig lucene/build
> + mv solr/build.orig solr/build
> Archiving artifacts
> Setting ANT_1_8_2_HOME=/Users/jenkins/tools/hudson.tasks.Ant_AntInstallation/ANT_1.8.2
> [WARNINGS] Parsing warnings in console log with parser Java Compiler (javac)
> Setting ANT_1_8_2_HOME=/Users/jenkins/tools/hudson.tasks.Ant_AntInstallation/ANT_1.8.2
> No credentials specified
> Setting ANT_1_8_2_HOME=/Users/jenkins/tools/hudson.tasks.Ant_AntInstallation/ANT_1.8.2
> <Git Blamer> Using GitBlamer to create author and commit information for all warnings.
> <Git Blamer> GIT_COMMIT=7d0cf0df3286dba2354fc854a64eac5dcc09961a, workspace=/Users/jenkins/workspace/Lucene-Solr-master-MacOSX
> [WARNINGS] Computing warning deltas based on reference build #5513
> Recording test results
> Setting ANT_1_8_2_HOME=/Users/jenkins/tools/hudson.tasks.Ant_AntInstallation/ANT_1.8.2
> Build step 'Publish JUnit test result report' changed build result to UNSTABLE
> Email was triggered for: Unstable (Test Failures)
> Sending email for trigger: Unstable (Test Failures)
> Setting ANT_1_8_2_HOME=/Users/jenkins/tools/hudson.tasks.Ant_AntInstallation/ANT_1.8.2
> Setting ANT_1_8_2_HOME=/Users/jenkins/tools/hudson.tasks.Ant_AntInstallation/ANT_1.8.2
> Setting ANT_1_8_2_HOME=/Users/jenkins/tools/hudson.tasks.Ant_AntInstallation/ANT_1.8.2
> Setting ANT_1_8_2_HOME=/Users/jenkins/tools/hudson.tasks.Ant_AntInstallation/ANT_1.8.2
> Setting ANT_1_8_2_HOME=/Users/jenkins/tools/hudson.tasks.Ant_AntInstallation/ANT_1.8.2
> Setting ANT_1_8_2_HOME=/Users/jenkins/tools/hudson.tasks.Ant_AntInstallation/ANT_1.8.2
>
> ---------------------------------------------------------------------
> To unsubscribe, e-mail: [hidden email]
> For additional commands, e-mail: [hidden email]

---------------------------------------------------------------------
To unsubscribe, e-mail: [hidden email]
For additional commands, e-mail: [hidden email]