Re: [JENKINS] Lucene-Solr-master-Windows (64bit/jdk-11.0.4) - Build # 8213 - Still Unstable!

classic Classic list List threaded Threaded
1 message Options
Reply | Threaded
Open this post in threaded view
|

Re: [JENKINS] Lucene-Solr-master-Windows (64bit/jdk-11.0.4) - Build # 8213 - Still Unstable!

Noble Paul നോബിള്‍  नोब्ळ्
The test is TestPackages is disabled in Windows (for the time being)
using the annotation
@LuceneTestCase.SuppressFileSystems("WindowsFS")

I'm wondering if the annotation is indeed working? Why is it being run?

On Fri, Nov 1, 2019 at 6:58 AM Policeman Jenkins Server
<[hidden email]> wrote:

>
> Build: https://jenkins.thetaphi.de/job/Lucene-Solr-master-Windows/8213/
> Java: 64bit/jdk-11.0.4 -XX:+UseCompressedOops -XX:+UseConcMarkSweepGC
>
> 14 tests failed.
> FAILED:  org.apache.solr.ltr.store.rest.TestModelManagerPersistence.testFilePersistence
>
> Error Message:
> Software caused connection abort: recv failed
>
> Stack Trace:
> javax.net.ssl.SSLException: Software caused connection abort: recv failed
>         at __randomizedtesting.SeedInfo.seed([60CD0E908CE38B0A:426C6AED298FED4F]:0)
>         at java.base/sun.security.ssl.Alert.createSSLException(Alert.java:127)
>         at java.base/sun.security.ssl.TransportContext.fatal(TransportContext.java:320)
>         at java.base/sun.security.ssl.TransportContext.fatal(TransportContext.java:263)
>         at java.base/sun.security.ssl.TransportContext.fatal(TransportContext.java:258)
>         at java.base/sun.security.ssl.SSLSocketImpl.handleException(SSLSocketImpl.java:1315)
>         at java.base/sun.security.ssl.SSLSocketImpl$AppInputStream.read(SSLSocketImpl.java:839)
>         at org.apache.http.impl.io.SessionInputBufferImpl.streamRead(SessionInputBufferImpl.java:137)
>         at org.apache.http.impl.io.SessionInputBufferImpl.fillBuffer(SessionInputBufferImpl.java:153)
>         at org.apache.http.impl.io.SessionInputBufferImpl.readLine(SessionInputBufferImpl.java:282)
>         at org.apache.http.impl.conn.DefaultHttpResponseParser.parseHead(DefaultHttpResponseParser.java:138)
>         at org.apache.http.impl.conn.DefaultHttpResponseParser.parseHead(DefaultHttpResponseParser.java:56)
>         at org.apache.http.impl.io.AbstractMessageParser.parse(AbstractMessageParser.java:259)
>         at org.apache.http.impl.DefaultBHttpClientConnection.receiveResponseHeader(DefaultBHttpClientConnection.java:163)
>         at org.apache.http.impl.conn.CPoolProxy.receiveResponseHeader(CPoolProxy.java:165)
>         at org.apache.http.protocol.HttpRequestExecutor.doReceiveResponse(HttpRequestExecutor.java:273)
>         at org.apache.http.protocol.HttpRequestExecutor.execute(HttpRequestExecutor.java:125)
>         at org.apache.http.impl.execchain.MainClientExec.execute(MainClientExec.java:272)
>         at org.apache.http.impl.execchain.ProtocolExec.execute(ProtocolExec.java:185)
>         at org.apache.http.impl.execchain.RetryExec.execute(RetryExec.java:89)
>         at org.apache.http.impl.execchain.RedirectExec.execute(RedirectExec.java:110)
>         at org.apache.http.impl.client.InternalHttpClient.doExecute(InternalHttpClient.java:185)
>         at org.apache.http.impl.client.CloseableHttpClient.execute(CloseableHttpClient.java:83)
>         at org.apache.solr.util.RestTestHarness.getResponse(RestTestHarness.java:215)
>         at org.apache.solr.util.RestTestHarness.query(RestTestHarness.java:107)
>         at org.apache.solr.util.RestTestBase.assertJQ(RestTestBase.java:226)
>         at org.apache.solr.util.RestTestBase.assertJQ(RestTestBase.java:192)
>         at org.apache.solr.ltr.store.rest.TestModelManagerPersistence.testFilePersistence(TestModelManagerPersistence.java:173)
>         at java.base/jdk.internal.reflect.NativeMethodAccessorImpl.invoke0(Native Method)
>         at java.base/jdk.internal.reflect.NativeMethodAccessorImpl.invoke(NativeMethodAccessorImpl.java:62)
>         at java.base/jdk.internal.reflect.DelegatingMethodAccessorImpl.invoke(DelegatingMethodAccessorImpl.java:43)
>         at java.base/java.lang.reflect.Method.invoke(Method.java:566)
>         at com.carrotsearch.randomizedtesting.RandomizedRunner.invoke(RandomizedRunner.java:1750)
>         at com.carrotsearch.randomizedtesting.RandomizedRunner$8.evaluate(RandomizedRunner.java:938)
>         at com.carrotsearch.randomizedtesting.RandomizedRunner$9.evaluate(RandomizedRunner.java:974)
>         at com.carrotsearch.randomizedtesting.RandomizedRunner$10.evaluate(RandomizedRunner.java:988)
>         at com.carrotsearch.randomizedtesting.rules.SystemPropertiesRestoreRule$1.evaluate(SystemPropertiesRestoreRule.java:57)
>         at org.apache.lucene.util.TestRuleSetupTeardownChained$1.evaluate(TestRuleSetupTeardownChained.java:49)
>         at org.apache.lucene.util.AbstractBeforeAfterRule$1.evaluate(AbstractBeforeAfterRule.java:45)
>         at org.apache.lucene.util.TestRuleThreadAndTestName$1.evaluate(TestRuleThreadAndTestName.java:48)
>         at org.apache.lucene.util.TestRuleIgnoreAfterMaxFailures$1.evaluate(TestRuleIgnoreAfterMaxFailures.java:64)
>         at org.apache.lucene.util.TestRuleMarkFailure$1.evaluate(TestRuleMarkFailure.java:47)
>         at com.carrotsearch.randomizedtesting.rules.StatementAdapter.evaluate(StatementAdapter.java:36)
>         at com.carrotsearch.randomizedtesting.ThreadLeakControl$StatementRunner.run(ThreadLeakControl.java:368)
>         at com.carrotsearch.randomizedtesting.ThreadLeakControl.forkTimeoutingTask(ThreadLeakControl.java:817)
>         at com.carrotsearch.randomizedtesting.ThreadLeakControl$3.evaluate(ThreadLeakControl.java:468)
>         at com.carrotsearch.randomizedtesting.RandomizedRunner.runSingleTest(RandomizedRunner.java:947)
>         at com.carrotsearch.randomizedtesting.RandomizedRunner$5.evaluate(RandomizedRunner.java:832)
>         at com.carrotsearch.randomizedtesting.RandomizedRunner$6.evaluate(RandomizedRunner.java:883)
>         at com.carrotsearch.randomizedtesting.RandomizedRunner$7.evaluate(RandomizedRunner.java:894)
>         at com.carrotsearch.randomizedtesting.rules.StatementAdapter.evaluate(StatementAdapter.java:36)
>         at com.carrotsearch.randomizedtesting.rules.SystemPropertiesRestoreRule$1.evaluate(SystemPropertiesRestoreRule.java:57)
>         at org.apache.lucene.util.AbstractBeforeAfterRule$1.evaluate(AbstractBeforeAfterRule.java:45)
>         at com.carrotsearch.randomizedtesting.rules.StatementAdapter.evaluate(StatementAdapter.java:36)
>         at org.apache.lucene.util.TestRuleStoreClassName$1.evaluate(TestRuleStoreClassName.java:41)
>         at com.carrotsearch.randomizedtesting.rules.NoShadowingOrOverridesOnMethodsRule$1.evaluate(NoShadowingOrOverridesOnMethodsRule.java:40)
>         at com.carrotsearch.randomizedtesting.rules.NoShadowingOrOverridesOnMethodsRule$1.evaluate(NoShadowingOrOverridesOnMethodsRule.java:40)
>         at com.carrotsearch.randomizedtesting.rules.StatementAdapter.evaluate(StatementAdapter.java:36)
>         at com.carrotsearch.randomizedtesting.rules.StatementAdapter.evaluate(StatementAdapter.java:36)
>         at org.apache.lucene.util.TestRuleAssertionsRequired$1.evaluate(TestRuleAssertionsRequired.java:53)
>         at org.apache.lucene.util.TestRuleMarkFailure$1.evaluate(TestRuleMarkFailure.java:47)
>         at org.apache.lucene.util.TestRuleIgnoreAfterMaxFailures$1.evaluate(TestRuleIgnoreAfterMaxFailures.java:64)
>         at org.apache.lucene.util.TestRuleIgnoreTestSuites$1.evaluate(TestRuleIgnoreTestSuites.java:54)
>         at com.carrotsearch.randomizedtesting.rules.StatementAdapter.evaluate(StatementAdapter.java:36)
>         at com.carrotsearch.randomizedtesting.ThreadLeakControl$StatementRunner.run(ThreadLeakControl.java:368)
>         at java.base/java.lang.Thread.run(Thread.java:834)
>         Suppressed: java.net.SocketException: Software caused connection abort: socket write error
>                 at java.base/java.net.SocketOutputStream.socketWrite0(Native Method)
>                 at java.base/java.net.SocketOutputStream.socketWrite(SocketOutputStream.java:110)
>                 at java.base/java.net.SocketOutputStream.write(SocketOutputStream.java:150)
>                 at java.base/sun.security.ssl.SSLSocketOutputRecord.encodeAlert(SSLSocketOutputRecord.java:81)
>                 at java.base/sun.security.ssl.TransportContext.fatal(TransportContext.java:351)
>                 ... 63 more
> Caused by: java.net.SocketException: Software caused connection abort: recv failed
>         at java.base/java.net.SocketInputStream.socketRead0(Native Method)
>         at java.base/java.net.SocketInputStream.socketRead(SocketInputStream.java:115)
>         at java.base/java.net.SocketInputStream.read(SocketInputStream.java:168)
>         at java.base/java.net.SocketInputStream.read(SocketInputStream.java:140)
>         at java.base/sun.security.ssl.SSLSocketInputRecord.read(SSLSocketInputRecord.java:448)
>         at java.base/sun.security.ssl.SSLSocketInputRecord.bytesInCompletePacket(SSLSocketInputRecord.java:68)
>         at java.base/sun.security.ssl.SSLSocketImpl.readApplicationRecord(SSLSocketImpl.java:1104)
>         at java.base/sun.security.ssl.SSLSocketImpl$AppInputStream.read(SSLSocketImpl.java:823)
>         ... 59 more
>
>
> FAILED:  org.apache.solr.ltr.store.rest.TestModelManagerPersistence.testWrapperModelPersistence
>
> Error Message:
> Software caused connection abort: recv failed
>
> Stack Trace:
> javax.net.ssl.SSLException: Software caused connection abort: recv failed
>         at __randomizedtesting.SeedInfo.seed([60CD0E908CE38B0A:15A77D4E331FF24F]:0)
>         at java.base/sun.security.ssl.Alert.createSSLException(Alert.java:127)
>         at java.base/sun.security.ssl.TransportContext.fatal(TransportContext.java:320)
>         at java.base/sun.security.ssl.TransportContext.fatal(TransportContext.java:263)
>         at java.base/sun.security.ssl.TransportContext.fatal(TransportContext.java:258)
>         at java.base/sun.security.ssl.SSLSocketImpl.handleException(SSLSocketImpl.java:1315)
>         at java.base/sun.security.ssl.SSLSocketImpl$AppInputStream.read(SSLSocketImpl.java:839)
>         at org.apache.http.impl.io.SessionInputBufferImpl.streamRead(SessionInputBufferImpl.java:137)
>         at org.apache.http.impl.io.SessionInputBufferImpl.fillBuffer(SessionInputBufferImpl.java:153)
>         at org.apache.http.impl.io.SessionInputBufferImpl.readLine(SessionInputBufferImpl.java:282)
>         at org.apache.http.impl.conn.DefaultHttpResponseParser.parseHead(DefaultHttpResponseParser.java:138)
>         at org.apache.http.impl.conn.DefaultHttpResponseParser.parseHead(DefaultHttpResponseParser.java:56)
>         at org.apache.http.impl.io.AbstractMessageParser.parse(AbstractMessageParser.java:259)
>         at org.apache.http.impl.DefaultBHttpClientConnection.receiveResponseHeader(DefaultBHttpClientConnection.java:163)
>         at org.apache.http.impl.conn.CPoolProxy.receiveResponseHeader(CPoolProxy.java:165)
>         at org.apache.http.protocol.HttpRequestExecutor.doReceiveResponse(HttpRequestExecutor.java:273)
>         at org.apache.http.protocol.HttpRequestExecutor.execute(HttpRequestExecutor.java:125)
>         at org.apache.http.impl.execchain.MainClientExec.execute(MainClientExec.java:272)
>         at org.apache.http.impl.execchain.ProtocolExec.execute(ProtocolExec.java:185)
>         at org.apache.http.impl.execchain.RetryExec.execute(RetryExec.java:89)
>         at org.apache.http.impl.execchain.RedirectExec.execute(RedirectExec.java:110)
>         at org.apache.http.impl.client.InternalHttpClient.doExecute(InternalHttpClient.java:185)
>         at org.apache.http.impl.client.CloseableHttpClient.execute(CloseableHttpClient.java:83)
>         at org.apache.solr.util.RestTestHarness.getResponse(RestTestHarness.java:215)
>         at org.apache.solr.util.RestTestHarness.query(RestTestHarness.java:107)
>         at org.apache.solr.util.RestTestBase.assertJQ(RestTestBase.java:226)
>         at org.apache.solr.util.RestTestBase.assertJQ(RestTestBase.java:192)
>         at org.apache.solr.ltr.store.rest.TestModelManagerPersistence.doWrapperModelPersistenceChecks(TestModelManagerPersistence.java:207)
>         at org.apache.solr.ltr.store.rest.TestModelManagerPersistence.testWrapperModelPersistence(TestModelManagerPersistence.java:260)
>         at java.base/jdk.internal.reflect.NativeMethodAccessorImpl.invoke0(Native Method)
>         at java.base/jdk.internal.reflect.NativeMethodAccessorImpl.invoke(NativeMethodAccessorImpl.java:62)
>         at java.base/jdk.internal.reflect.DelegatingMethodAccessorImpl.invoke(DelegatingMethodAccessorImpl.java:43)
>         at java.base/java.lang.reflect.Method.invoke(Method.java:566)
>         at com.carrotsearch.randomizedtesting.RandomizedRunner.invoke(RandomizedRunner.java:1750)
>         at com.carrotsearch.randomizedtesting.RandomizedRunner$8.evaluate(RandomizedRunner.java:938)
>         at com.carrotsearch.randomizedtesting.RandomizedRunner$9.evaluate(RandomizedRunner.java:974)
>         at com.carrotsearch.randomizedtesting.RandomizedRunner$10.evaluate(RandomizedRunner.java:988)
>         at com.carrotsearch.randomizedtesting.rules.SystemPropertiesRestoreRule$1.evaluate(SystemPropertiesRestoreRule.java:57)
>         at org.apache.lucene.util.TestRuleSetupTeardownChained$1.evaluate(TestRuleSetupTeardownChained.java:49)
>         at org.apache.lucene.util.AbstractBeforeAfterRule$1.evaluate(AbstractBeforeAfterRule.java:45)
>         at org.apache.lucene.util.TestRuleThreadAndTestName$1.evaluate(TestRuleThreadAndTestName.java:48)
>         at org.apache.lucene.util.TestRuleIgnoreAfterMaxFailures$1.evaluate(TestRuleIgnoreAfterMaxFailures.java:64)
>         at org.apache.lucene.util.TestRuleMarkFailure$1.evaluate(TestRuleMarkFailure.java:47)
>         at com.carrotsearch.randomizedtesting.rules.StatementAdapter.evaluate(StatementAdapter.java:36)
>         at com.carrotsearch.randomizedtesting.ThreadLeakControl$StatementRunner.run(ThreadLeakControl.java:368)
>         at com.carrotsearch.randomizedtesting.ThreadLeakControl.forkTimeoutingTask(ThreadLeakControl.java:817)
>         at com.carrotsearch.randomizedtesting.ThreadLeakControl$3.evaluate(ThreadLeakControl.java:468)
>         at com.carrotsearch.randomizedtesting.RandomizedRunner.runSingleTest(RandomizedRunner.java:947)
>         at com.carrotsearch.randomizedtesting.RandomizedRunner$5.evaluate(RandomizedRunner.java:832)
>         at com.carrotsearch.randomizedtesting.RandomizedRunner$6.evaluate(RandomizedRunner.java:883)
>         at com.carrotsearch.randomizedtesting.RandomizedRunner$7.evaluate(RandomizedRunner.java:894)
>         at com.carrotsearch.randomizedtesting.rules.StatementAdapter.evaluate(StatementAdapter.java:36)
>         at com.carrotsearch.randomizedtesting.rules.SystemPropertiesRestoreRule$1.evaluate(SystemPropertiesRestoreRule.java:57)
>         at org.apache.lucene.util.AbstractBeforeAfterRule$1.evaluate(AbstractBeforeAfterRule.java:45)
>         at com.carrotsearch.randomizedtesting.rules.StatementAdapter.evaluate(StatementAdapter.java:36)
>         at org.apache.lucene.util.TestRuleStoreClassName$1.evaluate(TestRuleStoreClassName.java:41)
>         at com.carrotsearch.randomizedtesting.rules.NoShadowingOrOverridesOnMethodsRule$1.evaluate(NoShadowingOrOverridesOnMethodsRule.java:40)
>         at com.carrotsearch.randomizedtesting.rules.NoShadowingOrOverridesOnMethodsRule$1.evaluate(NoShadowingOrOverridesOnMethodsRule.java:40)
>         at com.carrotsearch.randomizedtesting.rules.StatementAdapter.evaluate(StatementAdapter.java:36)
>         at com.carrotsearch.randomizedtesting.rules.StatementAdapter.evaluate(StatementAdapter.java:36)
>         at org.apache.lucene.util.TestRuleAssertionsRequired$1.evaluate(TestRuleAssertionsRequired.java:53)
>         at org.apache.lucene.util.TestRuleMarkFailure$1.evaluate(TestRuleMarkFailure.java:47)
>         at org.apache.lucene.util.TestRuleIgnoreAfterMaxFailures$1.evaluate(TestRuleIgnoreAfterMaxFailures.java:64)
>         at org.apache.lucene.util.TestRuleIgnoreTestSuites$1.evaluate(TestRuleIgnoreTestSuites.java:54)
>         at com.carrotsearch.randomizedtesting.rules.StatementAdapter.evaluate(StatementAdapter.java:36)
>         at com.carrotsearch.randomizedtesting.ThreadLeakControl$StatementRunner.run(ThreadLeakControl.java:368)
>         at java.base/java.lang.Thread.run(Thread.java:834)
>         Suppressed: java.net.SocketException: Software caused connection abort: socket write error
>                 at java.base/java.net.SocketOutputStream.socketWrite0(Native Method)
>                 at java.base/java.net.SocketOutputStream.socketWrite(SocketOutputStream.java:110)
>                 at java.base/java.net.SocketOutputStream.write(SocketOutputStream.java:150)
>                 at java.base/sun.security.ssl.SSLSocketOutputRecord.encodeAlert(SSLSocketOutputRecord.java:81)
>                 at java.base/sun.security.ssl.TransportContext.fatal(TransportContext.java:351)
>                 ... 64 more
> Caused by: java.net.SocketException: Software caused connection abort: recv failed
>         at java.base/java.net.SocketInputStream.socketRead0(Native Method)
>         at java.base/java.net.SocketInputStream.socketRead(SocketInputStream.java:115)
>         at java.base/java.net.SocketInputStream.read(SocketInputStream.java:168)
>         at java.base/java.net.SocketInputStream.read(SocketInputStream.java:140)
>         at java.base/sun.security.ssl.SSLSocketInputRecord.read(SSLSocketInputRecord.java:448)
>         at java.base/sun.security.ssl.SSLSocketInputRecord.bytesInCompletePacket(SSLSocketInputRecord.java:68)
>         at java.base/sun.security.ssl.SSLSocketImpl.readApplicationRecord(SSLSocketImpl.java:1104)
>         at java.base/sun.security.ssl.SSLSocketImpl$AppInputStream.read(SSLSocketImpl.java:823)
>         ... 60 more
>
>
> FAILED:  org.apache.solr.ltr.store.rest.TestModelManagerPersistence.testFilePersistence
>
> Error Message:
> Software caused connection abort: recv failed
>
> Stack Trace:
> javax.net.ssl.SSLException: Software caused connection abort: recv failed
>         at __randomizedtesting.SeedInfo.seed([60CD0E908CE38B0A:426C6AED298FED4F]:0)
>         at java.base/sun.security.ssl.Alert.createSSLException(Alert.java:127)
>         at java.base/sun.security.ssl.TransportContext.fatal(TransportContext.java:320)
>         at java.base/sun.security.ssl.TransportContext.fatal(TransportContext.java:263)
>         at java.base/sun.security.ssl.TransportContext.fatal(TransportContext.java:258)
>         at java.base/sun.security.ssl.SSLSocketImpl.handleException(SSLSocketImpl.java:1315)
>         at java.base/sun.security.ssl.SSLSocketImpl$AppInputStream.read(SSLSocketImpl.java:839)
>         at org.apache.http.impl.io.SessionInputBufferImpl.streamRead(SessionInputBufferImpl.java:137)
>         at org.apache.http.impl.io.SessionInputBufferImpl.fillBuffer(SessionInputBufferImpl.java:153)
>         at org.apache.http.impl.io.SessionInputBufferImpl.readLine(SessionInputBufferImpl.java:282)
>         at org.apache.http.impl.conn.DefaultHttpResponseParser.parseHead(DefaultHttpResponseParser.java:138)
>         at org.apache.http.impl.conn.DefaultHttpResponseParser.parseHead(DefaultHttpResponseParser.java:56)
>         at org.apache.http.impl.io.AbstractMessageParser.parse(AbstractMessageParser.java:259)
>         at org.apache.http.impl.DefaultBHttpClientConnection.receiveResponseHeader(DefaultBHttpClientConnection.java:163)
>         at org.apache.http.impl.conn.CPoolProxy.receiveResponseHeader(CPoolProxy.java:165)
>         at org.apache.http.protocol.HttpRequestExecutor.doReceiveResponse(HttpRequestExecutor.java:273)
>         at org.apache.http.protocol.HttpRequestExecutor.execute(HttpRequestExecutor.java:125)
>         at org.apache.http.impl.execchain.MainClientExec.execute(MainClientExec.java:272)
>         at org.apache.http.impl.execchain.ProtocolExec.execute(ProtocolExec.java:185)
>         at org.apache.http.impl.execchain.RetryExec.execute(RetryExec.java:89)
>         at org.apache.http.impl.execchain.RedirectExec.execute(RedirectExec.java:110)
>         at org.apache.http.impl.client.InternalHttpClient.doExecute(InternalHttpClient.java:185)
>         at org.apache.http.impl.client.CloseableHttpClient.execute(CloseableHttpClient.java:83)
>         at org.apache.solr.util.RestTestHarness.getResponse(RestTestHarness.java:215)
>         at org.apache.solr.util.RestTestHarness.query(RestTestHarness.java:107)
>         at org.apache.solr.util.RestTestBase.assertJQ(RestTestBase.java:226)
>         at org.apache.solr.util.RestTestBase.assertJQ(RestTestBase.java:192)
>         at org.apache.solr.ltr.store.rest.TestModelManagerPersistence.testFilePersistence(TestModelManagerPersistence.java:173)
>         at java.base/jdk.internal.reflect.NativeMethodAccessorImpl.invoke0(Native Method)
>         at java.base/jdk.internal.reflect.NativeMethodAccessorImpl.invoke(NativeMethodAccessorImpl.java:62)
>         at java.base/jdk.internal.reflect.DelegatingMethodAccessorImpl.invoke(DelegatingMethodAccessorImpl.java:43)
>         at java.base/java.lang.reflect.Method.invoke(Method.java:566)
>         at com.carrotsearch.randomizedtesting.RandomizedRunner.invoke(RandomizedRunner.java:1750)
>         at com.carrotsearch.randomizedtesting.RandomizedRunner$8.evaluate(RandomizedRunner.java:938)
>         at com.carrotsearch.randomizedtesting.RandomizedRunner$9.evaluate(RandomizedRunner.java:974)
>         at com.carrotsearch.randomizedtesting.RandomizedRunner$10.evaluate(RandomizedRunner.java:988)
>         at com.carrotsearch.randomizedtesting.rules.SystemPropertiesRestoreRule$1.evaluate(SystemPropertiesRestoreRule.java:57)
>         at org.apache.lucene.util.TestRuleSetupTeardownChained$1.evaluate(TestRuleSetupTeardownChained.java:49)
>         at org.apache.lucene.util.AbstractBeforeAfterRule$1.evaluate(AbstractBeforeAfterRule.java:45)
>         at org.apache.lucene.util.TestRuleThreadAndTestName$1.evaluate(TestRuleThreadAndTestName.java:48)
>         at org.apache.lucene.util.TestRuleIgnoreAfterMaxFailures$1.evaluate(TestRuleIgnoreAfterMaxFailures.java:64)
>         at org.apache.lucene.util.TestRuleMarkFailure$1.evaluate(TestRuleMarkFailure.java:47)
>         at com.carrotsearch.randomizedtesting.rules.StatementAdapter.evaluate(StatementAdapter.java:36)
>         at com.carrotsearch.randomizedtesting.ThreadLeakControl$StatementRunner.run(ThreadLeakControl.java:368)
>         at com.carrotsearch.randomizedtesting.ThreadLeakControl.forkTimeoutingTask(ThreadLeakControl.java:817)
>         at com.carrotsearch.randomizedtesting.ThreadLeakControl$3.evaluate(ThreadLeakControl.java:468)
>         at com.carrotsearch.randomizedtesting.RandomizedRunner.runSingleTest(RandomizedRunner.java:947)
>         at com.carrotsearch.randomizedtesting.RandomizedRunner$5.evaluate(RandomizedRunner.java:832)
>         at com.carrotsearch.randomizedtesting.RandomizedRunner$6.evaluate(RandomizedRunner.java:883)
>         at com.carrotsearch.randomizedtesting.RandomizedRunner$7.evaluate(RandomizedRunner.java:894)
>         at com.carrotsearch.randomizedtesting.rules.StatementAdapter.evaluate(StatementAdapter.java:36)
>         at com.carrotsearch.randomizedtesting.rules.SystemPropertiesRestoreRule$1.evaluate(SystemPropertiesRestoreRule.java:57)
>         at org.apache.lucene.util.AbstractBeforeAfterRule$1.evaluate(AbstractBeforeAfterRule.java:45)
>         at com.carrotsearch.randomizedtesting.rules.StatementAdapter.evaluate(StatementAdapter.java:36)
>         at org.apache.lucene.util.TestRuleStoreClassName$1.evaluate(TestRuleStoreClassName.java:41)
>         at com.carrotsearch.randomizedtesting.rules.NoShadowingOrOverridesOnMethodsRule$1.evaluate(NoShadowingOrOverridesOnMethodsRule.java:40)
>         at com.carrotsearch.randomizedtesting.rules.NoShadowingOrOverridesOnMethodsRule$1.evaluate(NoShadowingOrOverridesOnMethodsRule.java:40)
>         at com.carrotsearch.randomizedtesting.rules.StatementAdapter.evaluate(StatementAdapter.java:36)
>         at com.carrotsearch.randomizedtesting.rules.StatementAdapter.evaluate(StatementAdapter.java:36)
>         at org.apache.lucene.util.TestRuleAssertionsRequired$1.evaluate(TestRuleAssertionsRequired.java:53)
>         at org.apache.lucene.util.TestRuleMarkFailure$1.evaluate(TestRuleMarkFailure.java:47)
>         at org.apache.lucene.util.TestRuleIgnoreAfterMaxFailures$1.evaluate(TestRuleIgnoreAfterMaxFailures.java:64)
>         at org.apache.lucene.util.TestRuleIgnoreTestSuites$1.evaluate(TestRuleIgnoreTestSuites.java:54)
>         at com.carrotsearch.randomizedtesting.rules.StatementAdapter.evaluate(StatementAdapter.java:36)
>         at com.carrotsearch.randomizedtesting.ThreadLeakControl$StatementRunner.run(ThreadLeakControl.java:368)
>         at java.base/java.lang.Thread.run(Thread.java:834)
>         Suppressed: java.net.SocketException: Software caused connection abort: socket write error
>                 at java.base/java.net.SocketOutputStream.socketWrite0(Native Method)
>                 at java.base/java.net.SocketOutputStream.socketWrite(SocketOutputStream.java:110)
>                 at java.base/java.net.SocketOutputStream.write(SocketOutputStream.java:150)
>                 at java.base/sun.security.ssl.SSLSocketOutputRecord.encodeAlert(SSLSocketOutputRecord.java:81)
>                 at java.base/sun.security.ssl.TransportContext.fatal(TransportContext.java:351)
>                 ... 63 more
> Caused by: java.net.SocketException: Software caused connection abort: recv failed
>         at java.base/java.net.SocketInputStream.socketRead0(Native Method)
>         at java.base/java.net.SocketInputStream.socketRead(SocketInputStream.java:115)
>         at java.base/java.net.SocketInputStream.read(SocketInputStream.java:168)
>         at java.base/java.net.SocketInputStream.read(SocketInputStream.java:140)
>         at java.base/sun.security.ssl.SSLSocketInputRecord.read(SSLSocketInputRecord.java:448)
>         at java.base/sun.security.ssl.SSLSocketInputRecord.bytesInCompletePacket(SSLSocketInputRecord.java:68)
>         at java.base/sun.security.ssl.SSLSocketImpl.readApplicationRecord(SSLSocketImpl.java:1104)
>         at java.base/sun.security.ssl.SSLSocketImpl$AppInputStream.read(SSLSocketImpl.java:823)
>         ... 59 more
>
>
> FAILED:  org.apache.solr.ltr.store.rest.TestModelManagerPersistence.testWrapperModelPersistence
>
> Error Message:
> Software caused connection abort: recv failed
>
> Stack Trace:
> javax.net.ssl.SSLException: Software caused connection abort: recv failed
>         at __randomizedtesting.SeedInfo.seed([60CD0E908CE38B0A:15A77D4E331FF24F]:0)
>         at java.base/sun.security.ssl.Alert.createSSLException(Alert.java:127)
>         at java.base/sun.security.ssl.TransportContext.fatal(TransportContext.java:320)
>         at java.base/sun.security.ssl.TransportContext.fatal(TransportContext.java:263)
>         at java.base/sun.security.ssl.TransportContext.fatal(TransportContext.java:258)
>         at java.base/sun.security.ssl.SSLSocketImpl.handleException(SSLSocketImpl.java:1315)
>         at java.base/sun.security.ssl.SSLSocketImpl$AppInputStream.read(SSLSocketImpl.java:839)
>         at org.apache.http.impl.io.SessionInputBufferImpl.streamRead(SessionInputBufferImpl.java:137)
>         at org.apache.http.impl.io.SessionInputBufferImpl.fillBuffer(SessionInputBufferImpl.java:153)
>         at org.apache.http.impl.io.SessionInputBufferImpl.readLine(SessionInputBufferImpl.java:282)
>         at org.apache.http.impl.conn.DefaultHttpResponseParser.parseHead(DefaultHttpResponseParser.java:138)
>         at org.apache.http.impl.conn.DefaultHttpResponseParser.parseHead(DefaultHttpResponseParser.java:56)
>         at org.apache.http.impl.io.AbstractMessageParser.parse(AbstractMessageParser.java:259)
>         at org.apache.http.impl.DefaultBHttpClientConnection.receiveResponseHeader(DefaultBHttpClientConnection.java:163)
>         at org.apache.http.impl.conn.CPoolProxy.receiveResponseHeader(CPoolProxy.java:165)
>         at org.apache.http.protocol.HttpRequestExecutor.doReceiveResponse(HttpRequestExecutor.java:273)
>         at org.apache.http.protocol.HttpRequestExecutor.execute(HttpRequestExecutor.java:125)
>         at org.apache.http.impl.execchain.MainClientExec.execute(MainClientExec.java:272)
>         at org.apache.http.impl.execchain.ProtocolExec.execute(ProtocolExec.java:185)
>         at org.apache.http.impl.execchain.RetryExec.execute(RetryExec.java:89)
>         at org.apache.http.impl.execchain.RedirectExec.execute(RedirectExec.java:110)
>         at org.apache.http.impl.client.InternalHttpClient.doExecute(InternalHttpClient.java:185)
>         at org.apache.http.impl.client.CloseableHttpClient.execute(CloseableHttpClient.java:83)
>         at org.apache.solr.util.RestTestHarness.getResponse(RestTestHarness.java:215)
>         at org.apache.solr.util.RestTestHarness.query(RestTestHarness.java:107)
>         at org.apache.solr.util.RestTestBase.assertJQ(RestTestBase.java:226)
>         at org.apache.solr.util.RestTestBase.assertJQ(RestTestBase.java:192)
>         at org.apache.solr.ltr.store.rest.TestModelManagerPersistence.doWrapperModelPersistenceChecks(TestModelManagerPersistence.java:207)
>         at org.apache.solr.ltr.store.rest.TestModelManagerPersistence.testWrapperModelPersistence(TestModelManagerPersistence.java:260)
>         at java.base/jdk.internal.reflect.NativeMethodAccessorImpl.invoke0(Native Method)
>         at java.base/jdk.internal.reflect.NativeMethodAccessorImpl.invoke(NativeMethodAccessorImpl.java:62)
>         at java.base/jdk.internal.reflect.DelegatingMethodAccessorImpl.invoke(DelegatingMethodAccessorImpl.java:43)
>         at java.base/java.lang.reflect.Method.invoke(Method.java:566)
>         at com.carrotsearch.randomizedtesting.RandomizedRunner.invoke(RandomizedRunner.java:1750)
>         at com.carrotsearch.randomizedtesting.RandomizedRunner$8.evaluate(RandomizedRunner.java:938)
>         at com.carrotsearch.randomizedtesting.RandomizedRunner$9.evaluate(RandomizedRunner.java:974)
>         at com.carrotsearch.randomizedtesting.RandomizedRunner$10.evaluate(RandomizedRunner.java:988)
>         at com.carrotsearch.randomizedtesting.rules.SystemPropertiesRestoreRule$1.evaluate(SystemPropertiesRestoreRule.java:57)
>         at org.apache.lucene.util.TestRuleSetupTeardownChained$1.evaluate(TestRuleSetupTeardownChained.java:49)
>         at org.apache.lucene.util.AbstractBeforeAfterRule$1.evaluate(AbstractBeforeAfterRule.java:45)
>         at org.apache.lucene.util.TestRuleThreadAndTestName$1.evaluate(TestRuleThreadAndTestName.java:48)
>         at org.apache.lucene.util.TestRuleIgnoreAfterMaxFailures$1.evaluate(TestRuleIgnoreAfterMaxFailures.java:64)
>         at org.apache.lucene.util.TestRuleMarkFailure$1.evaluate(TestRuleMarkFailure.java:47)
>         at com.carrotsearch.randomizedtesting.rules.StatementAdapter.evaluate(StatementAdapter.java:36)
>         at com.carrotsearch.randomizedtesting.ThreadLeakControl$StatementRunner.run(ThreadLeakControl.java:368)
>         at com.carrotsearch.randomizedtesting.ThreadLeakControl.forkTimeoutingTask(ThreadLeakControl.java:817)
>         at com.carrotsearch.randomizedtesting.ThreadLeakControl$3.evaluate(ThreadLeakControl.java:468)
>         at com.carrotsearch.randomizedtesting.RandomizedRunner.runSingleTest(RandomizedRunner.java:947)
>         at com.carrotsearch.randomizedtesting.RandomizedRunner$5.evaluate(RandomizedRunner.java:832)
>         at com.carrotsearch.randomizedtesting.RandomizedRunner$6.evaluate(RandomizedRunner.java:883)
>         at com.carrotsearch.randomizedtesting.RandomizedRunner$7.evaluate(RandomizedRunner.java:894)
>         at com.carrotsearch.randomizedtesting.rules.StatementAdapter.evaluate(StatementAdapter.java:36)
>         at com.carrotsearch.randomizedtesting.rules.SystemPropertiesRestoreRule$1.evaluate(SystemPropertiesRestoreRule.java:57)
>         at org.apache.lucene.util.AbstractBeforeAfterRule$1.evaluate(AbstractBeforeAfterRule.java:45)
>         at com.carrotsearch.randomizedtesting.rules.StatementAdapter.evaluate(StatementAdapter.java:36)
>         at org.apache.lucene.util.TestRuleStoreClassName$1.evaluate(TestRuleStoreClassName.java:41)
>         at com.carrotsearch.randomizedtesting.rules.NoShadowingOrOverridesOnMethodsRule$1.evaluate(NoShadowingOrOverridesOnMethodsRule.java:40)
>         at com.carrotsearch.randomizedtesting.rules.NoShadowingOrOverridesOnMethodsRule$1.evaluate(NoShadowingOrOverridesOnMethodsRule.java:40)
>         at com.carrotsearch.randomizedtesting.rules.StatementAdapter.evaluate(StatementAdapter.java:36)
>         at com.carrotsearch.randomizedtesting.rules.StatementAdapter.evaluate(StatementAdapter.java:36)
>         at org.apache.lucene.util.TestRuleAssertionsRequired$1.evaluate(TestRuleAssertionsRequired.java:53)
>         at org.apache.lucene.util.TestRuleMarkFailure$1.evaluate(TestRuleMarkFailure.java:47)
>         at org.apache.lucene.util.TestRuleIgnoreAfterMaxFailures$1.evaluate(TestRuleIgnoreAfterMaxFailures.java:64)
>         at org.apache.lucene.util.TestRuleIgnoreTestSuites$1.evaluate(TestRuleIgnoreTestSuites.java:54)
>         at com.carrotsearch.randomizedtesting.rules.StatementAdapter.evaluate(StatementAdapter.java:36)
>         at com.carrotsearch.randomizedtesting.ThreadLeakControl$StatementRunner.run(ThreadLeakControl.java:368)
>         at java.base/java.lang.Thread.run(Thread.java:834)
>         Suppressed: java.net.SocketException: Software caused connection abort: socket write error
>                 at java.base/java.net.SocketOutputStream.socketWrite0(Native Method)
>                 at java.base/java.net.SocketOutputStream.socketWrite(SocketOutputStream.java:110)
>                 at java.base/java.net.SocketOutputStream.write(SocketOutputStream.java:150)
>                 at java.base/sun.security.ssl.SSLSocketOutputRecord.encodeAlert(SSLSocketOutputRecord.java:81)
>                 at java.base/sun.security.ssl.TransportContext.fatal(TransportContext.java:351)
>                 ... 64 more
> Caused by: java.net.SocketException: Software caused connection abort: recv failed
>         at java.base/java.net.SocketInputStream.socketRead0(Native Method)
>         at java.base/java.net.SocketInputStream.socketRead(SocketInputStream.java:115)
>         at java.base/java.net.SocketInputStream.read(SocketInputStream.java:168)
>         at java.base/java.net.SocketInputStream.read(SocketInputStream.java:140)
>         at java.base/sun.security.ssl.SSLSocketInputRecord.read(SSLSocketInputRecord.java:448)
>         at java.base/sun.security.ssl.SSLSocketInputRecord.bytesInCompletePacket(SSLSocketInputRecord.java:68)
>         at java.base/sun.security.ssl.SSLSocketImpl.readApplicationRecord(SSLSocketImpl.java:1104)
>         at java.base/sun.security.ssl.SSLSocketImpl$AppInputStream.read(SSLSocketImpl.java:823)
>         ... 60 more
>
>
> FAILED:  org.apache.solr.ltr.store.rest.TestModelManagerPersistence.testFilePersistence
>
> Error Message:
> Software caused connection abort: recv failed
>
> Stack Trace:
> javax.net.ssl.SSLException: Software caused connection abort: recv failed
>         at __randomizedtesting.SeedInfo.seed([60CD0E908CE38B0A:426C6AED298FED4F]:0)
>         at java.base/sun.security.ssl.Alert.createSSLException(Alert.java:127)
>         at java.base/sun.security.ssl.TransportContext.fatal(TransportContext.java:320)
>         at java.base/sun.security.ssl.TransportContext.fatal(TransportContext.java:263)
>         at java.base/sun.security.ssl.TransportContext.fatal(TransportContext.java:258)
>         at java.base/sun.security.ssl.SSLSocketImpl.handleException(SSLSocketImpl.java:1315)
>         at java.base/sun.security.ssl.SSLSocketImpl$AppInputStream.read(SSLSocketImpl.java:839)
>         at org.apache.http.impl.io.SessionInputBufferImpl.streamRead(SessionInputBufferImpl.java:137)
>         at org.apache.http.impl.io.SessionInputBufferImpl.fillBuffer(SessionInputBufferImpl.java:153)
>         at org.apache.http.impl.io.SessionInputBufferImpl.readLine(SessionInputBufferImpl.java:282)
>         at org.apache.http.impl.conn.DefaultHttpResponseParser.parseHead(DefaultHttpResponseParser.java:138)
>         at org.apache.http.impl.conn.DefaultHttpResponseParser.parseHead(DefaultHttpResponseParser.java:56)
>         at org.apache.http.impl.io.AbstractMessageParser.parse(AbstractMessageParser.java:259)
>         at org.apache.http.impl.DefaultBHttpClientConnection.receiveResponseHeader(DefaultBHttpClientConnection.java:163)
>         at org.apache.http.impl.conn.CPoolProxy.receiveResponseHeader(CPoolProxy.java:165)
>         at org.apache.http.protocol.HttpRequestExecutor.doReceiveResponse(HttpRequestExecutor.java:273)
>         at org.apache.http.protocol.HttpRequestExecutor.execute(HttpRequestExecutor.java:125)
>         at org.apache.http.impl.execchain.MainClientExec.execute(MainClientExec.java:272)
>         at org.apache.http.impl.execchain.ProtocolExec.execute(ProtocolExec.java:185)
>         at org.apache.http.impl.execchain.RetryExec.execute(RetryExec.java:89)
>         at org.apache.http.impl.execchain.RedirectExec.execute(RedirectExec.java:110)
>         at org.apache.http.impl.client.InternalHttpClient.doExecute(InternalHttpClient.java:185)
>         at org.apache.http.impl.client.CloseableHttpClient.execute(CloseableHttpClient.java:83)
>         at org.apache.solr.util.RestTestHarness.getResponse(RestTestHarness.java:215)
>         at org.apache.solr.util.RestTestHarness.query(RestTestHarness.java:107)
>         at org.apache.solr.util.RestTestBase.assertJQ(RestTestBase.java:226)
>         at org.apache.solr.util.RestTestBase.assertJQ(RestTestBase.java:192)
>         at org.apache.solr.ltr.store.rest.TestModelManagerPersistence.testFilePersistence(TestModelManagerPersistence.java:173)
>         at java.base/jdk.internal.reflect.NativeMethodAccessorImpl.invoke0(Native Method)
>         at java.base/jdk.internal.reflect.NativeMethodAccessorImpl.invoke(NativeMethodAccessorImpl.java:62)
>         at java.base/jdk.internal.reflect.DelegatingMethodAccessorImpl.invoke(DelegatingMethodAccessorImpl.java:43)
>         at java.base/java.lang.reflect.Method.invoke(Method.java:566)
>         at com.carrotsearch.randomizedtesting.RandomizedRunner.invoke(RandomizedRunner.java:1750)
>         at com.carrotsearch.randomizedtesting.RandomizedRunner$8.evaluate(RandomizedRunner.java:938)
>         at com.carrotsearch.randomizedtesting.RandomizedRunner$9.evaluate(RandomizedRunner.java:974)
>         at com.carrotsearch.randomizedtesting.RandomizedRunner$10.evaluate(RandomizedRunner.java:988)
>         at com.carrotsearch.randomizedtesting.rules.SystemPropertiesRestoreRule$1.evaluate(SystemPropertiesRestoreRule.java:57)
>         at org.apache.lucene.util.TestRuleSetupTeardownChained$1.evaluate(TestRuleSetupTeardownChained.java:49)
>         at org.apache.lucene.util.AbstractBeforeAfterRule$1.evaluate(AbstractBeforeAfterRule.java:45)
>         at org.apache.lucene.util.TestRuleThreadAndTestName$1.evaluate(TestRuleThreadAndTestName.java:48)
>         at org.apache.lucene.util.TestRuleIgnoreAfterMaxFailures$1.evaluate(TestRuleIgnoreAfterMaxFailures.java:64)
>         at org.apache.lucene.util.TestRuleMarkFailure$1.evaluate(TestRuleMarkFailure.java:47)
>         at com.carrotsearch.randomizedtesting.rules.StatementAdapter.evaluate(StatementAdapter.java:36)
>         at com.carrotsearch.randomizedtesting.ThreadLeakControl$StatementRunner.run(ThreadLeakControl.java:368)
>         at com.carrotsearch.randomizedtesting.ThreadLeakControl.forkTimeoutingTask(ThreadLeakControl.java:817)
>         at com.carrotsearch.randomizedtesting.ThreadLeakControl$3.evaluate(ThreadLeakControl.java:468)
>         at com.carrotsearch.randomizedtesting.RandomizedRunner.runSingleTest(RandomizedRunner.java:947)
>         at com.carrotsearch.randomizedtesting.RandomizedRunner$5.evaluate(RandomizedRunner.java:832)
>         at com.carrotsearch.randomizedtesting.RandomizedRunner$6.evaluate(RandomizedRunner.java:883)
>         at com.carrotsearch.randomizedtesting.RandomizedRunner$7.evaluate(RandomizedRunner.java:894)
>         at com.carrotsearch.randomizedtesting.rules.StatementAdapter.evaluate(StatementAdapter.java:36)
>         at com.carrotsearch.randomizedtesting.rules.SystemPropertiesRestoreRule$1.evaluate(SystemPropertiesRestoreRule.java:57)
>         at org.apache.lucene.util.AbstractBeforeAfterRule$1.evaluate(AbstractBeforeAfterRule.java:45)
>         at com.carrotsearch.randomizedtesting.rules.StatementAdapter.evaluate(StatementAdapter.java:36)
>         at org.apache.lucene.util.TestRuleStoreClassName$1.evaluate(TestRuleStoreClassName.java:41)
>         at com.carrotsearch.randomizedtesting.rules.NoShadowingOrOverridesOnMethodsRule$1.evaluate(NoShadowingOrOverridesOnMethodsRule.java:40)
>         at com.carrotsearch.randomizedtesting.rules.NoShadowingOrOverridesOnMethodsRule$1.evaluate(NoShadowingOrOverridesOnMethodsRule.java:40)
>         at com.carrotsearch.randomizedtesting.rules.StatementAdapter.evaluate(StatementAdapter.java:36)
>         at com.carrotsearch.randomizedtesting.rules.StatementAdapter.evaluate(StatementAdapter.java:36)
>         at org.apache.lucene.util.TestRuleAssertionsRequired$1.evaluate(TestRuleAssertionsRequired.java:53)
>         at org.apache.lucene.util.TestRuleMarkFailure$1.evaluate(TestRuleMarkFailure.java:47)
>         at org.apache.lucene.util.TestRuleIgnoreAfterMaxFailures$1.evaluate(TestRuleIgnoreAfterMaxFailures.java:64)
>         at org.apache.lucene.util.TestRuleIgnoreTestSuites$1.evaluate(TestRuleIgnoreTestSuites.java:54)
>         at com.carrotsearch.randomizedtesting.rules.StatementAdapter.evaluate(StatementAdapter.java:36)
>         at com.carrotsearch.randomizedtesting.ThreadLeakControl$StatementRunner.run(ThreadLeakControl.java:368)
>         at java.base/java.lang.Thread.run(Thread.java:834)
>         Suppressed: java.net.SocketException: Software caused connection abort: socket write error
>                 at java.base/java.net.SocketOutputStream.socketWrite0(Native Method)
>                 at java.base/java.net.SocketOutputStream.socketWrite(SocketOutputStream.java:110)
>                 at java.base/java.net.SocketOutputStream.write(SocketOutputStream.java:150)
>                 at java.base/sun.security.ssl.SSLSocketOutputRecord.encodeAlert(SSLSocketOutputRecord.java:81)
>                 at java.base/sun.security.ssl.TransportContext.fatal(TransportContext.java:351)
>                 ... 63 more
> Caused by: java.net.SocketException: Software caused connection abort: recv failed
>         at java.base/java.net.SocketInputStream.socketRead0(Native Method)
>         at java.base/java.net.SocketInputStream.socketRead(SocketInputStream.java:115)
>         at java.base/java.net.SocketInputStream.read(SocketInputStream.java:168)
>         at java.base/java.net.SocketInputStream.read(SocketInputStream.java:140)
>         at java.base/sun.security.ssl.SSLSocketInputRecord.read(SSLSocketInputRecord.java:448)
>         at java.base/sun.security.ssl.SSLSocketInputRecord.bytesInCompletePacket(SSLSocketInputRecord.java:68)
>         at java.base/sun.security.ssl.SSLSocketImpl.readApplicationRecord(SSLSocketImpl.java:1104)
>         at java.base/sun.security.ssl.SSLSocketImpl$AppInputStream.read(SSLSocketImpl.java:823)
>         ... 59 more
>
>
> FAILED:  org.apache.solr.ltr.store.rest.TestModelManagerPersistence.testWrapperModelPersistence
>
> Error Message:
> Software caused connection abort: recv failed
>
> Stack Trace:
> javax.net.ssl.SSLException: Software caused connection abort: recv failed
>         at __randomizedtesting.SeedInfo.seed([60CD0E908CE38B0A:15A77D4E331FF24F]:0)
>         at java.base/sun.security.ssl.Alert.createSSLException(Alert.java:127)
>         at java.base/sun.security.ssl.TransportContext.fatal(TransportContext.java:320)
>         at java.base/sun.security.ssl.TransportContext.fatal(TransportContext.java:263)
>         at java.base/sun.security.ssl.TransportContext.fatal(TransportContext.java:258)
>         at java.base/sun.security.ssl.SSLSocketImpl.handleException(SSLSocketImpl.java:1315)
>         at java.base/sun.security.ssl.SSLSocketImpl$AppInputStream.read(SSLSocketImpl.java:839)
>         at org.apache.http.impl.io.SessionInputBufferImpl.streamRead(SessionInputBufferImpl.java:137)
>         at org.apache.http.impl.io.SessionInputBufferImpl.fillBuffer(SessionInputBufferImpl.java:153)
>         at org.apache.http.impl.io.SessionInputBufferImpl.readLine(SessionInputBufferImpl.java:282)
>         at org.apache.http.impl.conn.DefaultHttpResponseParser.parseHead(DefaultHttpResponseParser.java:138)
>         at org.apache.http.impl.conn.DefaultHttpResponseParser.parseHead(DefaultHttpResponseParser.java:56)
>         at org.apache.http.impl.io.AbstractMessageParser.parse(AbstractMessageParser.java:259)
>         at org.apache.http.impl.DefaultBHttpClientConnection.receiveResponseHeader(DefaultBHttpClientConnection.java:163)
>         at org.apache.http.impl.conn.CPoolProxy.receiveResponseHeader(CPoolProxy.java:165)
>         at org.apache.http.protocol.HttpRequestExecutor.doReceiveResponse(HttpRequestExecutor.java:273)
>         at org.apache.http.protocol.HttpRequestExecutor.execute(HttpRequestExecutor.java:125)
>         at org.apache.http.impl.execchain.MainClientExec.execute(MainClientExec.java:272)
>         at org.apache.http.impl.execchain.ProtocolExec.execute(ProtocolExec.java:185)
>         at org.apache.http.impl.execchain.RetryExec.execute(RetryExec.java:89)
>         at org.apache.http.impl.execchain.RedirectExec.execute(RedirectExec.java:110)
>         at org.apache.http.impl.client.InternalHttpClient.doExecute(InternalHttpClient.java:185)
>         at org.apache.http.impl.client.CloseableHttpClient.execute(CloseableHttpClient.java:83)
>         at org.apache.solr.util.RestTestHarness.getResponse(RestTestHarness.java:215)
>         at org.apache.solr.util.RestTestHarness.query(RestTestHarness.java:107)
>         at org.apache.solr.util.RestTestBase.assertJQ(RestTestBase.java:226)
>         at org.apache.solr.util.RestTestBase.assertJQ(RestTestBase.java:192)
>         at org.apache.solr.ltr.store.rest.TestModelManagerPersistence.doWrapperModelPersistenceChecks(TestModelManagerPersistence.java:207)
>         at org.apache.solr.ltr.store.rest.TestModelManagerPersistence.testWrapperModelPersistence(TestModelManagerPersistence.java:260)
>         at java.base/jdk.internal.reflect.NativeMethodAccessorImpl.invoke0(Native Method)
>         at java.base/jdk.internal.reflect.NativeMethodAccessorImpl.invoke(NativeMethodAccessorImpl.java:62)
>         at java.base/jdk.internal.reflect.DelegatingMethodAccessorImpl.invoke(DelegatingMethodAccessorImpl.java:43)
>         at java.base/java.lang.reflect.Method.invoke(Method.java:566)
>         at com.carrotsearch.randomizedtesting.RandomizedRunner.invoke(RandomizedRunner.java:1750)
>         at com.carrotsearch.randomizedtesting.RandomizedRunner$8.evaluate(RandomizedRunner.java:938)
>         at com.carrotsearch.randomizedtesting.RandomizedRunner$9.evaluate(RandomizedRunner.java:974)
>         at com.carrotsearch.randomizedtesting.RandomizedRunner$10.evaluate(RandomizedRunner.java:988)
>         at com.carrotsearch.randomizedtesting.rules.SystemPropertiesRestoreRule$1.evaluate(SystemPropertiesRestoreRule.java:57)
>         at org.apache.lucene.util.TestRuleSetupTeardownChained$1.evaluate(TestRuleSetupTeardownChained.java:49)
>         at org.apache.lucene.util.AbstractBeforeAfterRule$1.evaluate(AbstractBeforeAfterRule.java:45)
>         at org.apache.lucene.util.TestRuleThreadAndTestName$1.evaluate(TestRuleThreadAndTestName.java:48)
>         at org.apache.lucene.util.TestRuleIgnoreAfterMaxFailures$1.evaluate(TestRuleIgnoreAfterMaxFailures.java:64)
>         at org.apache.lucene.util.TestRuleMarkFailure$1.evaluate(TestRuleMarkFailure.java:47)
>         at com.carrotsearch.randomizedtesting.rules.StatementAdapter.evaluate(StatementAdapter.java:36)
>         at com.carrotsearch.randomizedtesting.ThreadLeakControl$StatementRunner.run(ThreadLeakControl.java:368)
>         at com.carrotsearch.randomizedtesting.ThreadLeakControl.forkTimeoutingTask(ThreadLeakControl.java:817)
>         at com.carrotsearch.randomizedtesting.ThreadLeakControl$3.evaluate(ThreadLeakControl.java:468)
>         at com.carrotsearch.randomizedtesting.RandomizedRunner.runSingleTest(RandomizedRunner.java:947)
>         at com.carrotsearch.randomizedtesting.RandomizedRunner$5.evaluate(RandomizedRunner.java:832)
>         at com.carrotsearch.randomizedtesting.RandomizedRunner$6.evaluate(RandomizedRunner.java:883)
>         at com.carrotsearch.randomizedtesting.RandomizedRunner$7.evaluate(RandomizedRunner.java:894)
>         at com.carrotsearch.randomizedtesting.rules.StatementAdapter.evaluate(StatementAdapter.java:36)
>         at com.carrotsearch.randomizedtesting.rules.SystemPropertiesRestoreRule$1.evaluate(SystemPropertiesRestoreRule.java:57)
>         at org.apache.lucene.util.AbstractBeforeAfterRule$1.evaluate(AbstractBeforeAfterRule.java:45)
>         at com.carrotsearch.randomizedtesting.rules.StatementAdapter.evaluate(StatementAdapter.java:36)
>         at org.apache.lucene.util.TestRuleStoreClassName$1.evaluate(TestRuleStoreClassName.java:41)
>         at com.carrotsearch.randomizedtesting.rules.NoShadowingOrOverridesOnMethodsRule$1.evaluate(NoShadowingOrOverridesOnMethodsRule.java:40)
>         at com.carrotsearch.randomizedtesting.rules.NoShadowingOrOverridesOnMethodsRule$1.evaluate(NoShadowingOrOverridesOnMethodsRule.java:40)
>         at com.carrotsearch.randomizedtesting.rules.StatementAdapter.evaluate(StatementAdapter.java:36)
>         at com.carrotsearch.randomizedtesting.rules.StatementAdapter.evaluate(StatementAdapter.java:36)
>         at org.apache.lucene.util.TestRuleAssertionsRequired$1.evaluate(TestRuleAssertionsRequired.java:53)
>         at org.apache.lucene.util.TestRuleMarkFailure$1.evaluate(TestRuleMarkFailure.java:47)
>         at org.apache.lucene.util.TestRuleIgnoreAfterMaxFailures$1.evaluate(TestRuleIgnoreAfterMaxFailures.java:64)
>         at org.apache.lucene.util.TestRuleIgnoreTestSuites$1.evaluate(TestRuleIgnoreTestSuites.java:54)
>         at com.carrotsearch.randomizedtesting.rules.StatementAdapter.evaluate(StatementAdapter.java:36)
>         at com.carrotsearch.randomizedtesting.ThreadLeakControl$StatementRunner.run(ThreadLeakControl.java:368)
>         at java.base/java.lang.Thread.run(Thread.java:834)
>         Suppressed: java.net.SocketException: Software caused connection abort: socket write error
>                 at java.base/java.net.SocketOutputStream.socketWrite0(Native Method)
>                 at java.base/java.net.SocketOutputStream.socketWrite(SocketOutputStream.java:110)
>                 at java.base/java.net.SocketOutputStream.write(SocketOutputStream.java:150)
>                 at java.base/sun.security.ssl.SSLSocketOutputRecord.encodeAlert(SSLSocketOutputRecord.java:81)
>                 at java.base/sun.security.ssl.TransportContext.fatal(TransportContext.java:351)
>                 ... 64 more
> Caused by: java.net.SocketException: Software caused connection abort: recv failed
>         at java.base/java.net.SocketInputStream.socketRead0(Native Method)
>         at java.base/java.net.SocketInputStream.socketRead(SocketInputStream.java:115)
>         at java.base/java.net.SocketInputStream.read(SocketInputStream.java:168)
>         at java.base/java.net.SocketInputStream.read(SocketInputStream.java:140)
>         at java.base/sun.security.ssl.SSLSocketInputRecord.read(SSLSocketInputRecord.java:448)
>         at java.base/sun.security.ssl.SSLSocketInputRecord.bytesInCompletePacket(SSLSocketInputRecord.java:68)
>         at java.base/sun.security.ssl.SSLSocketImpl.readApplicationRecord(SSLSocketImpl.java:1104)
>         at java.base/sun.security.ssl.SSLSocketImpl$AppInputStream.read(SSLSocketImpl.java:823)
>         ... 60 more
>
>
> FAILED:  org.apache.solr.ltr.store.rest.TestModelManagerPersistence.testFilePersistence
>
> Error Message:
> Software caused connection abort: recv failed
>
> Stack Trace:
> javax.net.ssl.SSLException: Software caused connection abort: recv failed
>         at __randomizedtesting.SeedInfo.seed([60CD0E908CE38B0A:426C6AED298FED4F]:0)
>         at java.base/sun.security.ssl.Alert.createSSLException(Alert.java:127)
>         at java.base/sun.security.ssl.TransportContext.fatal(TransportContext.java:320)
>         at java.base/sun.security.ssl.TransportContext.fatal(TransportContext.java:263)
>         at java.base/sun.security.ssl.TransportContext.fatal(TransportContext.java:258)
>         at java.base/sun.security.ssl.SSLSocketImpl.handleException(SSLSocketImpl.java:1315)
>         at java.base/sun.security.ssl.SSLSocketImpl$AppInputStream.read(SSLSocketImpl.java:839)
>         at org.apache.http.impl.io.SessionInputBufferImpl.streamRead(SessionInputBufferImpl.java:137)
>         at org.apache.http.impl.io.SessionInputBufferImpl.fillBuffer(SessionInputBufferImpl.java:153)
>         at org.apache.http.impl.io.SessionInputBufferImpl.readLine(SessionInputBufferImpl.java:282)
>         at org.apache.http.impl.conn.DefaultHttpResponseParser.parseHead(DefaultHttpResponseParser.java:138)
>         at org.apache.http.impl.conn.DefaultHttpResponseParser.parseHead(DefaultHttpResponseParser.java:56)
>         at org.apache.http.impl.io.AbstractMessageParser.parse(AbstractMessageParser.java:259)
>         at org.apache.http.impl.DefaultBHttpClientConnection.receiveResponseHeader(DefaultBHttpClientConnection.java:163)
>         at org.apache.http.impl.conn.CPoolProxy.receiveResponseHeader(CPoolProxy.java:165)
>         at org.apache.http.protocol.HttpRequestExecutor.doReceiveResponse(HttpRequestExecutor.java:273)
>         at org.apache.http.protocol.HttpRequestExecutor.execute(HttpRequestExecutor.java:125)
>         at org.apache.http.impl.execchain.MainClientExec.execute(MainClientExec.java:272)
>         at org.apache.http.impl.execchain.ProtocolExec.execute(ProtocolExec.java:185)
>         at org.apache.http.impl.execchain.RetryExec.execute(RetryExec.java:89)
>         at org.apache.http.impl.execchain.RedirectExec.execute(RedirectExec.java:110)
>         at org.apache.http.impl.client.InternalHttpClient.doExecute(InternalHttpClient.java:185)
>         at org.apache.http.impl.client.CloseableHttpClient.execute(CloseableHttpClient.java:83)
>         at org.apache.solr.util.RestTestHarness.getResponse(RestTestHarness.java:215)
>         at org.apache.solr.util.RestTestHarness.query(RestTestHarness.java:107)
>         at org.apache.solr.util.RestTestBase.assertJQ(RestTestBase.java:226)
>         at org.apache.solr.util.RestTestBase.assertJQ(RestTestBase.java:192)
>         at org.apache.solr.ltr.store.rest.TestModelManagerPersistence.testFilePersistence(TestModelManagerPersistence.java:173)
>         at java.base/jdk.internal.reflect.NativeMethodAccessorImpl.invoke0(Native Method)
>         at java.base/jdk.internal.reflect.NativeMethodAccessorImpl.invoke(NativeMethodAccessorImpl.java:62)
>         at java.base/jdk.internal.reflect.DelegatingMethodAccessorImpl.invoke(DelegatingMethodAccessorImpl.java:43)
>         at java.base/java.lang.reflect.Method.invoke(Method.java:566)
>         at com.carrotsearch.randomizedtesting.RandomizedRunner.invoke(RandomizedRunner.java:1750)
>         at com.carrotsearch.randomizedtesting.RandomizedRunner$8.evaluate(RandomizedRunner.java:938)
>         at com.carrotsearch.randomizedtesting.RandomizedRunner$9.evaluate(RandomizedRunner.java:974)
>         at com.carrotsearch.randomizedtesting.RandomizedRunner$10.evaluate(RandomizedRunner.java:988)
>         at com.carrotsearch.randomizedtesting.rules.SystemPropertiesRestoreRule$1.evaluate(SystemPropertiesRestoreRule.java:57)
>         at org.apache.lucene.util.TestRuleSetupTeardownChained$1.evaluate(TestRuleSetupTeardownChained.java:49)
>         at org.apache.lucene.util.AbstractBeforeAfterRule$1.evaluate(AbstractBeforeAfterRule.java:45)
>         at org.apache.lucene.util.TestRuleThreadAndTestName$1.evaluate(TestRuleThreadAndTestName.java:48)
>         at org.apache.lucene.util.TestRuleIgnoreAfterMaxFailures$1.evaluate(TestRuleIgnoreAfterMaxFailures.java:64)
>         at org.apache.lucene.util.TestRuleMarkFailure$1.evaluate(TestRuleMarkFailure.java:47)
>         at com.carrotsearch.randomizedtesting.rules.StatementAdapter.evaluate(StatementAdapter.java:36)
>         at com.carrotsearch.randomizedtesting.ThreadLeakControl$StatementRunner.run(ThreadLeakControl.java:368)
>         at com.carrotsearch.randomizedtesting.ThreadLeakControl.forkTimeoutingTask(ThreadLeakControl.java:817)
>         at com.carrotsearch.randomizedtesting.ThreadLeakControl$3.evaluate(ThreadLeakControl.java:468)
>         at com.carrotsearch.randomizedtesting.RandomizedRunner.runSingleTest(RandomizedRunner.java:947)
>         at com.carrotsearch.randomizedtesting.RandomizedRunner$5.evaluate(RandomizedRunner.java:832)
>         at com.carrotsearch.randomizedtesting.RandomizedRunner$6.evaluate(RandomizedRunner.java:883)
>         at com.carrotsearch.randomizedtesting.RandomizedRunner$7.evaluate(RandomizedRunner.java:894)
>         at com.carrotsearch.randomizedtesting.rules.StatementAdapter.evaluate(StatementAdapter.java:36)
>         at com.carrotsearch.randomizedtesting.rules.SystemPropertiesRestoreRule$1.evaluate(SystemPropertiesRestoreRule.java:57)
>         at org.apache.lucene.util.AbstractBeforeAfterRule$1.evaluate(AbstractBeforeAfterRule.java:45)
>         at com.carrotsearch.randomizedtesting.rules.StatementAdapter.evaluate(StatementAdapter.java:36)
>         at org.apache.lucene.util.TestRuleStoreClassName$1.evaluate(TestRuleStoreClassName.java:41)
>         at com.carrotsearch.randomizedtesting.rules.NoShadowingOrOverridesOnMethodsRule$1.evaluate(NoShadowingOrOverridesOnMethodsRule.java:40)
>         at com.carrotsearch.randomizedtesting.rules.NoShadowingOrOverridesOnMethodsRule$1.evaluate(NoShadowingOrOverridesOnMethodsRule.java:40)
>         at com.carrotsearch.randomizedtesting.rules.StatementAdapter.evaluate(StatementAdapter.java:36)
>         at com.carrotsearch.randomizedtesting.rules.StatementAdapter.evaluate(StatementAdapter.java:36)
>         at org.apache.lucene.util.TestRuleAssertionsRequired$1.evaluate(TestRuleAssertionsRequired.java:53)
>         at org.apache.lucene.util.TestRuleMarkFailure$1.evaluate(TestRuleMarkFailure.java:47)
>         at org.apache.lucene.util.TestRuleIgnoreAfterMaxFailures$1.evaluate(TestRuleIgnoreAfterMaxFailures.java:64)
>         at org.apache.lucene.util.TestRuleIgnoreTestSuites$1.evaluate(TestRuleIgnoreTestSuites.java:54)
>         at com.carrotsearch.randomizedtesting.rules.StatementAdapter.evaluate(StatementAdapter.java:36)
>         at com.carrotsearch.randomizedtesting.ThreadLeakControl$StatementRunner.run(ThreadLeakControl.java:368)
>         at java.base/java.lang.Thread.run(Thread.java:834)
>         Suppressed: java.net.SocketException: Software caused connection abort: socket write error
>                 at java.base/java.net.SocketOutputStream.socketWrite0(Native Method)
>                 at java.base/java.net.SocketOutputStream.socketWrite(SocketOutputStream.java:110)
>                 at java.base/java.net.SocketOutputStream.write(SocketOutputStream.java:150)
>                 at java.base/sun.security.ssl.SSLSocketOutputRecord.encodeAlert(SSLSocketOutputRecord.java:81)
>                 at java.base/sun.security.ssl.TransportContext.fatal(TransportContext.java:351)
>                 ... 63 more
> Caused by: java.net.SocketException: Software caused connection abort: recv failed
>         at java.base/java.net.SocketInputStream.socketRead0(Native Method)
>         at java.base/java.net.SocketInputStream.socketRead(SocketInputStream.java:115)
>         at java.base/java.net.SocketInputStream.read(SocketInputStream.java:168)
>         at java.base/java.net.SocketInputStream.read(SocketInputStream.java:140)
>         at java.base/sun.security.ssl.SSLSocketInputRecord.read(SSLSocketInputRecord.java:448)
>         at java.base/sun.security.ssl.SSLSocketInputRecord.bytesInCompletePacket(SSLSocketInputRecord.java:68)
>         at java.base/sun.security.ssl.SSLSocketImpl.readApplicationRecord(SSLSocketImpl.java:1104)
>         at java.base/sun.security.ssl.SSLSocketImpl$AppInputStream.read(SSLSocketImpl.java:823)
>         ... 59 more
>
>
> FAILED:  org.apache.solr.ltr.store.rest.TestModelManagerPersistence.testFilePersistence
>
> Error Message:
> Software caused connection abort: recv failed
>
> Stack Trace:
> javax.net.ssl.SSLException: Software caused connection abort: recv failed
>         at __randomizedtesting.SeedInfo.seed([60CD0E908CE38B0A:426C6AED298FED4F]:0)
>         at java.base/sun.security.ssl.Alert.createSSLException(Alert.java:127)
>         at java.base/sun.security.ssl.TransportContext.fatal(TransportContext.java:320)
>         at java.base/sun.security.ssl.TransportContext.fatal(TransportContext.java:263)
>         at java.base/sun.security.ssl.TransportContext.fatal(TransportContext.java:258)
>         at java.base/sun.security.ssl.SSLSocketImpl.handleException(SSLSocketImpl.java:1315)
>         at java.base/sun.security.ssl.SSLSocketImpl$AppInputStream.read(SSLSocketImpl.java:839)
>         at org.apache.http.impl.io.SessionInputBufferImpl.streamRead(SessionInputBufferImpl.java:137)
>         at org.apache.http.impl.io.SessionInputBufferImpl.fillBuffer(SessionInputBufferImpl.java:153)
>         at org.apache.http.impl.io.SessionInputBufferImpl.readLine(SessionInputBufferImpl.java:282)
>         at org.apache.http.impl.conn.DefaultHttpResponseParser.parseHead(DefaultHttpResponseParser.java:138)
>         at org.apache.http.impl.conn.DefaultHttpResponseParser.parseHead(DefaultHttpResponseParser.java:56)
>         at org.apache.http.impl.io.AbstractMessageParser.parse(AbstractMessageParser.java:259)
>         at org.apache.http.impl.DefaultBHttpClientConnection.receiveResponseHeader(DefaultBHttpClientConnection.java:163)
>         at org.apache.http.impl.conn.CPoolProxy.receiveResponseHeader(CPoolProxy.java:165)
>         at org.apache.http.protocol.HttpRequestExecutor.doReceiveResponse(HttpRequestExecutor.java:273)
>         at org.apache.http.protocol.HttpRequestExecutor.execute(HttpRequestExecutor.java:125)
>         at org.apache.http.impl.execchain.MainClientExec.execute(MainClientExec.java:272)
>         at org.apache.http.impl.execchain.ProtocolExec.execute(ProtocolExec.java:185)
>         at org.apache.http.impl.execchain.RetryExec.execute(RetryExec.java:89)
>         at org.apache.http.impl.execchain.RedirectExec.execute(RedirectExec.java:110)
>         at org.apache.http.impl.client.InternalHttpClient.doExecute(InternalHttpClient.java:185)
>         at org.apache.http.impl.client.CloseableHttpClient.execute(CloseableHttpClient.java:83)
>         at org.apache.solr.util.RestTestHarness.getResponse(RestTestHarness.java:215)
>         at org.apache.solr.util.RestTestHarness.query(RestTestHarness.java:107)
>         at org.apache.solr.util.RestTestBase.assertJQ(RestTestBase.java:226)
>         at org.apache.solr.util.RestTestBase.assertJQ(RestTestBase.java:192)
>         at org.apache.solr.ltr.store.rest.TestModelManagerPersistence.testFilePersistence(TestModelManagerPersistence.java:173)
>         at java.base/jdk.internal.reflect.NativeMethodAccessorImpl.invoke0(Native Method)
>         at java.base/jdk.internal.reflect.NativeMethodAccessorImpl.invoke(NativeMethodAccessorImpl.java:62)
>         at java.base/jdk.internal.reflect.DelegatingMethodAccessorImpl.invoke(DelegatingMethodAccessorImpl.java:43)
>         at java.base/java.lang.reflect.Method.invoke(Method.java:566)
>         at com.carrotsearch.randomizedtesting.RandomizedRunner.invoke(RandomizedRunner.java:1750)
>         at com.carrotsearch.randomizedtesting.RandomizedRunner$8.evaluate(RandomizedRunner.java:938)
>         at com.carrotsearch.randomizedtesting.RandomizedRunner$9.evaluate(RandomizedRunner.java:974)
>         at com.carrotsearch.randomizedtesting.RandomizedRunner$10.evaluate(RandomizedRunner.java:988)
>         at com.carrotsearch.randomizedtesting.rules.SystemPropertiesRestoreRule$1.evaluate(SystemPropertiesRestoreRule.java:57)
>         at org.apache.lucene.util.TestRuleSetupTeardownChained$1.evaluate(TestRuleSetupTeardownChained.java:49)
>         at org.apache.lucene.util.AbstractBeforeAfterRule$1.evaluate(AbstractBeforeAfterRule.java:45)
>         at org.apache.lucene.util.TestRuleThreadAndTestName$1.evaluate(TestRuleThreadAndTestName.java:48)
>         at org.apache.lucene.util.TestRuleIgnoreAfterMaxFailures$1.evaluate(TestRuleIgnoreAfterMaxFailures.java:64)
>         at org.apache.lucene.util.TestRuleMarkFailure$1.evaluate(TestRuleMarkFailure.java:47)
>         at com.carrotsearch.randomizedtesting.rules.StatementAdapter.evaluate(StatementAdapter.java:36)
>         at com.carrotsearch.randomizedtesting.ThreadLeakControl$StatementRunner.run(ThreadLeakControl.java:368)
>         at com.carrotsearch.randomizedtesting.ThreadLeakControl.forkTimeoutingTask(ThreadLeakControl.java:817)
>         at com.carrotsearch.randomizedtesting.ThreadLeakControl$3.evaluate(ThreadLeakControl.java:468)
>         at com.carrotsearch.randomizedtesting.RandomizedRunner.runSingleTest(RandomizedRunner.java:947)
>         at com.carrotsearch.randomizedtesting.RandomizedRunner$5.evaluate(RandomizedRunner.java:832)
>         at com.carrotsearch.randomizedtesting.RandomizedRunner$6.evaluate(RandomizedRunner.java:883)
>         at com.carrotsearch.randomizedtesting.RandomizedRunner$7.evaluate(RandomizedRunner.java:894)
>         at com.carrotsearch.randomizedtesting.rules.StatementAdapter.evaluate(StatementAdapter.java:36)
>         at com.carrotsearch.randomizedtesting.rules.SystemPropertiesRestoreRule$1.evaluate(SystemPropertiesRestoreRule.java:57)
>         at org.apache.lucene.util.AbstractBeforeAfterRule$1.evaluate(AbstractBeforeAfterRule.java:45)
>         at com.carrotsearch.randomizedtesting.rules.StatementAdapter.evaluate(StatementAdapter.java:36)
>         at org.apache.lucene.util.TestRuleStoreClassName$1.evaluate(TestRuleStoreClassName.java:41)
>         at com.carrotsearch.randomizedtesting.rules.NoShadowingOrOverridesOnMethodsRule$1.evaluate(NoShadowingOrOverridesOnMethodsRule.java:40)
>         at com.carrotsearch.randomizedtesting.rules.NoShadowingOrOverridesOnMethodsRule$1.evaluate(NoShadowingOrOverridesOnMethodsRule.java:40)
>         at com.carrotsearch.randomizedtesting.rules.StatementAdapter.evaluate(StatementAdapter.java:36)
>         at com.carrotsearch.randomizedtesting.rules.StatementAdapter.evaluate(StatementAdapter.java:36)
>         at org.apache.lucene.util.TestRuleAssertionsRequired$1.evaluate(TestRuleAssertionsRequired.java:53)
>         at org.apache.lucene.util.TestRuleMarkFailure$1.evaluate(TestRuleMarkFailure.java:47)
>         at org.apache.lucene.util.TestRuleIgnoreAfterMaxFailures$1.evaluate(TestRuleIgnoreAfterMaxFailures.java:64)
>         at org.apache.lucene.util.TestRuleIgnoreTestSuites$1.evaluate(TestRuleIgnoreTestSuites.java:54)
>         at com.carrotsearch.randomizedtesting.rules.StatementAdapter.evaluate(StatementAdapter.java:36)
>         at com.carrotsearch.randomizedtesting.ThreadLeakControl$StatementRunner.run(ThreadLeakControl.java:368)
>         at java.base/java.lang.Thread.run(Thread.java:834)
>         Suppressed: java.net.SocketException: Software caused connection abort: socket write error
>                 at java.base/java.net.SocketOutputStream.socketWrite0(Native Method)
>                 at java.base/java.net.SocketOutputStream.socketWrite(SocketOutputStream.java:110)
>                 at java.base/java.net.SocketOutputStream.write(SocketOutputStream.java:150)
>                 at java.base/sun.security.ssl.SSLSocketOutputRecord.encodeAlert(SSLSocketOutputRecord.java:81)
>                 at java.base/sun.security.ssl.TransportContext.fatal(TransportContext.java:351)
>                 ... 63 more
> Caused by: java.net.SocketException: Software caused connection abort: recv failed
>         at java.base/java.net.SocketInputStream.socketRead0(Native Method)
>         at java.base/java.net.SocketInputStream.socketRead(SocketInputStream.java:115)
>         at java.base/java.net.SocketInputStream.read(SocketInputStream.java:168)
>         at java.base/java.net.SocketInputStream.read(SocketInputStream.java:140)
>         at java.base/sun.security.ssl.SSLSocketInputRecord.read(SSLSocketInputRecord.java:448)
>         at java.base/sun.security.ssl.SSLSocketInputRecord.bytesInCompletePacket(SSLSocketInputRecord.java:68)
>         at java.base/sun.security.ssl.SSLSocketImpl.readApplicationRecord(SSLSocketImpl.java:1104)
>         at java.base/sun.security.ssl.SSLSocketImpl$AppInputStream.read(SSLSocketImpl.java:823)
>         ... 59 more
>
>
> FAILED:  org.apache.solr.ltr.store.rest.TestModelManagerPersistence.testWrapperModelPersistence
>
> Error Message:
> Software caused connection abort: recv failed
>
> Stack Trace:
> javax.net.ssl.SSLException: Software caused connection abort: recv failed
>         at __randomizedtesting.SeedInfo.seed([60CD0E908CE38B0A:15A77D4E331FF24F]:0)
>         at java.base/sun.security.ssl.Alert.createSSLException(Alert.java:127)
>         at java.base/sun.security.ssl.TransportContext.fatal(TransportContext.java:320)
>         at java.base/sun.security.ssl.TransportContext.fatal(TransportContext.java:263)
>         at java.base/sun.security.ssl.TransportContext.fatal(TransportContext.java:258)
>         at java.base/sun.security.ssl.SSLSocketImpl.handleException(SSLSocketImpl.java:1315)
>         at java.base/sun.security.ssl.SSLSocketImpl$AppInputStream.read(SSLSocketImpl.java:839)
>         at org.apache.http.impl.io.SessionInputBufferImpl.streamRead(SessionInputBufferImpl.java:137)
>         at org.apache.http.impl.io.SessionInputBufferImpl.fillBuffer(SessionInputBufferImpl.java:153)
>         at org.apache.http.impl.io.SessionInputBufferImpl.readLine(SessionInputBufferImpl.java:282)
>         at org.apache.http.impl.conn.DefaultHttpResponseParser.parseHead(DefaultHttpResponseParser.java:138)
>         at org.apache.http.impl.conn.DefaultHttpResponseParser.parseHead(DefaultHttpResponseParser.java:56)
>         at org.apache.http.impl.io.AbstractMessageParser.parse(AbstractMessageParser.java:259)
>         at org.apache.http.impl.DefaultBHttpClientConnection.receiveResponseHeader(DefaultBHttpClientConnection.java:163)
>         at org.apache.http.impl.conn.CPoolProxy.receiveResponseHeader(CPoolProxy.java:165)
>         at org.apache.http.protocol.HttpRequestExecutor.doReceiveResponse(HttpRequestExecutor.java:273)
>         at org.apache.http.protocol.HttpRequestExecutor.execute(HttpRequestExecutor.java:125)
>         at org.apache.http.impl.execchain.MainClientExec.execute(MainClientExec.java:272)
>         at org.apache.http.impl.execchain.ProtocolExec.execute(ProtocolExec.java:185)
>         at org.apache.http.impl.execchain.RetryExec.execute(RetryExec.java:89)
>         at org.apache.http.impl.execchain.RedirectExec.execute(RedirectExec.java:110)
>         at org.apache.http.impl.client.InternalHttpClient.doExecute(InternalHttpClient.java:185)
>         at org.apache.http.impl.client.CloseableHttpClient.execute(CloseableHttpClient.java:83)
>         at org.apache.solr.util.RestTestHarness.getResponse(RestTestHarness.java:215)
>         at org.apache.solr.util.RestTestHarness.query(RestTestHarness.java:107)
>         at org.apache.solr.util.RestTestBase.assertJQ(RestTestBase.java:226)
>         at org.apache.solr.util.RestTestBase.assertJQ(RestTestBase.java:192)
>         at org.apache.solr.ltr.store.rest.TestModelManagerPersistence.doWrapperModelPersistenceChecks(TestModelManagerPersistence.java:207)
>         at org.apache.solr.ltr.store.rest.TestModelManagerPersistence.testWrapperModelPersistence(TestModelManagerPersistence.java:260)
>         at java.base/jdk.internal.reflect.NativeMethodAccessorImpl.invoke0(Native Method)
>         at java.base/jdk.internal.reflect.NativeMethodAccessorImpl.invoke(NativeMethodAccessorImpl.java:62)
>         at java.base/jdk.internal.reflect.DelegatingMethodAccessorImpl.invoke(DelegatingMethodAccessorImpl.java:43)
>         at java.base/java.lang.reflect.Method.invoke(Method.java:566)
>         at com.carrotsearch.randomizedtesting.RandomizedRunner.invoke(RandomizedRunner.java:1750)
>         at com.carrotsearch.randomizedtesting.RandomizedRunner$8.evaluate(RandomizedRunner.java:938)
>         at com.carrotsearch.randomizedtesting.RandomizedRunner$9.evaluate(RandomizedRunner.java:974)
>         at com.carrotsearch.randomizedtesting.RandomizedRunner$10.evaluate(RandomizedRunner.java:988)
>         at com.carrotsearch.randomizedtesting.rules.SystemPropertiesRestoreRule$1.evaluate(SystemPropertiesRestoreRule.java:57)
>         at org.apache.lucene.util.TestRuleSetupTeardownChained$1.evaluate(TestRuleSetupTeardownChained.java:49)
>         at org.apache.lucene.util.AbstractBeforeAfterRule$1.evaluate(AbstractBeforeAfterRule.java:45)
>         at org.apache.lucene.util.TestRuleThreadAndTestName$1.evaluate(TestRuleThreadAndTestName.java:48)
>         at org.apache.lucene.util.TestRuleIgnoreAfterMaxFailures$1.evaluate(TestRuleIgnoreAfterMaxFailures.java:64)
>         at org.apache.lucene.util.TestRuleMarkFailure$1.evaluate(TestRuleMarkFailure.java:47)
>         at com.carrotsearch.randomizedtesting.rules.StatementAdapter.evaluate(StatementAdapter.java:36)
>         at com.carrotsearch.randomizedtesting.ThreadLeakControl$StatementRunner.run(ThreadLeakControl.java:368)
>         at com.carrotsearch.randomizedtesting.ThreadLeakControl.forkTimeoutingTask(ThreadLeakControl.java:817)
>         at com.carrotsearch.randomizedtesting.ThreadLeakControl$3.evaluate(ThreadLeakControl.java:468)
>         at com.carrotsearch.randomizedtesting.RandomizedRunner.runSingleTest(RandomizedRunner.java:947)
>         at com.carrotsearch.randomizedtesting.RandomizedRunner$5.evaluate(RandomizedRunner.java:832)
>         at com.carrotsearch.randomizedtesting.RandomizedRunner$6.evaluate(RandomizedRunner.java:883)
>         at com.carrotsearch.randomizedtesting.RandomizedRunner$7.evaluate(RandomizedRunner.java:894)
>         at com.carrotsearch.randomizedtesting.rules.StatementAdapter.evaluate(StatementAdapter.java:36)
>         at com.carrotsearch.randomizedtesting.rules.SystemPropertiesRestoreRule$1.evaluate(SystemPropertiesRestoreRule.java:57)
>         at org.apache.lucene.util.AbstractBeforeAfterRule$1.evaluate(AbstractBeforeAfterRule.java:45)
>         at com.carrotsearch.randomizedtesting.rules.StatementAdapter.evaluate(StatementAdapter.java:36)
>         at org.apache.lucene.util.TestRuleStoreClassName$1.evaluate(TestRuleStoreClassName.java:41)
>         at com.carrotsearch.randomizedtesting.rules.NoShadowingOrOverridesOnMethodsRule$1.evaluate(NoShadowingOrOverridesOnMethodsRule.java:40)
>         at com.carrotsearch.randomizedtesting.rules.NoShadowingOrOverridesOnMethodsRule$1.evaluate(NoShadowingOrOverridesOnMethodsRule.java:40)
>         at com.carrotsearch.randomizedtesting.rules.StatementAdapter.evaluate(StatementAdapter.java:36)
>         at com.carrotsearch.randomizedtesting.rules.StatementAdapter.evaluate(StatementAdapter.java:36)
>         at org.apache.lucene.util.TestRuleAssertionsRequired$1.evaluate(TestRuleAssertionsRequired.java:53)
>         at org.apache.lucene.util.TestRuleMarkFailure$1.evaluate(TestRuleMarkFailure.java:47)
>         at org.apache.lucene.util.TestRuleIgnoreAfterMaxFailures$1.evaluate(TestRuleIgnoreAfterMaxFailures.java:64)
>         at org.apache.lucene.util.TestRuleIgnoreTestSuites$1.evaluate(TestRuleIgnoreTestSuites.java:54)
>         at com.carrotsearch.randomizedtesting.rules.StatementAdapter.evaluate(StatementAdapter.java:36)
>         at com.carrotsearch.randomizedtesting.ThreadLeakControl$StatementRunner.run(ThreadLeakControl.java:368)
>         at java.base/java.lang.Thread.run(Thread.java:834)
>         Suppressed: java.net.SocketException: Software caused connection abort: socket write error
>                 at java.base/java.net.SocketOutputStream.socketWrite0(Native Method)
>                 at java.base/java.net.SocketOutputStream.socketWrite(SocketOutputStream.java:110)
>                 at java.base/java.net.SocketOutputStream.write(SocketOutputStream.java:150)
>                 at java.base/sun.security.ssl.SSLSocketOutputRecord.encodeAlert(SSLSocketOutputRecord.java:81)
>                 at java.base/sun.security.ssl.TransportContext.fatal(TransportContext.java:351)
>                 ... 64 more
> Caused by: java.net.SocketException: Software caused connection abort: recv failed
>         at java.base/java.net.SocketInputStream.socketRead0(Native Method)
>         at java.base/java.net.SocketInputStream.socketRead(SocketInputStream.java:115)
>         at java.base/java.net.SocketInputStream.read(SocketInputStream.java:168)
>         at java.base/java.net.SocketInputStream.read(SocketInputStream.java:140)
>         at java.base/sun.security.ssl.SSLSocketInputRecord.read(SSLSocketInputRecord.java:448)
>         at java.base/sun.security.ssl.SSLSocketInputRecord.bytesInCompletePacket(SSLSocketInputRecord.java:68)
>         at java.base/sun.security.ssl.SSLSocketImpl.readApplicationRecord(SSLSocketImpl.java:1104)
>         at java.base/sun.security.ssl.SSLSocketImpl$AppInputStream.read(SSLSocketImpl.java:823)
>         ... 60 more
>
>
> FAILED:  junit.framework.TestSuite.org.apache.solr.pkg.TestPackages
>
> Error Message:
> Could not remove the following files (in the order of attempts):    C:\Users\jenkins\workspace\Lucene-Solr-master-Windows\solr\build\solr-core\test\J1\temp\solr.pkg.TestPackages_CAB498B09CBB6E7F-001\tempDir-002\node3\filestore\mypkg\runtimelibs.jar: java.nio.file.FileSystemException: C:\Users\jenkins\workspace\Lucene-Solr-master-Windows\solr\build\solr-core\test\J1\temp\solr.pkg.TestPackages_CAB498B09CBB6E7F-001\tempDir-002\node3\filestore\mypkg\runtimelibs.jar: The process cannot access the file because it is being used by another process.     C:\Users\jenkins\workspace\Lucene-Solr-master-Windows\solr\build\solr-core\test\J1\temp\solr.pkg.TestPackages_CAB498B09CBB6E7F-001\tempDir-002\node3\filestore\mypkg\runtimelibs_v3.jar: java.nio.file.FileSystemException: C:\Users\jenkins\workspace\Lucene-Solr-master-Windows\solr\build\solr-core\test\J1\temp\solr.pkg.TestPackages_CAB498B09CBB6E7F-001\tempDir-002\node3\filestore\mypkg\runtimelibs_v3.jar: The process cannot access the file because it is being used by another process.     C:\Users\jenkins\workspace\Lucene-Solr-master-Windows\solr\build\solr-core\test\J1\temp\solr.pkg.TestPackages_CAB498B09CBB6E7F-001\tempDir-002\node3\filestore\mypkg\runtimelibs_v2.jar: java.nio.file.FileSystemException: C:\Users\jenkins\workspace\Lucene-Solr-master-Windows\solr\build\solr-core\test\J1\temp\solr.pkg.TestPackages_CAB498B09CBB6E7F-001\tempDir-002\node3\filestore\mypkg\runtimelibs_v2.jar: The process cannot access the file because it is being used by another process.     C:\Users\jenkins\workspace\Lucene-Solr-master-Windows\solr\build\solr-core\test\J1\temp\solr.pkg.TestPackages_CAB498B09CBB6E7F-001\tempDir-002\node3\filestore\mypkg: java.nio.file.DirectoryNotEmptyException: C:\Users\jenkins\workspace\Lucene-Solr-master-Windows\solr\build\solr-core\test\J1\temp\solr.pkg.TestPackages_CAB498B09CBB6E7F-001\tempDir-002\node3\filestore\mypkg    C:\Users\jenkins\workspace\Lucene-Solr-master-Windows\solr\build\solr-core\test\J1\temp\solr.pkg.TestPackages_CAB498B09CBB6E7F-001\tempDir-002\node3\filestore: java.nio.file.DirectoryNotEmptyException: C:\Users\jenkins\workspace\Lucene-Solr-master-Windows\solr\build\solr-core\test\J1\temp\solr.pkg.TestPackages_CAB498B09CBB6E7F-001\tempDir-002\node3\filestore    C:\Users\jenkins\workspace\Lucene-Solr-master-Windows\solr\build\solr-core\test\J1\temp\solr.pkg.TestPackages_CAB498B09CBB6E7F-001\tempDir-002\node3: java.nio.file.DirectoryNotEmptyException: C:\Users\jenkins\workspace\Lucene-Solr-master-Windows\solr\build\solr-core\test\J1\temp\solr.pkg.TestPackages_CAB498B09CBB6E7F-001\tempDir-002\node3    C:\Users\jenkins\workspace\Lucene-Solr-master-Windows\solr\build\solr-core\test\J1\temp\solr.pkg.TestPackages_CAB498B09CBB6E7F-001\tempDir-002\node1\filestore\mypkg\runtimelibs.jar: java.nio.file.FileSystemException: C:\Users\jenkins\workspace\Lucene-Solr-master-Windows\solr\build\solr-core\test\J1\temp\solr.pkg.TestPackages_CAB498B09CBB6E7F-001\tempDir-002\node1\filestore\mypkg\runtimelibs.jar: The process cannot access the file because it is being used by another process.     C:\Users\jenkins\workspace\Lucene-Solr-master-Windows\solr\build\solr-core\test\J1\temp\solr.pkg.TestPackages_CAB498B09CBB6E7F-001\tempDir-002\node1\filestore\mypkg\runtimelibs_v3.jar: java.nio.file.FileSystemException: C:\Users\jenkins\workspace\Lucene-Solr-master-Windows\solr\build\solr-core\test\J1\temp\solr.pkg.TestPackages_CAB498B09CBB6E7F-001\tempDir-002\node1\filestore\mypkg\runtimelibs_v3.jar: The process cannot access the file because it is being used by another process.     C:\Users\jenkins\workspace\Lucene-Solr-master-Windows\solr\build\solr-core\test\J1\temp\solr.pkg.TestPackages_CAB498B09CBB6E7F-001\tempDir-002\node1\filestore\mypkg\runtimelibs_v2.jar: java.nio.file.FileSystemException: C:\Users\jenkins\workspace\Lucene-Solr-master-Windows\solr\build\solr-core\test\J1\temp\solr.pkg.TestPackages_CAB498B09CBB6E7F-001\tempDir-002\node1\filestore\mypkg\runtimelibs_v2.jar: The process cannot access the file because it is being used by another process.     C:\Users\jenkins\workspace\Lucene-Solr-master-Windows\solr\build\solr-core\test\J1\temp\solr.pkg.TestPackages_CAB498B09CBB6E7F-001\tempDir-002\node1\filestore\mypkg: java.nio.file.DirectoryNotEmptyException: C:\Users\jenkins\workspace\Lucene-Solr-master-Windows\solr\build\solr-core\test\J1\temp\solr.pkg.TestPackages_CAB498B09CBB6E7F-001\tempDir-002\node1\filestore\mypkg    C:\Users\jenkins\workspace\Lucene-Solr-master-Windows\solr\build\solr-core\test\J1\temp\solr.pkg.TestPackages_CAB498B09CBB6E7F-001\tempDir-002\node1\filestore: java.nio.file.DirectoryNotEmptyException: C:\Users\jenkins\workspace\Lucene-Solr-master-Windows\solr\build\solr-core\test\J1\temp\solr.pkg.TestPackages_CAB498B09CBB6E7F-001\tempDir-002\node1\filestore    C:\Users\jenkins\workspace\Lucene-Solr-master-Windows\solr\build\solr-core\test\J1\temp\solr.pkg.TestPackages_CAB498B09CBB6E7F-001\tempDir-002\node1: java.nio.file.DirectoryNotEmptyException: C:\Users\jenkins\workspace\Lucene-Solr-master-Windows\solr\build\solr-core\test\J1\temp\solr.pkg.TestPackages_CAB498B09CBB6E7F-001\tempDir-002\node1    C:\Users\jenkins\workspace\Lucene-Solr-master-Windows\solr\build\solr-core\test\J1\temp\solr.pkg.TestPackages_CAB498B09CBB6E7F-001\tempDir-002\node2\filestore\mypkg\runtimelibs.jar: java.nio.file.FileSystemException: C:\Users\jenkins\workspace\Lucene-Solr-master-Windows\solr\build\solr-core\test\J1\temp\solr.pkg.TestPackages_CAB498B09CBB6E7F-001\tempDir-002\node2\filestore\mypkg\runtimelibs.jar: The process cannot access the file because it is being used by another process.     C:\Users\jenkins\workspace\Lucene-Solr-master-Windows\solr\build\solr-core\test\J1\temp\solr.pkg.TestPackages_CAB498B09CBB6E7F-001\tempDir-002\node2\filestore\mypkg\runtimelibs_v3.jar: java.nio.file.FileSystemException: C:\Users\jenkins\workspace\Lucene-Solr-master-Windows\solr\build\solr-core\test\J1\temp\solr.pkg.TestPackages_CAB498B09CBB6E7F-001\tempDir-002\node2\filestore\mypkg\runtimelibs_v3.jar: The process cannot access the file because it is being used by another process.     C:\Users\jenkins\workspace\Lucene-Solr-master-Windows\solr\build\solr-core\test\J1\temp\solr.pkg.TestPackages_CAB498B09CBB6E7F-001\tempDir-002\node2\filestore\mypkg\runtimelibs_v2.jar: java.nio.file.FileSystemException: C:\Users\jenkins\workspace\Lucene-Solr-master-Windows\solr\build\solr-core\test\J1\temp\solr.pkg.TestPackages_CAB498B09CBB6E7F-001\tempDir-002\node2\filestore\mypkg\runtimelibs_v2.jar: The process cannot access the file because it is being used by another process.     C:\Users\jenkins\workspace\Lucene-Solr-master-Windows\solr\build\solr-core\test\J1\temp\solr.pkg.TestPackages_CAB498B09CBB6E7F-001\tempDir-002\node2\filestore\mypkg: java.nio.file.DirectoryNotEmptyException: C:\Users\jenkins\workspace\Lucene-Solr-master-Windows\solr\build\solr-core\test\J1\temp\solr.pkg.TestPackages_CAB498B09CBB6E7F-001\tempDir-002\node2\filestore\mypkg    C:\Users\jenkins\workspace\Lucene-Solr-master-Windows\solr\build\solr-core\test\J1\temp\solr.pkg.TestPackages_CAB498B09CBB6E7F-001\tempDir-002\node2\filestore: java.nio.file.DirectoryNotEmptyException: C:\Users\jenkins\workspace\Lucene-Solr-master-Windows\solr\build\solr-core\test\J1\temp\solr.pkg.TestPackages_CAB498B09CBB6E7F-001\tempDir-002\node2\filestore    C:\Users\jenkins\workspace\Lucene-Solr-master-Windows\solr\build\solr-core\test\J1\temp\solr.pkg.TestPackages_CAB498B09CBB6E7F-001\tempDir-002\node2: java.nio.file.DirectoryNotEmptyException: C:\Users\jenkins\workspace\Lucene-Solr-master-Windows\solr\build\solr-core\test\J1\temp\solr.pkg.TestPackages_CAB498B09CBB6E7F-001\tempDir-002\node2    C:\Users\jenkins\workspace\Lucene-Solr-master-Windows\solr\build\solr-core\test\J1\temp\solr.pkg.TestPackages_CAB498B09CBB6E7F-001\tempDir-002\node4\filestore\mypkg\runtimelibs.jar: java.nio.file.FileSystemException: C:\Users\jenkins\workspace\Lucene-Solr-master-Windows\solr\build\solr-core\test\J1\temp\solr.pkg.TestPackages_CAB498B09CBB6E7F-001\tempDir-002\node4\filestore\mypkg\runtimelibs.jar: The process cannot access the file because it is being used by another process.     C:\Users\jenkins\workspace\Lucene-Solr-master-Windows\solr\build\solr-core\test\J1\temp\solr.pkg.TestPackages_CAB498B09CBB6E7F-001\tempDir-002\node4\filestore\mypkg\runtimelibs_v3.jar: java.nio.file.FileSystemException: C:\Users\jenkins\workspace\Lucene-Solr-master-Windows\solr\build\solr-core\test\J1\temp\solr.pkg.TestPackages_CAB498B09CBB6E7F-001\tempDir-002\node4\filestore\mypkg\runtimelibs_v3.jar: The process cannot access the file because it is being used by another process.     C:\Users\jenkins\workspace\Lucene-Solr-master-Windows\solr\build\solr-core\test\J1\temp\solr.pkg.TestPackages_CAB498B09CBB6E7F-001\tempDir-002\node4\filestore\mypkg\runtimelibs_v2.jar: java.nio.file.FileSystemException: C:\Users\jenkins\workspace\Lucene-Solr-master-Windows\solr\build\solr-core\test\J1\temp\solr.pkg.TestPackages_CAB498B09CBB6E7F-001\tempDir-002\node4\filestore\mypkg\runtimelibs_v2.jar: The process cannot access the file because it is being used by another process.     C:\Users\jenkins\workspace\Lucene-Solr-master-Windows\solr\build\solr-core\test\J1\temp\solr.pkg.TestPackages_CAB498B09CBB6E7F-001\tempDir-002\node4\filestore\mypkg: java.nio.file.DirectoryNotEmptyException: C:\Users\jenkins\workspace\Lucene-Solr-master-Windows\solr\build\solr-core\test\J1\temp\solr.pkg.TestPackages_CAB498B09CBB6E7F-001\tempDir-002\node4\filestore\mypkg    C:\Users\jenkins\workspace\Lucene-Solr-master-Windows\solr\build\solr-core\test\J1\temp\solr.pkg.TestPackages_CAB498B09CBB6E7F-001\tempDir-002\node4\filestore: java.nio.file.DirectoryNotEmptyException: C:\Users\jenkins\workspace\Lucene-Solr-master-Windows\solr\build\solr-core\test\J1\temp\solr.pkg.TestPackages_CAB498B09CBB6E7F-001\tempDir-002\node4\filestore    C:\Users\jenkins\workspace\Lucene-Solr-master-Windows\solr\build\solr-core\test\J1\temp\solr.pkg.TestPackages_CAB498B09CBB6E7F-001\tempDir-002\node4: java.nio.file.DirectoryNotEmptyException: C:\Users\jenkins\workspace\Lucene-Solr-master-Windows\solr\build\solr-core\test\J1\temp\solr.pkg.TestPackages_CAB498B09CBB6E7F-001\tempDir-002\node4    C:\Users\jenkins\workspace\Lucene-Solr-master-Windows\solr\build\solr-core\test\J1\temp\solr.pkg.TestPackages_CAB498B09CBB6E7F-001\tempDir-002: java.nio.file.DirectoryNotEmptyException: C:\Users\jenkins\workspace\Lucene-Solr-master-Windows\solr\build\solr-core\test\J1\temp\solr.pkg.TestPackages_CAB498B09CBB6E7F-001\tempDir-002    C:\Users\jenkins\workspace\Lucene-Solr-master-Windows\solr\build\solr-core\test\J1\temp\solr.pkg.TestPackages_CAB498B09CBB6E7F-001: java.nio.file.DirectoryNotEmptyException: C:\Users\jenkins\workspace\Lucene-Solr-master-Windows\solr\build\solr-core\test\J1\temp\solr.pkg.TestPackages_CAB498B09CBB6E7F-001
>
> Stack Trace:
> java.io.IOException: Could not remove the following files (in the order of attempts):
>    C:\Users\jenkins\workspace\Lucene-Solr-master-Windows\solr\build\solr-core\test\J1\temp\solr.pkg.TestPackages_CAB498B09CBB6E7F-001\tempDir-002\node3\filestore\mypkg\runtimelibs.jar: java.nio.file.FileSystemException: C:\Users\jenkins\workspace\Lucene-Solr-master-Windows\solr\build\solr-core\test\J1\temp\solr.pkg.TestPackages_CAB498B09CBB6E7F-001\tempDir-002\node3\filestore\mypkg\runtimelibs.jar: The process cannot access the file because it is being used by another process.
>
>    C:\Users\jenkins\workspace\Lucene-Solr-master-Windows\solr\build\solr-core\test\J1\temp\solr.pkg.TestPackages_CAB498B09CBB6E7F-001\tempDir-002\node3\filestore\mypkg\runtimelibs_v3.jar: java.nio.file.FileSystemException: C:\Users\jenkins\workspace\Lucene-Solr-master-Windows\solr\build\solr-core\test\J1\temp\solr.pkg.TestPackages_CAB498B09CBB6E7F-001\tempDir-002\node3\filestore\mypkg\runtimelibs_v3.jar: The process cannot access the file because it is being used by another process.
>
>    C:\Users\jenkins\workspace\Lucene-Solr-master-Windows\solr\build\solr-core\test\J1\temp\solr.pkg.TestPackages_CAB498B09CBB6E7F-001\tempDir-002\node3\filestore\mypkg\runtimelibs_v2.jar: java.nio.file.FileSystemException: C:\Users\jenkins\workspace\Lucene-Solr-master-Windows\solr\build\solr-core\test\J1\temp\solr.pkg.TestPackages_CAB498B09CBB6E7F-001\tempDir-002\node3\filestore\mypkg\runtimelibs_v2.jar: The process cannot access the file because it is being used by another process.
>
>    C:\Users\jenkins\workspace\Lucene-Solr-master-Windows\solr\build\solr-core\test\J1\temp\solr.pkg.TestPackages_CAB498B09CBB6E7F-001\tempDir-002\node3\filestore\mypkg: java.nio.file.DirectoryNotEmptyException: C:\Users\jenkins\workspace\Lucene-Solr-master-Windows\solr\build\solr-core\test\J1\temp\solr.pkg.TestPackages_CAB498B09CBB6E7F-001\tempDir-002\node3\filestore\mypkg
>    C:\Users\jenkins\workspace\Lucene-Solr-master-Windows\solr\build\solr-core\test\J1\temp\solr.pkg.TestPackages_CAB498B09CBB6E7F-001\tempDir-002\node3\filestore: java.nio.file.DirectoryNotEmptyException: C:\Users\jenkins\workspace\Lucene-Solr-master-Windows\solr\build\solr-core\test\J1\temp\solr.pkg.TestPackages_CAB498B09CBB6E7F-001\tempDir-002\node3\filestore
>    C:\Users\jenkins\workspace\Lucene-Solr-master-Windows\solr\build\solr-core\test\J1\temp\solr.pkg.TestPackages_CAB498B09CBB6E7F-001\tempDir-002\node3: java.nio.file.DirectoryNotEmptyException: C:\Users\jenkins\workspace\Lucene-Solr-master-Windows\solr\build\solr-core\test\J1\temp\solr.pkg.TestPackages_CAB498B09CBB6E7F-001\tempDir-002\node3
>    C:\Users\jenkins\workspace\Lucene-Solr-master-Windows\solr\build\solr-core\test\J1\temp\solr.pkg.TestPackages_CAB498B09CBB6E7F-001\tempDir-002\node1\filestore\mypkg\runtimelibs.jar: java.nio.file.FileSystemException: C:\Users\jenkins\workspace\Lucene-Solr-master-Windows\solr\build\solr-core\test\J1\temp\solr.pkg.TestPackages_CAB498B09CBB6E7F-001\tempDir-002\node1\filestore\mypkg\runtimelibs.jar: The process cannot access the file because it is being used by another process.
>
>    C:\Users\jenkins\workspace\Lucene-Solr-master-Windows\solr\build\solr-core\test\J1\temp\solr.pkg.TestPackages_CAB498B09CBB6E7F-001\tempDir-002\node1\filestore\mypkg\runtimelibs_v3.jar: java.nio.file.FileSystemException: C:\Users\jenkins\workspace\Lucene-Solr-master-Windows\solr\build\solr-core\test\J1\temp\solr.pkg.TestPackages_CAB498B09CBB6E7F-001\tempDir-002\node1\filestore\mypkg\runtimelibs_v3.jar: The process cannot access the file because it is being used by another process.
>
>    C:\Users\jenkins\workspace\Lucene-Solr-master-Windows\solr\build\solr-core\test\J1\temp\solr.pkg.TestPackages_CAB498B09CBB6E7F-001\tempDir-002\node1\filestore\mypkg\runtimelibs_v2.jar: java.nio.file.FileSystemException: C:\Users\jenkins\workspace\Lucene-Solr-master-Windows\solr\build\solr-core\test\J1\temp\solr.pkg.TestPackages_CAB498B09CBB6E7F-001\tempDir-002\node1\filestore\mypkg\runtimelibs_v2.jar: The process cannot access the file because it is being used by another process.
>
>    C:\Users\jenkins\workspace\Lucene-Solr-master-Windows\solr\build\solr-core\test\J1\temp\solr.pkg.TestPackages_CAB498B09CBB6E7F-001\tempDir-002\node1\filestore\mypkg: java.nio.file.DirectoryNotEmptyException: C:\Users\jenkins\workspace\Lucene-Solr-master-Windows\solr\build\solr-core\test\J1\temp\solr.pkg.TestPackages_CAB498B09CBB6E7F-001\tempDir-002\node1\filestore\mypkg
>    C:\Users\jenkins\workspace\Lucene-Solr-master-Windows\solr\build\solr-core\test\J1\temp\solr.pkg.TestPackages_CAB498B09CBB6E7F-001\tempDir-002\node1\filestore: java.nio.file.DirectoryNotEmptyException: C:\Users\jenkins\workspace\Lucene-Solr-master-Windows\solr\build\solr-core\test\J1\temp\solr.pkg.TestPackages_CAB498B09CBB6E7F-001\tempDir-002\node1\filestore
>    C:\Users\jenkins\workspace\Lucene-Solr-master-Windows\solr\build\solr-core\test\J1\temp\solr.pkg.TestPackages_CAB498B09CBB6E7F-001\tempDir-002\node1: java.nio.file.DirectoryNotEmptyException: C:\Users\jenkins\workspace\Lucene-Solr-master-Windows\solr\build\solr-core\test\J1\temp\solr.pkg.TestPackages_CAB498B09CBB6E7F-001\tempDir-002\node1
>    C:\Users\jenkins\workspace\Lucene-Solr-master-Windows\solr\build\solr-core\test\J1\temp\solr.pkg.TestPackages_CAB498B09CBB6E7F-001\tempDir-002\node2\filestore\mypkg\runtimelibs.jar: java.nio.file.FileSystemException: C:\Users\jenkins\workspace\Lucene-Solr-master-Windows\solr\build\solr-core\test\J1\temp\solr.pkg.TestPackages_CAB498B09CBB6E7F-001\tempDir-002\node2\filestore\mypkg\runtimelibs.jar: The process cannot access the file because it is being used by another process.
>
>    C:\Users\jenkins\workspace\Lucene-Solr-master-Windows\solr\build\solr-core\test\J1\temp\solr.pkg.TestPackages_CAB498B09CBB6E7F-001\tempDir-002\node2\filestore\mypkg\runtimelibs_v3.jar: java.nio.file.FileSystemException: C:\Users\jenkins\workspace\Lucene-Solr-master-Windows\solr\build\solr-core\test\J1\temp\solr.pkg.TestPackages_CAB498B09CBB6E7F-001\tempDir-002\node2\filestore\mypkg\runtimelibs_v3.jar: The process cannot access the file because it is being used by another process.
>
>    C:\Users\jenkins\workspace\Lucene-Solr-master-Windows\solr\build\solr-core\test\J1\temp\solr.pkg.TestPackages_CAB498B09CBB6E7F-001\tempDir-002\node2\filestore\mypkg\runtimelibs_v2.jar: java.nio.file.FileSystemException: C:\Users\jenkins\workspace\Lucene-Solr-master-Windows\solr\build\solr-core\test\J1\temp\solr.pkg.TestPackages_CAB498B09CBB6E7F-001\tempDir-002\node2\filestore\mypkg\runtimelibs_v2.jar: The process cannot access the file because it is being used by another process.
>
>    C:\Users\jenkins\workspace\Lucene-Solr-master-Windows\solr\build\solr-core\test\J1\temp\solr.pkg.TestPackages_CAB498B09CBB6E7F-001\tempDir-002\node2\filestore\mypkg: java.nio.file.DirectoryNotEmptyException: C:\Users\jenkins\workspace\Lucene-Solr-master-Windows\solr\build\solr-core\test\J1\temp\solr.pkg.TestPackages_CAB498B09CBB6E7F-001\tempDir-002\node2\filestore\mypkg
>    C:\Users\jenkins\workspace\Lucene-Solr-master-Windows\solr\build\solr-core\test\J1\temp\solr.pkg.TestPackages_CAB498B09CBB6E7F-001\tempDir-002\node2\filestore: java.nio.file.DirectoryNotEmptyException: C:\Users\jenkins\workspace\Lucene-Solr-master-Windows\solr\build\solr-core\test\J1\temp\solr.pkg.TestPackages_CAB498B09CBB6E7F-001\tempDir-002\node2\filestore
>    C:\Users\jenkins\workspace\Lucene-Solr-master-Windows\solr\build\solr-core\test\J1\temp\solr.pkg.TestPackages_CAB498B09CBB6E7F-001\tempDir-002\node2: java.nio.file.DirectoryNotEmptyException: C:\Users\jenkins\workspace\Lucene-Solr-master-Windows\solr\build\solr-core\test\J1\temp\solr.pkg.TestPackages_CAB498B09CBB6E7F-001\tempDir-002\node2
>    C:\Users\jenkins\workspace\Lucene-Solr-master-Windows\solr\build\solr-core\test\J1\temp\solr.pkg.TestPackages_CAB498B09CBB6E7F-001\tempDir-002\node4\filestore\mypkg\runtimelibs.jar: java.nio.file.FileSystemException: C:\Users\jenkins\workspace\Lucene-Solr-master-Windows\solr\build\solr-core\test\J1\temp\solr.pkg.TestPackages_CAB498B09CBB6E7F-001\tempDir-002\node4\filestore\mypkg\runtimelibs.jar: The process cannot access the file because it is being used by another process.
>
>    C:\Users\jenkins\workspace\Lucene-Solr-master-Windows\solr\build\solr-core\test\J1\temp\solr.pkg.TestPackages_CAB498B09CBB6E7F-001\tempDir-002\node4\filestore\mypkg\runtimelibs_v3.jar: java.nio.file.FileSystemException: C:\Users\jenkins\workspace\Lucene-Solr-master-Windows\solr\build\solr-core\test\J1\temp\solr.pkg.TestPackages_CAB498B09CBB6E7F-001\tempDir-002\node4\filestore\mypkg\runtimelibs_v3.jar: The process cannot access the file because it is being used by another process.
>
>    C:\Users\jenkins\workspace\Lucene-Solr-master-Windows\solr\build\solr-core\test\J1\temp\solr.pkg.TestPackages_CAB498B09CBB6E7F-001\tempDir-002\node4\filestore\mypkg\runtimelibs_v2.jar: java.nio.file.FileSystemException: C:\Users\jenkins\workspace\Lucene-Solr-master-Windows\solr\
>
> [...truncated too long message...]
>
> st\J0\temp\solr.pkg.TestPackages_CAB498B09CBB6E7F-003\tempDir-002\node2\filestore\mypkg\runtimelibs.jar: java.nio.file.FileSystemException: C:\Users\jenkins\workspace\Lucene-Solr-master-Windows\solr\build\solr-core\test\J0\temp\solr.pkg.TestPackages_CAB498B09CBB6E7F-003\tempDir-002\node2\filestore\mypkg\runtimelibs.jar: The process cannot access the file because it is being used by another process.
>    [junit4]    >    C:\Users\jenkins\workspace\Lucene-Solr-master-Windows\solr\build\solr-core\test\J0\temp\solr.pkg.TestPackages_CAB498B09CBB6E7F-003\tempDir-002\node2\filestore\mypkg\runtimelibs_v3.jar: java.nio.file.FileSystemException: C:\Users\jenkins\workspace\Lucene-Solr-master-Windows\solr\build\solr-core\test\J0\temp\solr.pkg.TestPackages_CAB498B09CBB6E7F-003\tempDir-002\node2\filestore\mypkg\runtimelibs_v3.jar: The process cannot access the file because it is being used by another process.
>    [junit4]    >    C:\Users\jenkins\workspace\Lucene-Solr-master-Windows\solr\build\solr-core\test\J0\temp\solr.pkg.TestPackages_CAB498B09CBB6E7F-003\tempDir-002\node2\filestore\mypkg\runtimelibs_v2.jar: java.nio.file.FileSystemException: C:\Users\jenkins\workspace\Lucene-Solr-master-Windows\solr\build\solr-core\test\J0\temp\solr.pkg.TestPackages_CAB498B09CBB6E7F-003\tempDir-002\node2\filestore\mypkg\runtimelibs_v2.jar: The process cannot access the file because it is being used by another process.
>    [junit4]    >    C:\Users\jenkins\workspace\Lucene-Solr-master-Windows\solr\build\solr-core\test\J0\temp\solr.pkg.TestPackages_CAB498B09CBB6E7F-003\tempDir-002\node2\filestore\mypkg: java.nio.file.DirectoryNotEmptyException: C:\Users\jenkins\workspace\Lucene-Solr-master-Windows\solr\build\solr-core\test\J0\temp\solr.pkg.TestPackages_CAB498B09CBB6E7F-003\tempDir-002\node2\filestore\mypkg
>    [junit4]    >    C:\Users\jenkins\workspace\Lucene-Solr-master-Windows\solr\build\solr-core\test\J0\temp\solr.pkg.TestPackages_CAB498B09CBB6E7F-003\tempDir-002\node2\filestore: java.nio.file.DirectoryNotEmptyException: C:\Users\jenkins\workspace\Lucene-Solr-master-Windows\solr\build\solr-core\test\J0\temp\solr.pkg.TestPackages_CAB498B09CBB6E7F-003\tempDir-002\node2\filestore
>    [junit4]    >    C:\Users\jenkins\workspace\Lucene-Solr-master-Windows\solr\build\solr-core\test\J0\temp\solr.pkg.TestPackages_CAB498B09CBB6E7F-003\tempDir-002\node2: java.nio.file.DirectoryNotEmptyException: C:\Users\jenkins\workspace\Lucene-Solr-master-Windows\solr\build\solr-core\test\J0\temp\solr.pkg.TestPackages_CAB498B09CBB6E7F-003\tempDir-002\node2
>    [junit4]    >    C:\Users\jenkins\workspace\Lucene-Solr-master-Windows\solr\build\solr-core\test\J0\temp\solr.pkg.TestPackages_CAB498B09CBB6E7F-003\tempDir-002\node4\filestore\mypkg\runtimelibs.jar: java.nio.file.FileSystemException: C:\Users\jenkins\workspace\Lucene-Solr-master-Windows\solr\build\solr-core\test\J0\temp\solr.pkg.TestPackages_CAB498B09CBB6E7F-003\tempDir-002\node4\filestore\mypkg\runtimelibs.jar: The process cannot access the file because it is being used by another process.
>    [junit4]    >    C:\Users\jenkins\workspace\Lucene-Solr-master-Windows\solr\build\solr-core\test\J0\temp\solr.pkg.TestPackages_CAB498B09CBB6E7F-003\tempDir-002\node4\filestore\mypkg\runtimelibs_v3.jar: java.nio.file.FileSystemException: C:\Users\jenkins\workspace\Lucene-Solr-master-Windows\solr\build\solr-core\test\J0\temp\solr.pkg.TestPackages_CAB498B09CBB6E7F-003\tempDir-002\node4\filestore\mypkg\runtimelibs_v3.jar: The process cannot access the file because it is being used by another process.
>    [junit4]    >    C:\Users\jenkins\workspace\Lucene-Solr-master-Windows\solr\build\solr-core\test\J0\temp\solr.pkg.TestPackages_CAB498B09CBB6E7F-003\tempDir-002\node4\filestore\mypkg\runtimelibs_v2.jar: java.nio.file.FileSystemException: C:\Users\jenkins\workspace\Lucene-Solr-master-Windows\solr\build\solr-core\test\J0\temp\solr.pkg.TestPackages_CAB498B09CBB6E7F-003\tempDir-002\node4\filestore\mypkg\runtimelibs_v2.jar: The process cannot access the file because it is being used by another process.
>    [junit4]    >    C:\Users\jenkins\workspace\Lucene-Solr-master-Windows\solr\build\solr-core\test\J0\temp\solr.pkg.TestPackages_CAB498B09CBB6E7F-003\tempDir-002\node4\filestore\mypkg: java.nio.file.DirectoryNotEmptyException: C:\Users\jenkins\workspace\Lucene-Solr-master-Windows\solr\build\solr-core\test\J0\temp\solr.pkg.TestPackages_CAB498B09CBB6E7F-003\tempDir-002\node4\filestore\mypkg
>    [junit4]    >    C:\Users\jenkins\workspace\Lucene-Solr-master-Windows\solr\build\solr-core\test\J0\temp\solr.pkg.TestPackages_CAB498B09CBB6E7F-003\tempDir-002\node4\filestore: java.nio.file.DirectoryNotEmptyException: C:\Users\jenkins\workspace\Lucene-Solr-master-Windows\solr\build\solr-core\test\J0\temp\solr.pkg.TestPackages_CAB498B09CBB6E7F-003\tempDir-002\node4\filestore
>    [junit4]    >    C:\Users\jenkins\workspace\Lucene-Solr-master-Windows\solr\build\solr-core\test\J0\temp\solr.pkg.TestPackages_CAB498B09CBB6E7F-003\tempDir-002\node4: java.nio.file.DirectoryNotEmptyException: C:\Users\jenkins\workspace\Lucene-Solr-master-Windows\solr\build\solr-core\test\J0\temp\solr.pkg.TestPackages_CAB498B09CBB6E7F-003\tempDir-002\node4
>    [junit4]    >    C:\Users\jenkins\workspace\Lucene-Solr-master-Windows\solr\build\solr-core\test\J0\temp\solr.pkg.TestPackages_CAB498B09CBB6E7F-003\tempDir-002: java.nio.file.DirectoryNotEmptyException: C:\Users\jenkins\workspace\Lucene-Solr-master-Windows\solr\build\solr-core\test\J0\temp\solr.pkg.TestPackages_CAB498B09CBB6E7F-003\tempDir-002
>    [junit4]    >    C:\Users\jenkins\workspace\Lucene-Solr-master-Windows\solr\build\solr-core\test\J0\temp\solr.pkg.TestPackages_CAB498B09CBB6E7F-003: java.nio.file.DirectoryNotEmptyException: C:\Users\jenkins\workspace\Lucene-Solr-master-Windows\solr\build\solr-core\test\J0\temp\solr.pkg.TestPackages_CAB498B09CBB6E7F-003
>    [junit4]    >        at __randomizedtesting.SeedInfo.seed([CAB498B09CBB6E7F]:0)
>    [junit4]    >        at org.apache.lucene.util.IOUtils.rm(IOUtils.java:319)
>    [junit4]    >        at java.base/java.lang.Thread.run(Thread.java:834)
>    [junit4] Completed [5/5 (5!)] on J0 in 33.14s, 2 tests, 1 error <<< FAILURES!
>    [junit4]
>    [junit4] JVM J0: stderr was not empty, see: C:\Users\jenkins\workspace\Lucene-Solr-master-Windows\solr\build\solr-core\test\temp\junit4-J0-20191031_195301_6267157088855785343500.syserr
>    [junit4] >>> JVM J0 emitted unexpected output (verbatim) ----
>    [junit4] OpenJDK 64-Bit Server VM warning: Option UseConcMarkSweepGC was deprecated in version 9.0 and will likely be removed in a future release.
>    [junit4] <<< JVM J0: EOF ----
>    [junit4]
>    [junit4] Tests with failures [seed: CAB498B09CBB6E7F]:
>    [junit4]   - org.apache.solr.pkg.TestPackages (suite)
>    [junit4]   - org.apache.solr.pkg.TestPackages (suite)
>    [junit4]   - org.apache.solr.pkg.TestPackages (suite)
>    [junit4]   - org.apache.solr.pkg.TestPackages (suite)
>    [junit4]   - org.apache.solr.pkg.TestPackages (suite)
>    [junit4]
>    [junit4]
>    [junit4] JVM J0:     1.11 ..   127.51 =   126.40s
>    [junit4] JVM J1:     1.14 ..    95.66 =    94.52s
>    [junit4] Execution time total: 2 minutes 7 seconds
>    [junit4] Tests summary: 5 suites, 10 tests, 5 suite-level errors
>
> BUILD FAILED
> C:\Users\jenkins\workspace\Lucene-Solr-master-Windows\lucene\common-build.xml:1510: The following error occurred while executing this line:
> C:\Users\jenkins\workspace\Lucene-Solr-master-Windows\lucene\common-build.xml:1037: There were test failures: 5 suites, 10 tests, 5 suite-level errors [seed: CAB498B09CBB6E7F]
>
> Total time: 2 minutes 10 seconds
>
> [repro] Setting last failure code to 1
>
> [repro] Failures:
> [repro]   5/5 failed: org.apache.solr.ltr.store.rest.TestModelManagerPersistence
> [repro]   5/5 failed: org.apache.solr.pkg.TestPackages
> [repro] Exiting with code 1
>
> C:\Users\jenkins\workspace\Lucene-Solr-master-Windows>IF EXIST lucene\build move /y lucene\build lucene\build.repro
>         1 dir(s) moved.
>
> C:\Users\jenkins\workspace\Lucene-Solr-master-Windows>IF EXIST solr\build move /y solr\build solr\build.repro
>         1 dir(s) moved.
>
> C:\Users\jenkins\workspace\Lucene-Solr-master-Windows>IF EXIST lucene\build.orig move /y lucene\build.orig lucene\build
>         1 dir(s) moved.
>
> C:\Users\jenkins\workspace\Lucene-Solr-master-Windows>IF EXIST solr\build.orig move /y solr\build.orig solr\build
>         1 dir(s) moved.
>
> C:\Users\jenkins\workspace\Lucene-Solr-master-Windows>exit 0
> Archiving artifacts
> Setting ANT_1_8_2_HOME=C:\Users\jenkins\tools\hudson.tasks.Ant_AntInstallation\ANT_1.8.2
> [WARNINGS] Parsing warnings in console log with parser Java Compiler (javac)
> Setting ANT_1_8_2_HOME=C:\Users\jenkins\tools\hudson.tasks.Ant_AntInstallation\ANT_1.8.2
> No credentials specified
> Setting ANT_1_8_2_HOME=C:\Users\jenkins\tools\hudson.tasks.Ant_AntInstallation\ANT_1.8.2
> <Git Blamer> Using GitBlamer to create author and commit information for all warnings.
> <Git Blamer> GIT_COMMIT=22b681755c00731bb30645c708d00555ac8f70e6, workspace=C:\Users\jenkins\workspace\Lucene-Solr-master-Windows
> [WARNINGS] Computing warning deltas based on reference build #8212
> Recording test results
> Setting ANT_1_8_2_HOME=C:\Users\jenkins\tools\hudson.tasks.Ant_AntInstallation\ANT_1.8.2
> Build step 'Publish JUnit test result report' changed build result to UNSTABLE
> Email was triggered for: Unstable (Test Failures)
> Sending email for trigger: Unstable (Test Failures)
> Setting ANT_1_8_2_HOME=C:\Users\jenkins\tools\hudson.tasks.Ant_AntInstallation\ANT_1.8.2
> Setting ANT_1_8_2_HOME=C:\Users\jenkins\tools\hudson.tasks.Ant_AntInstallation\ANT_1.8.2
> Setting ANT_1_8_2_HOME=C:\Users\jenkins\tools\hudson.tasks.Ant_AntInstallation\ANT_1.8.2
> Setting ANT_1_8_2_HOME=C:\Users\jenkins\tools\hudson.tasks.Ant_AntInstallation\ANT_1.8.2
> Setting ANT_1_8_2_HOME=C:\Users\jenkins\tools\hudson.tasks.Ant_AntInstallation\ANT_1.8.2
> Setting ANT_1_8_2_HOME=C:\Users\jenkins\tools\hudson.tasks.Ant_AntInstallation\ANT_1.8.2
>
> ---------------------------------------------------------------------
> To unsubscribe, e-mail: [hidden email]
> For additional commands, e-mail: [hidden email]



--
-----------------------------------------------------
Noble Paul

---------------------------------------------------------------------
To unsubscribe, e-mail: [hidden email]
For additional commands, e-mail: [hidden email]