Solr-3.x - Build # 149 - Failure

classic Classic list List threaded Threaded
6 messages Options
Reply | Threaded
Open this post in threaded view
|

Solr-3.x - Build # 149 - Failure

Apache Jenkins Server
Build: http://hudson.zones.apache.org/hudson/job/Solr-3.x/149/

All tests passed

Build Log (for compile errors):
[...truncated 16496 lines...]



---------------------------------------------------------------------
To unsubscribe, e-mail: [hidden email]
For additional commands, e-mail: [hidden email]

Reply | Threaded
Open this post in threaded view
|

Solr-3.x - Build # 150 - Still Failing

Apache Jenkins Server
Build: http://hudson.zones.apache.org/hudson/job/Solr-3.x/150/

1 tests failed.
REGRESSION:  org.apache.solr.client.solrj.embedded.SolrExampleStreamingTest.testCommitWithin

Error Message:
expected:<0> but was:<1>

Stack Trace:
junit.framework.AssertionFailedError: expected:<0> but was:<1>
        at org.apache.solr.client.solrj.SolrExampleTests.testCommitWithin(SolrExampleTests.java:241)
        at org.apache.lucene.util.LuceneTestCase$LuceneTestCaseRunner.runChild(LuceneTestCase.java:779)
        at org.apache.lucene.util.LuceneTestCase$LuceneTestCaseRunner.runChild(LuceneTestCase.java:745)




Build Log (for compile errors):
[...truncated 15442 lines...]



---------------------------------------------------------------------
To unsubscribe, e-mail: [hidden email]
For additional commands, e-mail: [hidden email]

Reply | Threaded
Open this post in threaded view
|

Solr-3.x - Build # 151 - Still Failing

Apache Jenkins Server
Build: http://hudson.zones.apache.org/hudson/job/Solr-3.x/151/

All tests passed

Build Log (for compile errors):
[...truncated 16502 lines...]



---------------------------------------------------------------------
To unsubscribe, e-mail: [hidden email]
For additional commands, e-mail: [hidden email]

Reply | Threaded
Open this post in threaded view
|

Solr-3.x - Build # 152 - Still Failing

Apache Jenkins Server
Build: http://hudson.zones.apache.org/hudson/job/Solr-3.x/152/

All tests passed

Build Log (for compile errors):
[...truncated 16500 lines...]



---------------------------------------------------------------------
To unsubscribe, e-mail: [hidden email]
For additional commands, e-mail: [hidden email]

Reply | Threaded
Open this post in threaded view
|

Solr-3.x - Build # 153 - Still Failing

Apache Jenkins Server
Build: http://hudson.zones.apache.org/hudson/job/Solr-3.x/153/

All tests passed

Build Log (for compile errors):
[...truncated 16501 lines...]



---------------------------------------------------------------------
To unsubscribe, e-mail: [hidden email]
For additional commands, e-mail: [hidden email]

Reply | Threaded
Open this post in threaded view
|

Solr-3.x - Build # 154 - Still Failing

Apache Jenkins Server
Build: http://hudson.zones.apache.org/hudson/job/Solr-3.x/154/

1 tests failed.
REGRESSION:  org.apache.solr.client.solrj.TestLBHttpSolrServer.testReliability

Error Message:
No live SolrServers available to handle this request

Stack Trace:
org.apache.solr.client.solrj.SolrServerException: No live SolrServers available to handle this request
        at org.apache.solr.client.solrj.impl.LBHttpSolrServer.request(LBHttpSolrServer.java:220)
        at org.apache.solr.client.solrj.request.QueryRequest.process(QueryRequest.java:89)
        at org.apache.solr.client.solrj.SolrServer.query(SolrServer.java:118)
        at org.apache.solr.client.solrj.TestLBHttpSolrServer.waitForServer(TestLBHttpSolrServer.java:188)
        at org.apache.solr.client.solrj.TestLBHttpSolrServer.testReliability(TestLBHttpSolrServer.java:181)
        at org.apache.lucene.util.LuceneTestCase$LuceneTestCaseRunner.runChild(LuceneTestCase.java:779)
        at org.apache.lucene.util.LuceneTestCase$LuceneTestCaseRunner.runChild(LuceneTestCase.java:745)
Caused by: org.apache.solr.client.solrj.SolrServerException: java.net.SocketTimeoutException: Read timed out
        at org.apache.solr.client.solrj.impl.CommonsHttpSolrServer.request(CommonsHttpSolrServer.java:483)
        at org.apache.solr.client.solrj.impl.CommonsHttpSolrServer.request(CommonsHttpSolrServer.java:244)
        at org.apache.solr.client.solrj.impl.LBHttpSolrServer.request(LBHttpSolrServer.java:204)
Caused by: java.net.SocketTimeoutException: Read timed out
        at java.net.SocketInputStream.socketRead0(Native Method)
        at java.net.SocketInputStream.read(SocketInputStream.java:146)
        at java.io.BufferedInputStream.fill(BufferedInputStream.java:235)
        at java.io.BufferedInputStream.read(BufferedInputStream.java:254)
        at org.apache.commons.httpclient.HttpParser.readRawLine(HttpParser.java:78)
        at org.apache.commons.httpclient.HttpParser.readLine(HttpParser.java:106)
        at org.apache.commons.httpclient.HttpConnection.readLine(HttpConnection.java:1116)
        at org.apache.commons.httpclient.MultiThreadedHttpConnectionManager$HttpConnectionAdapter.readLine(MultiThreadedHttpConnectionManager.java:1413)
        at org.apache.commons.httpclient.HttpMethodBase.readStatusLine(HttpMethodBase.java:1973)
        at org.apache.commons.httpclient.HttpMethodBase.readResponse(HttpMethodBase.java:1735)
        at org.apache.commons.httpclient.HttpMethodBase.execute(HttpMethodBase.java:1098)
        at org.apache.commons.httpclient.HttpMethodDirector.executeWithRetry(HttpMethodDirector.java:398)
        at org.apache.commons.httpclient.HttpMethodDirector.executeMethod(HttpMethodDirector.java:171)
        at org.apache.commons.httpclient.HttpClient.executeMethod(HttpClient.java:397)
        at org.apache.commons.httpclient.HttpClient.executeMethod(HttpClient.java:323)
        at org.apache.solr.client.solrj.impl.CommonsHttpSolrServer.request(CommonsHttpSolrServer.java:427)




Build Log (for compile errors):
[...truncated 15454 lines...]



---------------------------------------------------------------------
To unsubscribe, e-mail: [hidden email]
For additional commands, e-mail: [hidden email]