[jira] [Updated] (SOLR-13577) TestReplicationHandler.doTestIndexFetchOnMasterRestart failures

classic Classic list List threaded Threaded
1 message Options
Reply | Threaded
Open this post in threaded view
|

[jira] [Updated] (SOLR-13577) TestReplicationHandler.doTestIndexFetchOnMasterRestart failures

Michael Gibney (Jira)

     [ https://issues.apache.org/jira/browse/SOLR-13577?page=com.atlassian.jira.plugin.system.issuetabpanels:all-tabpanel ]

Mikhail Khludnev updated SOLR-13577:
------------------------------------
    Description:
It's seems like clear test failures. Failed 6 times in a row at lines 682, 684
{quote}
org.apache.solr.handler.TestReplicationHandler.doTestIndexFetchOnMasterRestart

Failing for the past 1 build (Since Failed#8011 )
Took 6 sec.
Error Message
null
Stacktrace
java.lang.NumberFormatException: null
        at __randomizedtesting.SeedInfo.seed([6AB4ECC957E5CCA2:B243282DFC3E0EFE]:0)
        at java.base/java.lang.Integer.parseInt(Integer.java:614)
        at java.base/java.lang.Integer.parseInt(Integer.java:770)
        at org.apache.solr.handler.TestReplicationHandler.doTestIndexFetchOnMasterRestart(TestReplicationHandler.java:682)

org.apache.solr.handler.TestReplicationHandler.doTestIndexFetchOnMasterRestart

Failing for the past 3 builds (Since Failed#8011 )
Took 7.5 sec.
Stacktrace
java.lang.AssertionError
        at __randomizedtesting.SeedInfo.seed([E88092B4017D2D3D:30775650AAA6EF61]:0)
        at org.junit.Assert.fail(Assert.java:86)
        at org.junit.Assert.assertTrue(Assert.java:41)
        at org.junit.Assert.assertTrue(Assert.java:52)
        at org.apache.solr.handler.TestReplicationHandler.doTestIndexFetchOnMasterRestart(TestReplicationHandler.java:684)
{quote}

 !screenshot-1.png!


  was:
It's seems like clear test failures. Failed 6 times in a row at lines 682, 684
{quote}
org.apache.solr.handler.TestReplicationHandler.doTestIndexFetchOnMasterRestart

Failing for the past 1 build (Since Failed#8011 )
Took 6 sec.
Error Message
null
Stacktrace
java.lang.NumberFormatException: null
        at __randomizedtesting.SeedInfo.seed([6AB4ECC957E5CCA2:B243282DFC3E0EFE]:0)
        at java.base/java.lang.Integer.parseInt(Integer.java:614)
        at java.base/java.lang.Integer.parseInt(Integer.java:770)
        at org.apache.solr.handler.TestReplicationHandler.doTestIndexFetchOnMasterRestart(TestReplicationHandler.java:682)

org.apache.solr.handler.TestReplicationHandler.doTestIndexFetchOnMasterRestart

Failing for the past 3 builds (Since Failed#8011 )
Took 7.5 sec.
Stacktrace
java.lang.AssertionError
        at __randomizedtesting.SeedInfo.seed([E88092B4017D2D3D:30775650AAA6EF61]:0)
        at org.junit.Assert.fail(Assert.java:86)
        at org.junit.Assert.assertTrue(Assert.java:41)
        at org.junit.Assert.assertTrue(Assert.java:52)
        at org.apache.solr.handler.TestReplicationHandler.doTestIndexFetchOnMasterRestart(TestReplicationHandler.java:684)
{quote}



> TestReplicationHandler.doTestIndexFetchOnMasterRestart failures
> ---------------------------------------------------------------
>
>                 Key: SOLR-13577
>                 URL: https://issues.apache.org/jira/browse/SOLR-13577
>             Project: Solr
>          Issue Type: Test
>      Security Level: Public(Default Security Level. Issues are Public)
>            Reporter: Mikhail Khludnev
>            Priority: Major
>         Attachments: screenshot-1.png
>
>
> It's seems like clear test failures. Failed 6 times in a row at lines 682, 684
> {quote}
> org.apache.solr.handler.TestReplicationHandler.doTestIndexFetchOnMasterRestart
> Failing for the past 1 build (Since Failed#8011 )
> Took 6 sec.
> Error Message
> null
> Stacktrace
> java.lang.NumberFormatException: null
> at __randomizedtesting.SeedInfo.seed([6AB4ECC957E5CCA2:B243282DFC3E0EFE]:0)
> at java.base/java.lang.Integer.parseInt(Integer.java:614)
> at java.base/java.lang.Integer.parseInt(Integer.java:770)
> at org.apache.solr.handler.TestReplicationHandler.doTestIndexFetchOnMasterRestart(TestReplicationHandler.java:682)
> org.apache.solr.handler.TestReplicationHandler.doTestIndexFetchOnMasterRestart
> Failing for the past 3 builds (Since Failed#8011 )
> Took 7.5 sec.
> Stacktrace
> java.lang.AssertionError
> at __randomizedtesting.SeedInfo.seed([E88092B4017D2D3D:30775650AAA6EF61]:0)
> at org.junit.Assert.fail(Assert.java:86)
> at org.junit.Assert.assertTrue(Assert.java:41)
> at org.junit.Assert.assertTrue(Assert.java:52)
> at org.apache.solr.handler.TestReplicationHandler.doTestIndexFetchOnMasterRestart(TestReplicationHandler.java:684)
> {quote}
>  !screenshot-1.png!



--
This message was sent by Atlassian JIRA
(v7.6.3#76005)

---------------------------------------------------------------------
To unsubscribe, e-mail: [hidden email]
For additional commands, e-mail: [hidden email]